{"text_format":"1","workbook":"xlsx","n_sheets":15,"sheets":["Examples","WK0 - Input data","Journal","Instructions","Export","WK1 - Identification","WK2 - Notional General Income","WK3 - Notional GI Yr1 YIELD","WK4 - PGI summary","WK5a - Impact on Rates","WK5b - Impact on Rates","WK6 - Expenditure Program","WK7 - Historical financials","WK8 - Long Term Financial Plan","WK9 - Ratios"],"not_rendered":{"charts":15,"images":3,"macros":1,"external_links":0,"defined_names":24,"comments":4,"pivot_tables":0},"unopened":[],"bounds":{"document_bytes":16777216,"sheet_cells":100000,"rows_first":2000,"rows_last":500,"rows_between":2000,"halvings":0,"cell_chars":16384,"cell_head_chars":4096},"cells_cut":0,"cells_raw":0,"read":"whole","date_system":"1900"}

{"sheet":"Examples","index":0,"n_rows":42,"n_cols":27,"rows_kept":42,"cut":false,"hidden":true,"merged":[]}
[]
[null,"IPART colour codes for models, spreadsheets and information requests"]
[null,"NB  ALWAYS DESCRIBE THE COLOUR CODE USED IN YOUR MODEL "]
[null,"Note: If you use the formats for the inputs provided in this template, input cells will always be unprotected even when you protect the worksheet"]
[null,null,null,null,null,null,null,"use this column cell to \"paint\" input cells for numbers (NOT for percentages)"]
[null,null,null,null,null,null,null,null,"use this column cell to \"paint\" input cells for percentages (NOT numbers)"]
[null,"Models and spreadsheets"]
[null,null,null,null,null,null,"numbers","%"]
[null,"Inputs",null,null,null,null,4232,0.08]
[null,"Inputs with default values, default values are shown in italics next to or below ",null,null,null,null,34345,0.08]
[null,"Hard-coded values used that should not be changed, eg credit ratings or '1' at the start of an index series."]
[null,"Key outputs"]
[null,"Links from other files (green)"]
[null,"Error check (check =0)"]
[null,"Error warnings, messages and unusual calculation assumptions"]
[null,"Indicate change in formula across row with a double red line"]
[null,"Note:  You can combine options for inputs, eg:",null,null,"Inputs can be links to other files "]
[null,null,null,null,"You can drawn attention to unusual inputs "]
[]
[null,null,null,null,null,null,null,"use this column cell to \"paint\" input cells for numbers (NOT for percentages)"]
[null,"Information Requests",null,null,null,null,null,null,"use this column cell to \"paint\" input cells for percentages (NOT numbers)"]
[null,null,null,null,null,null,"numbers","%"]
[null,"Inputs for historical years (actual values)",null,null,null,null,234,0.24]
[null,"Forecast inputs",null,null,null,null,6667,0.05]
[null,"Error warnings and messages"]
[null,"Error check (check =0)"]
[]
[null,"QA notes - annotation or documenation by QA staff"]
[]
[]
["User Instructions - IPART CHARTS"]
[]
[null,"Blue","Mid Grey","Pale Blue","Green","Charcoal","Orange","Purple","Pink",null,null,"Blue","Mid Grey","Pale Blue","Green","Charcoal","Orange",null,"X value","1st Y value","2nd Y value",null,null,"Black","Red 100%","Red 70%","Grey 40%"]
["1975-76",36.19,36.880000000000003,21.56,5.36,3.01,10,3.01,10,null,"1975-76",33.19,36.880000000000003,21.56,5.36,3.01,10,null,1.8,10,17,null,"1975-76",33.19,36.880000000000003,21.56,5.36]
["1983-84",39.39,32.020000000000003,21.6,7.01,3.36,12,3.36,12,null,"1983-84",39.39,32.020000000000003,21.6,7.01,3.36,12,null,2.2999999999999998,12,9,null,"1983-84",39.39,32.020000000000003,21.6,7.01]
["1988-89",42.78,29.91,18.350000000000001,6.33,2.63,14,2.63,14,null,"1988-89",42.78,29.91,18.350000000000001,6.33,2.63,14,null,3.7,16,14,null,"1988-89",42.78,29.91,18.350000000000001,6.33]
["1993-94",42.13,26.53,21.6,7.01,2.72,16,2.72,16,null,"1993-94",42.13,26.53,21.6,7.01,2.72,16,null,4.0999999999999996,8,23,null,"1993-94",42.13,26.53,21.6,7.01]
["1996-97",41.69,24.76,23.98,7,2.57,18,2.57,18,null,"1996-97",41.69,24.76,23.98,7,2.57,18,null,5.5,14,27,null,"1996-97",41.69,24.76,23.98,7]
["1997-98",39.39,32.020000000000003,21.6,7.01,3.36,12,3.36,12,null,"1997-98",39.39,32.020000000000003,21.6,7.01,3.36,12,null,null,null,null,null,"1997-98",39.39,32.020000000000003,21.6,7.01]
["1998-99",42.13,26.53,21.6,7.01,2.72,16,2.72,16,null,"1998-99",42.13,26.53,21.6,7.01,2.72,16,null,null,null,null,null,"1998-99",42.13,26.53,21.6,7.01]
["1999-00",45,22,26,8,2,20,2,20,null,"1999-00",45,22,26,8,2,20,null,null,null,null,null,"1999-00",45,22,26,8]
["–  en rule for when needed"]

{"sheet":"WK0 - Input data","index":1,"n_rows":270,"n_cols":16,"rows_kept":270,"cut":false,"hidden":true,"merged":[]}
[]
[null,"This worksheet is for IPART Analyst use only. "]
[]
[]
[null,"Instructions:"]
[null,{"$f":"\"1. Enter the required information in the blue input cells in Section \"&B23","v":"1. Enter the required information in the blue input cells in Section 1. Inputs"}]
[null,{"$f":"\"2. Check the list of council names and update if necessary in Section \"&B67","v":"2. Check the list of council names and update if necessary in Section 2. Council Name"}]
[]
[]
[null,"Contents",null,null,null,null,null,null,null,"row"]
[null,{"$f":"B23","v":"1. Inputs"},null,null,null,null,null,null,null,{"$f":"ROW(B23)","v":23}]
[null,{"$f":"B26","v":"Table 1 - Analyst and TSO details"},null,null,null,null,null,null,null,{"$f":"ROW(B26)","v":26}]
[null,{"$f":"B42","v":"Table 2 - SV year and rate peg"},null,null,null,null,null,null,null,{"$f":"ROW(B42)","v":42}]
[null,{"$f":"B52","v":"Table 3 - SV year, rate peg  and units in display format "},null,null,null,null,null,null,null,{"$f":"ROW(B52)","v":52}]
[null,{"$f":"B67","v":"2. Council Name"},null,null,null,null,null,null,null,{"$f":"ROW(B67)","v":67}]
[null,{"$f":"B225","v":"3. Lists for expiring special variations and other questions"},null,null,null,null,null,null,null,{"$f":"ROW(B225)","v":225}]
[null,{"$f":"B227","v":"2. Is the council applying for a one-year increase (s508(2)) or a multi-year increase (s508A)?"},null,null,null,null,null,null,null,{"$f":"ROW(B227)","v":227}]
[null,{"$f":"B231","v":"3. For s508A applications: for how many years is the council requesting % increases as part of this application?"},null,null,null,null,null,null,null,{"$f":"ROW(B231)","v":231}]
[null,{"$f":"B242","v":"4. For s508A & s508(2) applications: is the special variation permanent or temporary?   "},null,null,null,null,null,null,null,{"$f":"ROW(B242)","v":242}]
[null,{"$f":"B250","v":"6. Does the council have an expiring variation? If yes, please specify when."},null,null,null,null,null,null,null,{"$f":"ROW(B250)","v":250}]
[]
[]
[null,"1. Inputs","Enter the required information in the blue input cells"]
[]
[]
[null,"Table 1 - Analyst and TSO details"]
[]
[null,"Who is the Analyst in charge?"]
[null,"First Name",null,"Scott"]
[null,"Last Name",null,"Chapman"]
[null,"Email",null,"scott_chapman@ipart.nsw.gov.au"]
[null,"Phone",null,"(02) 9290 8449"]
[]
[null,"Who is the TSO supporting the Analyst?"]
[null,"First Name",null,"Arsh"]
[null,"Last Name",null,"Suri"]
[null,"Email",null,"arsh_suri@ipart.nsw.gov.au"]
[null,"Phone",null,"(02) 9113 7730"]
[]
[]
[]
[null,"Table 2 - SV year and rate peg"]
[]
[null,"SV for period commencing 1 July","year",2019]
[null,"Financial year",null,{"$f":"D44&\"-\"&RIGHT(D44+1,2)","v":"2019-20"}]
[null,"Rate pegs"]
[null,"Rate peg for Year 1","%",2.7E-2]
[null,"Rate peg for Year 2 - 7","%",2.5000000000000001E-2]
[]
[]
[]
[null,"Table 3 - SV year, rate peg  and units in display format "]
[null,"Years "]
[null,"Year number",{"$f":"D54+1","v":3},2,{"$f":"F54+1","v":1},0,{"$f":"F54+1","v":1},2,3,4,5,6,7,8,9,10]
[null,"Year name",{"$f":"\"Hist yr \"&C54","v":"Hist yr 3"},"Hist yr 2",{"$f":"\"Hist yr \"&E54","v":"Hist yr 1"},{"$f":"\"Year \"&F54","v":"Year 0"},{"$f":"\"Year \"&G54","v":"Year 1"},"Year 2","Year 3","Year 4","Year 5","Year 6","Year 7","Year 8","Year 9","Year 10"]
[]
[null,"Year commencing 1 July",{"$f":"D57-1","v":2015},{"$f":"E57-1","v":2016},{"$f":"F57-1","v":2017},{"$f":"D44-1","v":2018},{"$f":"D44","v":2019},{"$f":"G57+1","v":2020},2021,2022,2023,2024,2025,2026,2027,2028]
[null,"Financial year",{"$f":"C57&\"-\"&RIGHT(C57+1,2)","v":"2015-16"},{"$f":"D57&\"-\"&RIGHT(D57+1,2)","v":"2016-17"},"2017-18","2018-19","2019-20","2020-21","2021-22","2022-23","2023-24","2024-25","2025-26","2026-27","2027-28","2028-29"]
[]
[null,"Rate peg",null,null,null,null,{"$f":"$D$47","v":2.7E-2},{"$f":"$D$48","v":2.5000000000000001E-2},2.5000000000000001E-2,2.5000000000000001E-2,2.5000000000000001E-2,2.5000000000000001E-2,2.5000000000000001E-2,2.5000000000000001E-2,2.5000000000000001E-2,2.5000000000000001E-2]
[]
[null,"Units for labels","$ nominal"]
[null,null,{"$f":"C62&\" per year\"","v":"$ nominal per year"}]
[]
[]
[]
[null,"2. Council Name","Check and update the list as necessary "]
[null,1,"Albury City Council"]
[null,{"$f":"B68+1","v":2},"Armidale Dumaresq Council"]
[null,3,"Ballina Shire Council"]
[null,4,"Balranald Shire Council"]
[null,5,"Bathurst Regional Council"]
[null,6,"Bayside Council"]
[null,7,"Bega Valley Shire Council"]
[null,8,"Bellingen Shire Council"]
[null,9,"Berrigan Shire Council"]
[null,10,"Blacktown City Council"]
[null,11,"Bland Shire Council"]
[null,12,"Blayney Shire Council"]
[null,13,"Blue Mountains City Council"]
[null,14,"Bogan Shire Council"]
[null,15,"Bourke Shire Council"]
[null,16,"Brewarrina Shire Council"]
[null,17,"Broken Hill City Council"]
[null,18,"Burwood Council"]
[null,19,"Byron Shire Council"]
[null,20,"Cabonne Council"]
[null,21,"Camden Council"]
[null,22,"Campbelltown City Council"]
[null,23,"Canterbury-Bankstown Council"]
[null,24,"Carrathool Shire Council"]
[null,25,"Central Coast Council"]
[null,26,"Central Darling Shire Council"]
[null,27,"Cessnock City Council"]
[null,28,"City of Canada Bay Council"]
[null,29,"City of Parramatta Council"]
[null,30,"City of Ryde Council"]
[null,31,"City of Sydney Council"]
[null,32,"Clarence Valley Council"]
[null,33,"Cobar Shire Council"]
[null,{"$f":"B100+1","v":34},"Coffs Harbour City Council"]
[null,35,"Coolamon Shire Council"]
[null,36,"Coonamble Shire Council"]
[null,37,"Cootamundra-Gundagai Council"]
[null,38,"Corowa Shire Council"]
[null,39,"Cowra Shire Council"]
[null,40,"Cumberland Council"]
[null,41,"Dubbo Regional Council"]
[null,42,"Dungog Shire Council"]
[null,43,"Edward River Council"]
[null,44,"Eurobodalla Shire Council"]
[null,45,"Fairfield City Council"]
[null,46,"Federation Council"]
[null,47,"Forbes Shire Council"]
[null,48,"Georges River Council"]
[null,49,"Gilgandra Shire Council"]
[null,50,"Glen Innes Severn Shire Council"]
[null,51,"Goulburn Mulwaree Council"]
[null,52,"Greater Hume Shire Council"]
[null,53,"Griffith City Council"]
[null,54,"Gunnedah Shire Council"]
[null,55,"Gwydir Shire Council"]
[null,56,"Hawkesbury City Council"]
[null,57,"Hay Shire Council"]
[null,58,"Hills Shire Council, The"]
[null,59,"Hilltops Council"]
[null,60,"Holroyd City Council"]
[null,61,"Hornsby, The Council of the Shire of"]
[null,62,"Hunters Hill, The Council of the Municipality of"]
[null,63,"Inner West Council"]
[null,64,"Inverell Shire Council"]
[null,65,"Junee Shire Council"]
[null,{"$f":"B132+1","v":66},"Kempsey Shire Council"]
[null,67,"Kiama, The Council of the Municipality of"]
[null,68,"Ku-ring-gai Municipal Council"]
[null,69,"Kyogle Council"]
[null,70,"Lachlan Shire Council"]
[null,71,"Lake Macquarie City Council"]
[null,72,"Lane Cove Council"]
[null,73,"Leeton Shire Council"]
[null,74,"Lismore City Council"]
[null,75,"Lithgow Council, City of"]
[null,76,"Liverpool City Council"]
[null,77,"Liverpool Plains Shire Council"]
[null,78,"Lockhart Shire Council"]
[null,79,"Maitland City Council"]
[null,80,"MidCoast Council"]
[null,81,"Mid-Western Regional Council"]
[null,82,"Moree Plains Shire Council"]
[null,83,"Mosman Municipal Council"]
[null,84,"Murray River Council"]
[null,85,"Murrumbidgee Shire Council"]
[null,86,"Muswellbrook Shire Council"]
[null,87,"Nambucca Shire Council"]
[null,88,"Narrabri Shire Council"]
[null,89,"Narrandera Shire Council"]
[null,90,"Narromine Shire Council"]
[null,91,"Newcastle City Council"]
[null,92,"Northern Beaches Council"]
[null,93,"North Sydney Council"]
[null,94,"Oberon Council"]
[null,95,"Orange City Council"]
[null,96,"Parkes Shire Council"]
[null,97,"Penrith City Council"]
[null,{"$f":"B164+1","v":98},"Pittwater Council"]
[null,99,"Port Macquarie-Hastings Council"]
[null,100,"Port Stephens Council"]
[null,101,"Queanbeyan-Palerang Regional Council"]
[null,102,"Randwick City Council"]
[null,103,"Richmond Valley Council"]
[null,104,"Rockdale City Council"]
[null,105,"Ryde City Council"]
[null,106,"Shellharbour City Council"]
[null,107,"Shoalhaven City Council"]
[null,108,"Singleton Shire Council"]
[null,109,"Snowy Monaro Regional Council"]
[null,110,"Snowy Valleys Council"]
[null,111,"Strathfield Municipal Council"]
[null,112,"Sutherland Shire Council"]
[null,113,"Tamworth Regional Council"]
[null,114,"Temora Shire Council"]
[null,115,"Tenterfield Shire Council"]
[null,116,"Tweed Shire Council"]
[null,117,"Upper Hunter Shire Council"]
[null,118,"Upper Lachlan Shire Council"]
[null,119,"Uralla Shire Council"]
[null,120,"Wagga Wagga City Council"]
[null,121,"Walcha Council"]
[null,122,"Walgett Shire Council"]
[null,123,"Warren Shire Council"]
[null,124,"Warrumbungle Shire Council"]
[null,125,"Waverley Council"]
[null,126,"Weddin Shire Council"]
[null,127,"Wellington Council"]
[null,128,"Wentworth Shire Council"]
[null,129,"Willoughby City Council"]
[null,{"$f":"B196+1","v":130},"Wingecarribee Shire Council"]
[null,131,"Wollondilly Shire Council"]
[null,132,"Wollongong City Council"]
[null,133,"Woollahra Municipal Council"]
[null,134,"Yass Valley Council"]
[null,135]
[null,136]
[null,137]
[null,138]
[null,139]
[null,140]
[null,141]
[null,142]
[null,143]
[null,144]
[null,145]
[null,146]
[null,147]
[null,148]
[null,149]
[null,150]
[null,151]
[null,152]
[null,153]
[null,154]
[null,155,null,null,null,"add rows above this one if you need more"]
[]
[]
[null,"3. Lists for expiring special variations and other questions"]
[]
[null,{"$f":"'WK1 - Identification'!C28","v":"2. Is the council applying for a one-year increase (s508(2)) or a multi-year increase (s508A)?"}]
[null,"s508(2)"]
[null,"s508A"]
[]
[null,{"$f":"'WK1 - Identification'!C29","v":"3. For s508A applications: for how many years is the council requesting % increases as part of this application?"}]
[null,null,"Text inputs:","Yr","List:"]
[null,null," years"]
[null,null,null,null,"na"]
[null,null,null,{"$f":"TRANSPOSE(H54:M54)","v":2},{"$f":"D235&$C$233","v":"2 years"}]
[null,null,null,3,"3 years"]
[null,null,null,4,"4 years"]
[null,null,null,5,"5 years"]
[null,null,null,6,"6 years"]
[null,null,null,7,"7 years"]
[]
[null,{"$f":"'WK1 - Identification'!C30","v":"4. For s508A & s508(2) applications: is the special variation permanent or temporary?   "}]
[null,"Permanent"]
[null,"Temporary"]
[]
[null,{"$f":"'WK1 - Identification'!C24","v":"1. Does the council have any existing SV(s) that means it has an increase above the rate peg for any year from 2019-20 (Year 1) onwards?"}]
[null,"yes"]
[null,"no"]
[]
[null,{"$f":"'WK1 - Identification'!C35","v":"6. Does the council have an expiring variation? If yes, please specify when."}]
[]
[null,null,"Text inputs:","Yr","List:",null,null,{"$f":"D252","v":"Yr"}]
[null,null,"Yes - 30 June ",null,{"$f":"'WK1 - Identification'!$I$38","v":"1st Expiring SV"},null,null,{"$f":"'WK1 - Identification'!$I$39","v":"2nd Expiring SV"}]
[null,null,"& 30 June "]
[null,null," expiry"]
[null,null,null,null,"na",null,null,"na"]
[null,null,{"$f":"TRANSPOSE($G$57:$P$57)","v":2019},null,{"$f":"$C$253&C257&$C$255","v":"Yes - 30 June 2019 expiry"},null,null,{"$f":"$C$254&C257&$C$255","v":"& 30 June 2019 expiry"}]
[null,null,2020,null,{"$f":"$C$253&C258&$C$255","v":"Yes - 30 June 2020 expiry"},null,null,{"$f":"$C$254&C258&$C$255","v":"& 30 June 2020 expiry"}]
[null,null,2021,null,"Yes - 30 June 2021 expiry",null,null,"& 30 June 2021 expiry"]
[null,null,2022,null,"Yes - 30 June 2022 expiry",null,null,"& 30 June 2022 expiry"]
[null,null,2023,null,"Yes - 30 June 2023 expiry",null,null,"& 30 June 2023 expiry"]
[null,null,2024,null,"Yes - 30 June 2024 expiry",null,null,"& 30 June 2024 expiry"]
[null,null,2025,null,"Yes - 30 June 2025 expiry",null,null,"& 30 June 2025 expiry"]
[null,null,2026,null,"Yes - 30 June 2026 expiry",null,null,"& 30 June 2026 expiry"]
[]
[]
[]
[null,{"$f":"'WK5b - Impact on Rates'!E19","v":"Has the council had a general land revaluation in Year 0?  "}]
[null,"Yes"]
[null,"No"]

{"sheet":"Journal","index":2,"n_rows":16,"n_cols":6,"rows_kept":16,"cut":false,"hidden":false,"merged":[]}
[]
[null,"Journal of changes made to Application form Part A - Special Variation 2019-20"]
[]
[null,"Changes since 22 November 2018"]
[]
[null,"Description of changes:","Worksheet:","Made by:","Date","Notes"]
[null,"CORRECTIONS"]
[null,"Corrected formula for 'Total Notional General Income' ","WK3 - Notional GI Yr1 YIELD'!M161","Scott","2018-11-30","Formula now includes Ordinary rates, Special rates and Annual charges"]
[null,"Corrected column headings (years) from column S","WK5a - Impact on Rates'!S23 &","Bee","2018-12-02","Headings now correctly refer to Year 1 to Year 7"]
[null,null,"WK5b - Impact on Rates'!R24"]
[null,"Corrected cell references for Scenario 3 (income - 'additional items')","WK8 - Long Term Financial Plan'!F117:P118","Bee","2018-12-02","Corrects Scenario 3 income, operating results and operating performance ratio."]
[]
[null,"COSMETIC CHANGES"]
[null,"Enter valuation objection as a positive whole number on WK3, consistent with WK1. Changed formula for net total and instructions accordingly","WK3 - Notional GI Yr1 YIELD'!M164 and M166","Bee","2018-12-02","Previously entered as a negative number"]
[null,"Terminology changed for some historical information ","WK7 - Historical financials'!C42:C45","Bee","2018-12-02","Made more consistent with  long term financial plan terminology"]
[null,"Minor formatting and wording improvements","various","Bee","2018-12-02"]

{"sheet":"Instructions","index":3,"n_rows":243,"n_cols":17,"rows_kept":243,"cut":false,"hidden":false,"merged":[]}
[]
[]
[]
[]
[]
[null,null,null,null,null,null,null,"  THE INDEPENDENT PRICING AND REGULATORY TRIBUNAL OF NSW"]
[]
[null,null,null,null,null,null,null,"APPLICATION FOR A SPECIAL VARIATION "]
[null,null,null,null,null,null,null,"TO GENERAL INCOME"]
[null,null,null,null,null,null,null,"under Section 508A and 508(2) of the Local Government Act 1993"]
[]
[]
[null,null,null,null,null,null,null,"SECTION 508A & 508(2) APPLICATION FORM"]
[null,null,null,null,null,null,null,{"$f":"\"PART A \"&'WK0 - Input data'!$D$45","v":"PART A 2019-20"}]
[]
[null,null,null,null,null,null,null,"Before completing this form, you MUST read the Office of Local Government's",null,null,null,null,null,null,null,"                 "]
[null,null,null,null,null,null,null,"Guidelines for the preparation of an application for a special variation to general income"]
[]
[null,null,null,null,null,null,null,"All dollars in nominal terms "]
[]
[null,null,null,"The Guidelines are available on the Office’s website at www.olg.nsw.gov.au."]
[]
[null,null,null,"NOTE:","This part of the application must be completed in conjunction with Part B"]
[null,null,null,null,{"$f":"\"(Special Variation Application Form \"&'WK0 - Input data'!$D$45&\"- Part B).\"","v":"(Special Variation Application Form 2019-20- Part B)."}]
[]
[null,null,null,null,null,null,null,"Overview"]
[]
[]
[null,null,"A Section 508A special variation allows a council to increase general income by a percentage that is greater than the rate peg"]
[null,null,"each year, up to a maximum of 7 years."]
[]
[null,null,"Section 508(2) allows a council to increase general income by a percentage that is greater than the rate peg in a single year. "]
[]
[null,null,"You must identify the percentage increase requested for each year inclusive of the rate peg."]
[]
[null,null,"You must also identify percentage increases in minimum rates for each year, if the increases result in a minimum rate"]
[null,null,"which exceeds the statutory limit."]
[]
[null,null,"Note: IPART can approve a percentage increase to minimum rates above the statutory limit that differs from the"]
[null,null,"proposed special variation percentage increase as long as you have justified and properly consulted on that percentage."]
[null,null,"See Attachment 4 of the Guidelines for further details."]
[]
[null,null,"Both Part A and Part B of the application should be submitted to IPART (us) via the Council Portal on our"]
[null,null,"website at www.ipart.nsw.gov.au. "]
[]
[null,null,"Part A consists of 9 worksheets:"]
[null,null,"►","Worksheet 1 (Identification): Identifies your council and a council contact officer, collects information"]
[null,null,null,null,"about your proposed special variation and any existing special variations (SVs)."]
[null,null,null,null,"It also collects information about Crown Land adjustments, catch-ups or excess adjustments "]
[null,null,null,null,"and valuation objections."]
[null,null,"►","Worksheet 2 (current year Notional General Income): Calculates the council's Notional General Income"]
[null,null,null,null,{"$f":"\"for the current year (Year 0 in the application, \"&'WK0 - Input data'!$F$58&\"). \"","v":"for the current year (Year 0 in the application, 2018-19). "}]
[null,null,"►","Worksheet 3 (first year Notional General Income): Calculates the council's proposed Notional General "]
[null,null,null,null,{"$f":"\"Income for next year (Year 1 in the application, \"&'WK0 - Input data'!$G$58&\").\"","v":"Income for next year (Year 1 in the application, 2019-20)."}]
[null,null,"►","Worksheet 4 (PGI): Summarises the council's Permissible General Income based on the 1st year's percentage  "]
[null,null,null,null,"for the proposed SV and Crown Land adjustments, plus other income adjustments. It also shows the "]
[null,null,null,null,"the council's PGI over the proposed SV period and the annual and cumulative impacts of the proposed SV."]
[null,null,"►","Worksheet 5a (Impact on Rates 1): Calculates the average annual and cumulative increases in rates"]
[null,null,null,null,"for each category/sub-category for each year of the proposed SV, with and without the proposed SV."]
[null,null,"►","Worksheet 5b (Impact on Rates 2): Collects the assessment numbers in the residential, business and farmland"]
[null,null,null,null,"ordinary rate categories for different land values in year 1 and the rates across this"]
[null,null,null,null,"distribution (ie, midpoints of each land value range) for each year of the proposed SV."]
[null,null,"►","Worksheet 6 (Additional SV Income and Expenditure): Collects data on how the council intends to use the"]
[null,null,null,null,"additional funds (above the rate peg) from the proposed SV. "]
[null,null,"►","Worksheet 7 (Historical financial information): Collects historical information from your financial statements."]
[null,null,"►","Worksheet 8 (Long Term Financial Plan): Collects information on your Long Term Financial Plan"]
[null,null,null,null,"including scenarios with and without the proposed special variation."]
[null,null,"►","Worksheet 9 (Financial ratios): Captures financial ratios, some of which are calculated while others"]
[null,null,null,null,"are entered as inputs."]
[]
[]
[null,null,null,"Enquiries regarding the completion of this application should be directed to:"]
[]
[null,null,null,null,{"$f":"'WK0 - Input data'!$D$29&\" \"&'WK0 - Input data'!$D$30","v":"Scott Chapman"},null,null,{"$f":"'WK0 - Input data'!D32","v":"(02) 9290 8449"}]
[null,null,null,null,null,null,null,{"$f":"'WK0 - Input data'!D31","v":"scott_chapman@ipart.nsw.gov.au"}]
[]
[null,null,null,null,{"$f":"'WK0 - Input data'!$D$35&\" \"&'WK0 - Input data'!$D$36&\" (who in \"&'WK0 - Input data'!D29&\"'s absence, will direct you to the appropriate IPART officer)\"","v":"Arsh Suri (who in Scott's absence, will direct you to the appropriate IPART officer)"}]
[null,null,null,null,null,null,null,{"$f":"'WK0 - Input data'!D38","v":"(02) 9113 7730"}]
[null,null,null,null,null,null,null,{"$f":"'WK0 - Input data'!D37","v":"arsh_suri@ipart.nsw.gov.au"}]
[]
[]
[]
[]
[]
[null,null,"Colour code "]
[]
[null,null,"Enter data in the blue input cells"]
[null,null,"Hard-coded values that should not be changed"]
[null,null,"Key outputs"]
[null,null,"Special instructions"]
[null,null,"Error checks "]
[null,null,"Double red line indicates a change in formula"]
[]
[]
[]
[null,null,null,null,null,null,null,null,"Step-by-step instructions on completing the worksheets"]
[]
[]
[]
[null,null,"Worksheet 1 - Identification"]
[]
[null,null,">","Select council name from the drop down list and enter contact details."]
[null,null,">","Indicate whether you have any existing SVs by selecting 'yes' or 'no' from the drop down box, where the existing SV "]
[null,null,null,"means you have an existing increase(s) above the rate peg for any year from Year 1 onwards."]
[null,null,{"$f":"$C$102","v":">"},"Select (or enter) the type and duration of the proposed special variation."]
[null,null,{"$f":"$C$102","v":">"},"Enter the additional percentage being sought above the rate peg (excluding other adjustments)."]
[null,null,{"$f":"$C$102","v":">"},"Answer the questions about expiring SVs."]
[null,null,null,"*","If the council does not have any SVs due to expire in the period of the proposed SV, leave the"]
[null,null,null,null,"field blank or select 'na'."]
[null,null,null,{"$f":"$D$108","v":"*"},{"$f":"\"Enter the $ value of expiring SVs in Table 1 (row \"&ROW('WK1 - Identification'!C71)&\")\"","v":"Enter the $ value of expiring SVs in Table 1 (row 71)"}]
[null,null,null,{"$f":"$D$108","v":"*"},"Any amounts entered need to be verified by the OLG before the application is submitted to us."]
[]
[null,null,{"$f":"$C$102","v":">"},"Answer the questions about Crown land adjustments, catch ups and valuation objections."]
[null,null,null,{"$f":"$D$108","v":"*"},"If the council does not have any adjustments, leave the fields in this section blank"]
[null,null,null,{"$f":"$D$108","v":"*"},"Note that applications for Crown land adjustments still need to be separately made to OLG."]
[null,null,{"$f":"$C$102","v":">"},"Enter the requested percentage increases in general income (including the rate peg) from year 2 (Table 1)."]
[null,null,null,{"$f":"$D$108","v":"*"},"The annual and cumulative increases in the white cells are automatically calculated once the requested "]
[null,null,null,null,"percentage increases have been entered. "]
[null,null,null,{"$f":"$D$108","v":"*"},"The worksheet automatically assumes a rate peg of 2.5% for each of the forward years (Year 2 and thereafter)."]
[null,null,null,null,"If the rate peg turns out to be different from that assumed, the total % increase in general income with an"]
[null,null,null,null,"approved SV does not change."]
[]
[null,null,{"$f":"\"Worksheet 2 - Notional General Income \"&'WK0 - Input data'!$F$58","v":"Worksheet 2 - Notional General Income 2018-19"}]
[]
[null,null,"This worksheet calculates the Notional General Income for the current year (Year 0), by applying the"]
[null,null,"rating structure used in the previous year to land values, adjusted by supplementary valuations"]
[null,null," received during that year.  "]
[]
[null,null,"Any inclusion in WK2 as a “supplementary valuation” must agree with section 4 of the Valuation of Land Act 1916."]
[]
[null,null,{"$f":"\"Worksheet 3 - Notional General Income \"&'WK0 - Input data'!$G$58","v":"Worksheet 3 - Notional General Income 2019-20"}]
[]
[null,null,"This worksheet calculates the proposed Notional General Income (Year 1). It should apply the proposed rating structure,"]
[null,null,"including the proposed SV increase, to land values adjusted by any supplementary valuations."]
[]
[null,null,"The rating structure entered here must be checked by OLG."]
[]
[null,null,"Worksheet 4 - Calculation"]
[]
[null,null,"This worksheet calculates Permissible General Income and the value of the proposed SV after taking into"]
[null,null,"account various adjustments.   Income adjustments and expiring SV amounts are to be verified"]
[null,null,"by OLG before the application is submitted to us.",null,null,null,null,null,null,null,null,null,"Example of PGI calculation for Year 1"]
[]
[null,null,"NO INPUTS ARE REQUIRED",null,null,null,null,null,null,null,"XYZ Council"]
[null,null,null,null,null,null,null,null,null,null,null,null,"WORKSHEET 4"]
[null,null,"Expiring SV"]
[null,null,{"$f":"\"If the council has a SV due to expire on 30 June \"&'WK0 - Input data'!$G$57&\", \"","v":"If the council has a SV due to expire on 30 June 2019, "},null,null,null,null,null,null,null,null,null,"PERMISSIBLE GENERAL INCOME SUMMARY FOR 2018-19"]
[null,null,"Notional General Income must be reduced before ",null,null,null,null,null,null,null,null,null,"  All dollars in nominal terms"]
[null,null,{"$f":"\"calculating Permissable General Income in \"&'WK0 - Input data'!$G$58&\".\"","v":"calculating Permissable General Income in 2019-20."},null,null,null,null,null,null,null,null,null,"Please check all income adjustments and expiring variation amounts with OLG"]
[null,null,null,null,null,null,null,null,null,null,null,null,"before submitting the application."]
[null,null,"Additional percentage increase",null,null,null,null,null,null,null,"Prior year Notional General Income",null,null,null,null,null,20000000]
[null,null,"This is the additional percentage increase being sought ",null,null,null,null,null,null,null,"Less:","Expiry of a prior special variation",null,null,null,null,10000]
[null,null,"above the rate peg, excluding any other income "]
[null,null,"adjustments.",null,null,null,null,null,null,null,"Adjusted first year Notional General Income",null,null,null,null,"$",{"$f":"Q151-Q152","v":19990000}]
[]
[null,null,"Crown Land Adjustment",null,null,null,null,null,null,null,"Plus:","Rate peg increase - first year",null,null,2.3E-2,null,{"$f":"ROUND(Q154*O156,9)","v":459770}]
[null,null,"Crown land claims will increase Permissible General ",null,null,null,null,null,null,null,"Plus:","Additional increase - first year",null,null,3.6999999999999998E-2,null,{"$f":"ROUND(Q154*O157,9)","v":739630}]
[null,null,"Income. The $ amount of any Crown land adjustment is",null,null,null,null,null,null,null,"Plus:","Crown Land adjustment - first year",null,null,6.3825374504374575E-4,null,10000]
[null,null,"converted into a % amount to be included in the final"]
[null,null,"special variation for consideration by IPART.",null,null,null,null,null,null,null,null,"Total special variation - first year",null,null,{"$f":"SUM(O156:O158)","v":6.0638253745043745E-2},"$",{"$f":"SUM(Q156:Q158)","v":1209400}]
[]
[null,null,"Other adjustments",null,null,null,null,null,null,null,"Other First Year Adjustments:"]
[null,null,"There are two other possible adjustments that are not included",null,null,null,null,null,null,null,"Plus/Minus:","Prior year Catch-up/(Excess)",null,null,null,null,-5000]
[null,null,"in the proposed SV % but will affect Permissible General Income:",null,null,null,null,null,null,null,"Minus:","Valuation Objections claimed in prior year",null,null,null,null,-30]
[null,null,"1. Prior year result. This is the catch up or excess amount"]
[null,null,"from the previous year, as advised by OLG.",null,null,null,null,null,null,null,null,null,null,null,"Total Adjustments",null,{"$f":"SUM(Q163:Q164)","v":-5030}]
[null,null,"2. Valuation objections: if you successfully claimed valuation"]
[null,null,"objections in the previous year, PGI must be reduced to",null,null,null,null,null,null,null,null,"First year Permissible General Income",null,null,null,"$",{"$f":"Q154+Q160+Q166","v":21194370}]
[null,null,"remove the extra income claimed from the revenue base."]
[]
[]
[null,null,"Worksheet 5a - Impact on Ratepayers (part 1)"]
[]
[null,null,"The aim of this sheet is to show the minimum rate increase (if applicable), the average rate increase per sub-category"]
[null,null,"(inclusive of all relevant rates) and the proposed annual charges in each year of the proposed special variation."]
[null,null,"It also aims to compare average rates with and without the proposed special variation."]
[null,null,"Enter the required data in the blue input cells. The values in the white cells will calculated automatically."]
[]
[null,null,"Minimum rates"]
[null,null,"Enter in the minimum rates per category/sub-category as if the SV were approved for each year as requested"]
[null,null,"These figures are intended to illustrate the impact of the proposed SV on any specific minimum rate."]
[]
[null,null,"Ordinary and Special Average Rates"]
[null,null,"Enter in the average rates per sub-category as if the proposed SV were approved for each year as requested"]
[null,null,"AND the average rates as if the proposed SV were not approved (only the rate peg would then apply)."]
[]
[null,null,"These figures should include the impact of changes in minimum rates and are calculated as per below."]
[]
[null,null,"Annual Charges"]
[null,null,"Enter any proposed annual charges for each year of the proposed variation."]
[]
[null,null,"Note:"]
[null,null,"*","An average rate equals total income in a category or sub-category divided by the number"]
[null,null,null,"    of assessments in that same category or sub-category (i.e. including assessments on the minimum rate). "]
[null,null,{"$f":"C193","v":"*"},"These figures should reflect the reduction from any expiring SVs so that the net change in rates is measured."]
[]
[null,null,"Worksheet 5b - Impact on Ratepayers (part 2)"]
[]
[null,null,"This worksheet shows the distribution of ordinary rates across different land values and how"]
[null,null,"ratepayers will be affected by the proposed SV, depending on the value of their land."]
[]
[null,null,"Enter the number of assessments in the ordinary rating categories (residential, business and farmland)"]
[null,null,{"$f":"\"across various land value ranges in \"&'WK0 - Input data'!$F$58&\", and the rate levels across different land values in each year\"","v":"across various land value ranges in 2018-19, and the rate levels across different land values in each year"}]
[null,null,"of the application, with and without the proposed SV."]
[]
[null,null,"If you have had a general revaluation of land during the prior year this spreadsheet will not accurately"]
[null,null,"reflect the impact on ratepayers in year 1.  We will take this into account when using this worksheet."]
[null,null,{"$f":"\"Please complete the tables using the number of assessments from the first year of the proposed SV (\"&'WK0 - Input data'!$D$45&\").\"","v":"Please complete the tables using the number of assessments from the first year of the proposed SV (2019-20)."}]
[]
[null,null,"Worksheet 6 - Proposed Additional SRV Income and Expenditure"]
[]
[null,null,"This worksheet is designed to show how the council proposes to use the additional funding"]
[null,null,"above the rate peg generated from the proposed SV.  "]
[]
[null,null,"The worksheet automatically calculates additional SRV income for Years 1 to 10."]
[]
[null,null,"Councils must enter each category of expenditure, and if applicable, individual program/project names, "]
[null,null,"in column C under one of the headings provided."]
[]
[null,null,"The spreadsheet will calculate the difference between the additional income from the proposed special variation "]
[null,null,"and what it is spent on.  A positive difference means that the additional income is not all spent on opex or capex."]
[]
[null,null,"* Part B of the application provides councils with the opportunity to explain their expenditure plans"]
[null,null,"and the impacts on their financial position."]
[]
[null,null,"Worksheet 7 - Historical financial information"]
[null,null,"This sheet captures the council's historical financial information as reported in its financial statements."]
[]
[null,null,"Worksheet 8 - Long Term Financial Plan"]
[]
[null,null,"This worksheet is designed to show how the council's Long Term Financial Plan varies"]
[null,null,"with and without the proposed special variation"]
[null,null,"Councils must complete the information from the Long Term Financial Plan for both the Special Variation Scenario "]
[null,null,"and the Base Case Scenario (without proposed special variation)."]
[]
[null,null,"Councils must enter each category of income and expenditure under the headings provided"]
[null,null,"This worksheet automatically calculates total amounts for each column"]
[]
[null,null,"Worksheet 9 - Financial ratios"]
[null,null,"This worksheet captures financial ratios for three historical years as well as the current and forecast years (0 to 10)."]
[null,null,"All the historical ratios and two of the forecast ratios are calculated from information provided in Worksheet 7 and Worksheet 8. "]
[null,null,"Enter forecast values for the two compulsory ratios (Infrastructure Renewals Ratio and Infrastructure Backlog Ratio)."]
[null,null,"Enter forecasts for the optional ratios only if they are relevant to your council's application."]

{"sheet":"Export","index":4,"n_rows":304,"n_cols":23,"rows_kept":304,"cut":false,"hidden":true,"merged":[]}
["Hide sheet before publishing"]
[]
[null,"EXPORT SHEET"]
[]
[null,{"$f":"'WK1 - Identification'!$F$5","v":"WORKSHEET 1"}]
[null,{"$f":"'WK1 - Identification'!C13","v":"Council Name:"},null,{"$f":"'WK2 - Notional General Income'!$C$3","v":"Burwood Council"}]
[null,"Type of application",null,{"$f":"'WK1 - Identification'!K28","v":"s508A"}]
[null,"Has existing SV?",null,{"$f":"'WK1 - Identification'!K24","v":"no"}]
[null,"Yrs SV applies",null,{"$f":"'WK1 - Identification'!R31","v":4}]
[null,"Permanent or temporary?",null,{"$f":"'WK1 - Identification'!K30","v":"Permanent"}]
[null,"No yrs if temporary",null,{"$f":"'WK1 - Identification'!K31","v":0}]
[]
[]
[]
[]
[null,{"$f":"'WK1 - Identification'!$F$5","v":"WORKSHEET 1"}]
[null,{"$f":"'WK1 - Identification'!C50","v":"E. Requested annual percentage increases and expiring SV amounts"}]
[null,null,null,null,null,null,null,{"$f":"'WK1 - Identification'!F56","v":"Year 0"},{"$f":"'WK1 - Identification'!G56","v":"Year 1"},{"$f":"'WK1 - Identification'!H56","v":"Year 2"},{"$f":"'WK1 - Identification'!I56","v":"Year 3"},{"$f":"'WK1 - Identification'!J56","v":"Year 4"},{"$f":"'WK1 - Identification'!K56","v":"Year 5"},{"$f":"'WK1 - Identification'!L56","v":"Year 6"},{"$f":"'WK1 - Identification'!M56","v":"Year 7"}]
[null,{"$f":"'WK1 - Identification'!C57","v":"Financial year"},null,null,null,null,null,{"$f":"'WK1 - Identification'!F57","v":"2018-19"},{"$f":"'WK1 - Identification'!G57","v":"2019-20"},{"$f":"'WK1 - Identification'!H57","v":"2020-21"},{"$f":"'WK1 - Identification'!I57","v":"2021-22"},{"$f":"'WK1 - Identification'!J57","v":"2022-23"},{"$f":"'WK1 - Identification'!K57","v":"2023-24"},{"$f":"'WK1 - Identification'!L57","v":"2024-25"},{"$f":"'WK1 - Identification'!M57","v":"2025-26"}]
[null,{"$f":"'WK1 - Identification'!C58","v":"1= included in SV period"},null,null,null,null,null,null,{"$f":"'WK1 - Identification'!G58","v":1},{"$f":"'WK1 - Identification'!H58","v":1},{"$f":"'WK1 - Identification'!I58","v":1},{"$f":"'WK1 - Identification'!J58","v":1},{"$f":"'WK1 - Identification'!K58","v":0},{"$f":"'WK1 - Identification'!L58","v":0},{"$f":"'WK1 - Identification'!M58","v":0}]
[null,{"$f":"'WK1 - Identification'!C59","v":"Annual % increases"}]
[null,{"$f":"'WK1 - Identification'!C60","v":"na - leave blank"},null,null,null,null,null,null,{"$f":"'WK1 - Identification'!G60","v":0},{"$f":"'WK1 - Identification'!H60","v":0},{"$f":"'WK1 - Identification'!I60","v":0},{"$f":"'WK1 - Identification'!J60","v":0},{"$f":"'WK1 - Identification'!K60","v":0},{"$f":"'WK1 - Identification'!L60","v":0},{"$f":"'WK1 - Identification'!M60","v":0}]
[null,{"$f":"'WK1 - Identification'!C61","v":"Rate peg only"},null,null,null,null,null,null,{"$f":"'WK1 - Identification'!G61","v":2.7E-2},{"$f":"'WK1 - Identification'!H61","v":2.5000000000000001E-2},{"$f":"'WK1 - Identification'!I61","v":2.5000000000000001E-2},{"$f":"'WK1 - Identification'!J61","v":2.5000000000000001E-2},{"$f":"'WK1 - Identification'!K61","v":2.5000000000000001E-2},{"$f":"'WK1 - Identification'!L61","v":2.5000000000000001E-2},{"$f":"'WK1 - Identification'!M61","v":2.5000000000000001E-2}]
[null,{"$f":"'WK1 - Identification'!C62","v":"     plus"},{"$f":"'WK1 - Identification'!D62","v":"percentage above the rate peg"},null,null,null,null,null,{"$f":"'WK1 - Identification'!G62","v":0.02},{"$f":"'WK1 - Identification'!H62","v":1.9999999999999997E-2},{"$f":"'WK1 - Identification'!I62","v":1.9999999999999997E-2},{"$f":"'WK1 - Identification'!J62","v":1.9999999999999997E-2},{"$f":"'WK1 - Identification'!K62","v":"."},{"$f":"'WK1 - Identification'!L62","v":"."},{"$f":"'WK1 - Identification'!M62","v":"."}]
[null,{"$f":"'WK1 - Identification'!C63","v":"     plus"},{"$f":"'WK1 - Identification'!D63","v":"Crown Land adjustment"},null,null,null,null,null,{"$f":"'WK1 - Identification'!G63","v":0},{"$f":"'WK1 - Identification'!H63","v":0},{"$f":"'WK1 - Identification'!I63","v":0},{"$f":"'WK1 - Identification'!J63","v":0},{"$f":"'WK1 - Identification'!K63","v":"."},{"$f":"'WK1 - Identification'!L63","v":"."},{"$f":"'WK1 - Identification'!M63","v":"."}]
[null,{"$f":"'WK1 - Identification'!C64","v":"   Proposed SV "},null,null,null,null,null,null,{"$f":"'WK1 - Identification'!G64","v":4.7E-2},{"$f":"'WK1 - Identification'!H64","v":4.4999999999999998E-2},{"$f":"'WK1 - Identification'!I64","v":4.4999999999999998E-2},{"$f":"'WK1 - Identification'!J64","v":4.4999999999999998E-2},{"$f":"'WK1 - Identification'!K64","v":0},{"$f":"'WK1 - Identification'!L64","v":0},{"$f":"'WK1 - Identification'!M64","v":0}]
[null,{"$f":"'WK1 - Identification'!C65","v":"Cumulative % increase"}]
[null,{"$f":"'WK1 - Identification'!C66","v":"Rate peg only"},null,null,null,null,null,null,{"$f":"'WK1 - Identification'!G66","v":2.7E-2},{"$f":"'WK1 - Identification'!H66","v":5.2674999999999805E-2},{"$f":"'WK1 - Identification'!I66","v":7.8991874999999601E-2},{"$f":"'WK1 - Identification'!J66","v":0.10596667187499942},{"$f":"'WK1 - Identification'!K66","v":0.13361583867187421},{"$f":"'WK1 - Identification'!L66","v":0.16195623463867093},{"$f":"'WK1 - Identification'!M66","v":0.19100514050463757}]
[null,{"$f":"'WK1 - Identification'!C67","v":"   Percentage above the rate peg"},null,null,null,null,null,null,{"$f":"'WK1 - Identification'!G67","v":0.02},{"$f":"'WK1 - Identification'!H67","v":4.1440000000000143E-2},{"$f":"'WK1 - Identification'!I67","v":6.4358300000000312E-2},{"$f":"'WK1 - Identification'!J67","v":8.8834261000000359E-2},{"$f":"'WK1 - Identification'!K67","v":"."},{"$f":"'WK1 - Identification'!L67","v":"."},{"$f":"'WK1 - Identification'!M67","v":"."}]
[null,{"$f":"'WK1 - Identification'!C68","v":"   Proposed SV "},null,null,null,null,null,null,{"$f":"'WK1 - Identification'!G68","v":4.7E-2},{"$f":"'WK1 - Identification'!H68","v":9.4114999999999949E-2},{"$f":"'WK1 - Identification'!I68","v":0.14335017499999991},{"$f":"'WK1 - Identification'!J68","v":0.19480093287499978},{"$f":"'WK1 - Identification'!K68","v":"."},{"$f":"'WK1 - Identification'!L68","v":"."},{"$f":"'WK1 - Identification'!M68","v":"."}]
[]
[null,{"$f":"'WK1 - Identification'!C70","v":"Expiring special variations"}]
[null,{"$f":"'WK1 - Identification'!C71","v":"$ value of expiring special"},null,null,null,null,null,null,{"$f":"'WK1 - Identification'!G71","v":0},{"$f":"'WK1 - Identification'!H71","v":0},{"$f":"'WK1 - Identification'!I71","v":0},{"$f":"'WK1 - Identification'!J71","v":0},{"$f":"'WK1 - Identification'!K71","v":0},{"$f":"'WK1 - Identification'!L71","v":0},{"$f":"'WK1 - Identification'!M71","v":0}]
[null,{"$f":"'WK1 - Identification'!C72","v":" variations (ESV)"},null,null,null,null,null,null,{"$f":"'WK1 - Identification'!G72","v":0},{"$f":"'WK1 - Identification'!H72","v":0},{"$f":"'WK1 - Identification'!I72","v":0},{"$f":"'WK1 - Identification'!J72","v":0},{"$f":"'WK1 - Identification'!K72","v":"."},{"$f":"'WK1 - Identification'!L72","v":"."},{"$f":"'WK1 - Identification'!M72","v":"."}]
[]
[]
[]
[]
[null,{"$f":"'WK4 - PGI summary'!$E$5","v":"WORKSHEET 4"}]
[null,{"$f":"'WK4 - PGI summary'!B36","v":"PERMISSABLE GENERAL INCOME (PGI) OVER PROPOSED SV PERIOD ($ nominal)"}]
[null,{"$f":"'WK0 - Input data'!B$54","v":"Year number"},null,null,{"$f":"'WK0 - Input data'!C$55","v":"Hist yr 3"},{"$f":"'WK0 - Input data'!D$55","v":"Hist yr 2"},{"$f":"'WK0 - Input data'!E$55","v":"Hist yr 1"},{"$f":"'WK0 - Input data'!F$55","v":"Year 0"},{"$f":"'WK0 - Input data'!G$55","v":"Year 1"},{"$f":"'WK0 - Input data'!H$55","v":"Year 2"},{"$f":"'WK0 - Input data'!I$55","v":"Year 3"},{"$f":"'WK0 - Input data'!J$55","v":"Year 4"},{"$f":"'WK0 - Input data'!K$55","v":"Year 5"},{"$f":"'WK0 - Input data'!L$55","v":"Year 6"},{"$f":"'WK0 - Input data'!M$55","v":"Year 7"},{"$f":"'WK0 - Input data'!N$55","v":"Year 8"},{"$f":"'WK0 - Input data'!O$55","v":"Year 9"},{"$f":"'WK0 - Input data'!P$55","v":"Year 10"},{"$f":"'WK4 - PGI summary'!N37","v":"Total"},{"$f":"'WK4 - PGI summary'!O37","v":"increase"}]
[null,{"$f":"'WK0 - Input data'!B$58","v":"Financial year"},null,null,{"$f":"'WK0 - Input data'!C$58","v":"2015-16"},{"$f":"'WK0 - Input data'!D$58","v":"2016-17"},{"$f":"'WK0 - Input data'!E$58","v":"2017-18"},{"$f":"'WK0 - Input data'!F$58","v":"2018-19"},{"$f":"'WK0 - Input data'!G$58","v":"2019-20"},{"$f":"'WK0 - Input data'!H$58","v":"2020-21"},{"$f":"'WK0 - Input data'!I$58","v":"2021-22"},{"$f":"'WK0 - Input data'!J$58","v":"2022-23"},{"$f":"'WK0 - Input data'!K$58","v":"2023-24"},{"$f":"'WK0 - Input data'!L$58","v":"2024-25"},{"$f":"'WK0 - Input data'!M$58","v":"2025-26"},{"$f":"'WK0 - Input data'!N$58","v":"2026-27"},{"$f":"'WK0 - Input data'!O$58","v":"2027-28"},{"$f":"'WK0 - Input data'!P$58","v":"2028-29"},{"$f":"'WK4 - PGI summary'!N38","v":"$ nominal"},{"$f":"'WK4 - PGI summary'!O38","v":"%"}]
[]
[null,{"$f":"'WK4 - PGI summary'!C40","v":"Permissible General Income (PGI) with proposed SV"}]
[null,{"$f":"'WK4 - PGI summary'!C41","v":"Prior year Notional General Income (NGI)"},null,null,null,null,null,null,{"$f":"'WK4 - PGI summary'!G41","v":22650649.7657394},{"$f":"'WK4 - PGI summary'!H41","v":23646213.304729152},{"$f":"'WK4 - PGI summary'!I41","v":24710292.903441966},{"$f":"'WK4 - PGI summary'!J41","v":25822256.084096853},{"$f":"'WK4 - PGI summary'!K41","v":"."},{"$f":"'WK4 - PGI summary'!L41","v":"."},{"$f":"'WK4 - PGI summary'!M41","v":"."}]
[null,{"$f":"'WK4 - PGI summary'!C42","v":"  less"},{"$f":"'WK4 - PGI summary'!D42","v":"expiry of a prior special variation"},null,null,null,null,null,{"$f":"'WK4 - PGI summary'!G42","v":0},{"$f":"'WK4 - PGI summary'!H42","v":0},{"$f":"'WK4 - PGI summary'!I42","v":0},{"$f":"'WK4 - PGI summary'!J42","v":0},{"$f":"'WK4 - PGI summary'!K42","v":"."},{"$f":"'WK4 - PGI summary'!L42","v":"."},{"$f":"'WK4 - PGI summary'!M42","v":"."}]
[null,{"$f":"'WK4 - PGI summary'!C43","v":"Adjusted Notional General income"},null,null,null,null,null,null,{"$f":"'WK4 - PGI summary'!G43","v":22650649.7657394},{"$f":"'WK4 - PGI summary'!H43","v":23646213.304729152},{"$f":"'WK4 - PGI summary'!I43","v":24710292.903441966},{"$f":"'WK4 - PGI summary'!J43","v":25822256.084096853},{"$f":"'WK4 - PGI summary'!K43","v":"."},{"$f":"'WK4 - PGI summary'!L43","v":"."},{"$f":"'WK4 - PGI summary'!M43","v":"."}]
[]
[null,{"$f":"'WK4 - PGI summary'!C45","v":"     plus"},{"$f":"'WK4 - PGI summary'!D45","v":"rate peg increase"},null,null,null,null,null,{"$f":"'WK4 - PGI summary'!G45","v":611567.54367496376},{"$f":"'WK4 - PGI summary'!H45","v":591155.33261822886},{"$f":"'WK4 - PGI summary'!I45","v":617757.32258604921},{"$f":"'WK4 - PGI summary'!J45","v":645556.40210242139},{"$f":"'WK4 - PGI summary'!K45","v":"."},{"$f":"'WK4 - PGI summary'!L45","v":"."},{"$f":"'WK4 - PGI summary'!M45","v":"."}]
[null,{"$f":"'WK4 - PGI summary'!C46","v":"     plus"},{"$f":"'WK4 - PGI summary'!D46","v":"additional increase"},null,null,null,null,null,{"$f":"'WK4 - PGI summary'!G46","v":453012.99531478802},{"$f":"'WK4 - PGI summary'!H46","v":472924.26609458297},{"$f":"'WK4 - PGI summary'!I46","v":494205.85806883924},{"$f":"'WK4 - PGI summary'!J46","v":516445.12168193696},{"$f":"'WK4 - PGI summary'!K46","v":"."},{"$f":"'WK4 - PGI summary'!L46","v":"."},{"$f":"'WK4 - PGI summary'!M46","v":"."}]
[null,{"$f":"'WK4 - PGI summary'!C47","v":"     plus"},{"$f":"'WK4 - PGI summary'!D47","v":"Crown Land adjustment"},null,null,null,null,null,{"$f":"'WK4 - PGI summary'!G47","v":0},{"$f":"'WK4 - PGI summary'!H47","v":0},{"$f":"'WK4 - PGI summary'!I47","v":0},{"$f":"'WK4 - PGI summary'!J47","v":0},{"$f":"'WK4 - PGI summary'!K47","v":"."},{"$f":"'WK4 - PGI summary'!L47","v":"."},{"$f":"'WK4 - PGI summary'!M47","v":"."}]
[null,{"$f":"'WK4 - PGI summary'!C48","v":"Total proposed SV"},null,null,null,null,null,null,{"$f":"'WK4 - PGI summary'!G48","v":1064580.5389897518},{"$f":"'WK4 - PGI summary'!H48","v":1064079.5987128117},{"$f":"'WK4 - PGI summary'!I48","v":1111963.1806548885},{"$f":"'WK4 - PGI summary'!J48","v":1162001.5237843583},{"$f":"'WK4 - PGI summary'!K48","v":"."},{"$f":"'WK4 - PGI summary'!L48","v":"."},{"$f":"'WK4 - PGI summary'!M48","v":"."}]
[]
[null,{"$f":"'WK4 - PGI summary'!C50","v":"Notional General Income after SV applied"},null,null,null,null,null,null,{"$f":"'WK4 - PGI summary'!G50","v":23715230.304729152},{"$f":"'WK4 - PGI summary'!H50","v":24710292.903441966},{"$f":"'WK4 - PGI summary'!I50","v":25822256.084096853},{"$f":"'WK4 - PGI summary'!J50","v":26984257.607881211},{"$f":"'WK4 - PGI summary'!K50","v":"."},{"$f":"'WK4 - PGI summary'!L50","v":"."},{"$f":"'WK4 - PGI summary'!M50","v":"."}]
[null,{"$f":"'WK4 - PGI summary'!C51","v":"     plus"},{"$f":"'WK4 - PGI summary'!D51","v":"other 1st-year adjustments"},null,null,null,null,null,{"$f":"'WK4 - PGI summary'!G51","v":-69017},{"$f":"'WK4 - PGI summary'!H51","v":0},{"$f":"'WK4 - PGI summary'!I51","v":0},{"$f":"'WK4 - PGI summary'!J51","v":0},{"$f":"'WK4 - PGI summary'!K51","v":"."},{"$f":"'WK4 - PGI summary'!L51","v":"."},{"$f":"'WK4 - PGI summary'!M51","v":"."}]
[null,{"$f":"'WK4 - PGI summary'!C52","v":"PGI with proposed SV"},null,null,null,null,null,{"$f":"'WK4 - PGI summary'!F52","v":22650649.7657394},{"$f":"'WK4 - PGI summary'!G52","v":23646213.304729152},{"$f":"'WK4 - PGI summary'!H52","v":24710292.903441966},{"$f":"'WK4 - PGI summary'!I52","v":25822256.084096853},{"$f":"'WK4 - PGI summary'!J52","v":26984257.607881211},{"$f":"'WK4 - PGI summary'!K52","v":"."},{"$f":"'WK4 - PGI summary'!L52","v":"."},{"$f":"'WK4 - PGI summary'!M52","v":"."},null,null,null,{"$f":"'WK4 - PGI summary'!N52","v":4333607.8421418108},{"$f":"'WK4 - PGI summary'!O52","v":0.19132377600472539}]
[null,"check = 0",null,null,null,null,null,null,{"$f":"IF(I56=\".\",\".\",I45-I46+I49+I50+I51+I55-I56)","v":0},{"$f":"IF(J56=\".\",\".\",J45-J46+J49+J50+J51+J55-J56)","v":0},0,{"$f":"IF(L56=\".\",\".\",L45-L46+L49+L50+L51+L55-L56)","v":0},{"$f":"IF(M56=\".\",\".\",M45-M46+M49+M50+M51+M55-M56)","v":"."},{"$f":"IF(N56=\".\",\".\",N45-N46+N49+N50+N51+N55-N56)","v":"."},{"$f":"IF(O56=\".\",\".\",O45-O46+O49+O50+O51+O55-O56)","v":"."},null,null,null,{"$f":"INDEX(H56:O56,1,$D$9+1)-H56-S56","v":0}]
[null,{"$f":"'WK4 - PGI summary'!C54","v":"Permissible General Income if only the rate peg applied"}]
[null,{"$f":"'WK4 - PGI summary'!C55","v":"Prior year Notional General Income (NGI)"},null,null,null,null,null,null,{"$f":"'WK4 - PGI summary'!G55","v":22650649.7657394},{"$f":"'WK4 - PGI summary'!H55","v":23193200.309414364},{"$f":"'WK4 - PGI summary'!I55","v":23773030.317149725},{"$f":"'WK4 - PGI summary'!J55","v":24367356.075078469},{"$f":"'WK4 - PGI summary'!K55","v":"."},{"$f":"'WK4 - PGI summary'!L55","v":"."},{"$f":"'WK4 - PGI summary'!M55","v":"."}]
[null,{"$f":"'WK4 - PGI summary'!C56","v":"  less"},{"$f":"'WK4 - PGI summary'!D56","v":"expiry of a prior special variation"},null,null,null,null,null,{"$f":"'WK4 - PGI summary'!G56","v":0},{"$f":"'WK4 - PGI summary'!H56","v":0},{"$f":"'WK4 - PGI summary'!I56","v":0},{"$f":"'WK4 - PGI summary'!J56","v":0},{"$f":"'WK4 - PGI summary'!K56","v":"."},{"$f":"'WK4 - PGI summary'!L56","v":"."},{"$f":"'WK4 - PGI summary'!M56","v":"."}]
[null,{"$f":"'WK4 - PGI summary'!C57","v":"Adjusted Notional General income"},null,null,null,null,null,null,{"$f":"'WK4 - PGI summary'!G57","v":22650649.7657394},{"$f":"'WK4 - PGI summary'!H57","v":23193200.309414364},{"$f":"'WK4 - PGI summary'!I57","v":23773030.317149725},{"$f":"'WK4 - PGI summary'!J57","v":24367356.075078469},{"$f":"'WK4 - PGI summary'!K57","v":"."},{"$f":"'WK4 - PGI summary'!L57","v":"."},{"$f":"'WK4 - PGI summary'!M57","v":"."}]
[]
[null,{"$f":"'WK4 - PGI summary'!C59","v":"     plus"},{"$f":"'WK4 - PGI summary'!D59","v":"rate peg increase"},null,null,null,null,null,{"$f":"'WK4 - PGI summary'!G59","v":611567.54367496376},{"$f":"'WK4 - PGI summary'!H59","v":579830.00773535913},{"$f":"'WK4 - PGI summary'!I59","v":594325.75792874314},{"$f":"'WK4 - PGI summary'!J59","v":609183.9018769617},{"$f":"'WK4 - PGI summary'!K59","v":"."},{"$f":"'WK4 - PGI summary'!L59","v":"."},{"$f":"'WK4 - PGI summary'!M59","v":"."}]
[null,{"$f":"'WK4 - PGI summary'!C60","v":"     plus"},{"$f":"'WK4 - PGI summary'!D60","v":"other 1st-year adjustments"},null,null,null,null,null,{"$f":"'WK4 - PGI summary'!G60","v":-69017},{"$f":"'WK4 - PGI summary'!H60","v":0},{"$f":"'WK4 - PGI summary'!I60","v":0},{"$f":"'WK4 - PGI summary'!J60","v":0},{"$f":"'WK4 - PGI summary'!K60","v":"."},{"$f":"'WK4 - PGI summary'!L60","v":"."},{"$f":"'WK4 - PGI summary'!M60","v":"."}]
[null,{"$f":"'WK4 - PGI summary'!C61","v":"PGI if only the rate peg applied"},null,null,null,null,null,{"$f":"'WK4 - PGI summary'!F61","v":22650649.7657394},{"$f":"'WK4 - PGI summary'!G61","v":23193200.309414364},{"$f":"'WK4 - PGI summary'!H61","v":23773030.317149725},{"$f":"'WK4 - PGI summary'!I61","v":24367356.075078469},{"$f":"'WK4 - PGI summary'!J61","v":24976539.976955429},{"$f":"'WK4 - PGI summary'!K61","v":"."},{"$f":"'WK4 - PGI summary'!L61","v":"."},{"$f":"'WK4 - PGI summary'!M61","v":"."},null,null,null,{"$f":"'WK4 - PGI summary'!N61","v":2325890.2112160288},{"$f":"'WK4 - PGI summary'!O61","v":0.10268536378740406}]
[null,"check = 0",null,null,null,null,null,null,{"$f":"IF(I65=\".\",\".\",I59-I60+I63+I64-I65)","v":0},{"$f":"IF(J65=\".\",\".\",J59-J60+J63+J64-J65)","v":0},0,0,".",".",".",null,null,null,{"$f":"INDEX(H65:O65,1,$D$9+1)-H65-S65","v":0}]
[null,{"$f":"'WK4 - PGI summary'!C63","v":"PGI if expiring SV renewed and rate peg applied"}]
[null,{"$f":"'WK4 - PGI summary'!C64","v":"Prior year Notional General Income (NGI)"},null,null,null,null,null,null,{"$f":"'WK4 - PGI summary'!G64","v":22650649.7657394},{"$f":"'WK4 - PGI summary'!H64","v":23193200.309414364},{"$f":"'WK4 - PGI summary'!I64","v":23773030.317149725},{"$f":"'WK4 - PGI summary'!J64","v":24367356.075078469},{"$f":"'WK4 - PGI summary'!K64","v":"."},{"$f":"'WK4 - PGI summary'!L64","v":"."},{"$f":"'WK4 - PGI summary'!M64","v":"."}]
[null,{"$f":"'WK4 - PGI summary'!C65","v":"     plus"},{"$f":"'WK4 - PGI summary'!D65","v":"rate peg increase"},null,null,null,null,null,{"$f":"'WK4 - PGI summary'!G65","v":611567.54367496376},{"$f":"'WK4 - PGI summary'!H65","v":579830.00773535913},{"$f":"'WK4 - PGI summary'!I65","v":594325.75792874314},{"$f":"'WK4 - PGI summary'!J65","v":609183.9018769617},{"$f":"'WK4 - PGI summary'!K65","v":"."},{"$f":"'WK4 - PGI summary'!L65","v":"."},{"$f":"'WK4 - PGI summary'!M65","v":"."}]
[null,{"$f":"'WK4 - PGI summary'!C66","v":"     plus"},{"$f":"'WK4 - PGI summary'!D66","v":"other 1st-year adjustments"},null,null,null,null,null,{"$f":"'WK4 - PGI summary'!G66","v":-69017},{"$f":"'WK4 - PGI summary'!H66","v":0},{"$f":"'WK4 - PGI summary'!I66","v":0},{"$f":"'WK4 - PGI summary'!J66","v":0},{"$f":"'WK4 - PGI summary'!K66","v":"."},{"$f":"'WK4 - PGI summary'!L66","v":"."},{"$f":"'WK4 - PGI summary'!M66","v":"."}]
[null,{"$f":"'WK4 - PGI summary'!C67","v":"PGI if expiring SV renewed and rate peg applied"},null,null,null,null,null,{"$f":"'WK4 - PGI summary'!F67","v":22650649.7657394},{"$f":"'WK4 - PGI summary'!G67","v":23193200.309414364},{"$f":"'WK4 - PGI summary'!H67","v":23773030.317149725},{"$f":"'WK4 - PGI summary'!I67","v":24367356.075078469},{"$f":"'WK4 - PGI summary'!J67","v":24976539.976955429},{"$f":"'WK4 - PGI summary'!K67","v":"."},{"$f":"'WK4 - PGI summary'!L67","v":"."},{"$f":"'WK4 - PGI summary'!M67","v":"."},null,null,null,{"$f":"'WK4 - PGI summary'!N67","v":2325890.2112160288},{"$f":"'WK4 - PGI summary'!O67","v":0.10268536378740406}]
[null,"check = 0",null,null,null,null,null,null,{"$f":"IF(I71=\".\",\".\",I68+I69+I70-I71)","v":0},{"$f":"IF(J71=\".\",\".\",J68+J69+J70-J71)","v":0},0,0,".",".",".",null,null,null,{"$f":"INDEX(H71:O71,1,$D$9+1)-H71-S71","v":0}]
[]
[]
[]
[null,{"$f":"'WK4 - PGI summary'!$E$5","v":"WORKSHEET 4"}]
[null,{"$f":"'WK4 - PGI summary'!B72","v":"INCREASES IN PERMISSABLE GENERAL INCOME (PGI) OVER PROPOSED SV PERIOD (nominal)"}]
[null,{"$f":"B$41","v":"Year number"},null,null,{"$f":"E$41","v":"Hist yr 3"},"Hist yr 2","Hist yr 1","Year 0","Year 1","Year 2","Year 3","Year 4","Year 5","Year 6","Year 7","Year 8","Year 9","Year 10",{"$f":"'WK4 - PGI summary'!N73","v":"Total"},{"$f":"'WK4 - PGI summary'!O73","v":"increase"}]
[null,{"$f":"B$42","v":"Financial year"},null,null,{"$f":"E$42","v":"2015-16"},"2016-17","2017-18","2018-19","2019-20","2020-21","2021-22","2022-23","2023-24","2024-25","2025-26","2026-27","2027-28","2028-29",{"$f":"'WK4 - PGI summary'!N74","v":"$ nominal"},{"$f":"'WK4 - PGI summary'!O74","v":"%"}]
[]
[null,{"$f":"'WK4 - PGI summary'!C76","v":"Annual % increase in PGI"}]
[null,{"$f":"'WK4 - PGI summary'!C77","v":"PGI with proposed SV"},null,{"$f":"'WK4 - PGI summary'!E77","v":"%"},null,null,null,null,{"$f":"'WK4 - PGI summary'!G77","v":4.3952979242812183E-2},{"$f":"'WK4 - PGI summary'!H77","v":4.5000000000000054E-2},{"$f":"'WK4 - PGI summary'!I77","v":4.4999999999999943E-2},{"$f":"'WK4 - PGI summary'!J77","v":4.4999999999999984E-2},{"$f":"'WK4 - PGI summary'!K77","v":"."},{"$f":"'WK4 - PGI summary'!L77","v":"."},{"$f":"'WK4 - PGI summary'!M77","v":"."},null,null,null,null,{"$f":"'WK4 - PGI summary'!O77","v":0.19132377600472539}]
[null,{"$f":"'WK4 - PGI summary'!C78","v":"PGI if only the rate peg applied"},null,{"$f":"'WK4 - PGI summary'!E78","v":"%"},null,null,null,null,{"$f":"'WK4 - PGI summary'!G78","v":2.3952979242812183E-2},{"$f":"'WK4 - PGI summary'!H78","v":2.5000000000000057E-2},{"$f":"'WK4 - PGI summary'!I78","v":2.5000000000000036E-2},{"$f":"'WK4 - PGI summary'!J78","v":2.4999999999999929E-2},{"$f":"'WK4 - PGI summary'!K78","v":"."},{"$f":"'WK4 - PGI summary'!L78","v":"."},{"$f":"'WK4 - PGI summary'!M78","v":"."},null,null,null,null,{"$f":"'WK4 - PGI summary'!O78","v":0.10268536378740406}]
[null,{"$f":"'WK4 - PGI summary'!C79","v":"PGI if expiring SV renewed and rate peg applied"},null,{"$f":"'WK4 - PGI summary'!E79","v":"%"},null,null,null,null,{"$f":"'WK4 - PGI summary'!G79","v":2.3952979242812183E-2},{"$f":"'WK4 - PGI summary'!H79","v":2.5000000000000057E-2},{"$f":"'WK4 - PGI summary'!I79","v":2.5000000000000036E-2},{"$f":"'WK4 - PGI summary'!J79","v":2.4999999999999929E-2},{"$f":"'WK4 - PGI summary'!K79","v":"."},{"$f":"'WK4 - PGI summary'!L79","v":"."},{"$f":"'WK4 - PGI summary'!M79","v":"."},null,null,null,null,{"$f":"'WK4 - PGI summary'!O79","v":0.10268536378740406}]
[]
[null,{"$f":"'WK4 - PGI summary'!C81","v":"Annual and cumulative $ increase in PGI"}]
[null,{"$f":"'WK4 - PGI summary'!C82","v":"PGI with proposed SV"},null,{"$f":"'WK4 - PGI summary'!E82","v":"$ nominal"},null,null,null,null,{"$f":"'WK4 - PGI summary'!G82","v":995563.53898975253},{"$f":"'WK4 - PGI summary'!H82","v":1064079.5987128131},{"$f":"'WK4 - PGI summary'!I82","v":1111963.1806548871},{"$f":"'WK4 - PGI summary'!J82","v":1162001.5237843581},{"$f":"'WK4 - PGI summary'!K82","v":"."},{"$f":"'WK4 - PGI summary'!L82","v":"."},{"$f":"'WK4 - PGI summary'!M82","v":"."},null,null,null,{"$f":"'WK4 - PGI summary'!N82","v":4333607.8421418108},{"$f":"'WK4 - PGI summary'!O82","v":0.19132377600472539}]
[null,{"$f":"'WK4 - PGI summary'!C83","v":"PGI if only the rate peg applied"},null,{"$f":"'WK4 - PGI summary'!E83","v":"$ nominal"},null,null,null,null,{"$f":"'WK4 - PGI summary'!G83","v":542550.54367496446},{"$f":"'WK4 - PGI summary'!H83","v":579830.00773536041},{"$f":"'WK4 - PGI summary'!I83","v":594325.75792874396},{"$f":"'WK4 - PGI summary'!J83","v":609183.90187695995},{"$f":"'WK4 - PGI summary'!K83","v":"."},{"$f":"'WK4 - PGI summary'!L83","v":"."},{"$f":"'WK4 - PGI summary'!M83","v":"."},null,null,null,{"$f":"'WK4 - PGI summary'!N83","v":2325890.2112160288},{"$f":"'WK4 - PGI summary'!O83","v":0.10268536378740406}]
[null,{"$f":"'WK4 - PGI summary'!C84","v":"PGI if expiring SV renewed and rate peg applied"},null,{"$f":"'WK4 - PGI summary'!E84","v":"$ nominal"},null,null,null,null,{"$f":"'WK4 - PGI summary'!G84","v":542550.54367496446},{"$f":"'WK4 - PGI summary'!H84","v":579830.00773536041},{"$f":"'WK4 - PGI summary'!I84","v":594325.75792874396},{"$f":"'WK4 - PGI summary'!J84","v":609183.90187695995},{"$f":"'WK4 - PGI summary'!K84","v":"."},{"$f":"'WK4 - PGI summary'!L84","v":"."},{"$f":"'WK4 - PGI summary'!M84","v":"."},null,null,null,{"$f":"'WK4 - PGI summary'!N84","v":2325890.2112160288},{"$f":"'WK4 - PGI summary'!O84","v":0.10268536378740406}]
[]
[null,{"$f":"'WK4 - PGI summary'!C86","v":"Annual $ increase in PGI with proposed SV more than"}]
[null,{"$f":"'WK4 - PGI summary'!C87","v":"PGI if only the rate peg applied"},null,{"$f":"'WK4 - PGI summary'!E87","v":"$ nominal"},null,null,null,null,{"$f":"'WK4 - PGI summary'!G87","v":453012.99531478807},{"$f":"'WK4 - PGI summary'!H87","v":484249.5909774527},{"$f":"'WK4 - PGI summary'!I87","v":517637.42272614315},{"$f":"'WK4 - PGI summary'!J87","v":552817.6219073981},{"$f":"'WK4 - PGI summary'!K87","v":"."},{"$f":"'WK4 - PGI summary'!L87","v":"."},{"$f":"'WK4 - PGI summary'!M87","v":"."},null,null,null,{"$f":"'WK4 - PGI summary'!N87","v":2007717.630925782},{"$f":"'WK4 - PGI summary'!O87","v":8.8638412217321327E-2}]
[null,{"$f":"'WK4 - PGI summary'!C88","v":"PGI if expiring SV renewed and rate peg applied"},null,{"$f":"'WK4 - PGI summary'!E88","v":"$ nominal"},null,null,null,null,{"$f":"'WK4 - PGI summary'!G88","v":453012.99531478807},{"$f":"'WK4 - PGI summary'!H88","v":484249.5909774527},{"$f":"'WK4 - PGI summary'!I88","v":517637.42272614315},{"$f":"'WK4 - PGI summary'!J88","v":552817.6219073981},{"$f":"'WK4 - PGI summary'!K88","v":"."},{"$f":"'WK4 - PGI summary'!L88","v":"."},{"$f":"'WK4 - PGI summary'!M88","v":"."},null,null,null,{"$f":"'WK4 - PGI summary'!N88","v":2007717.630925782},{"$f":"'WK4 - PGI summary'!O88","v":8.8638412217321327E-2}]
[]
[null,{"$f":"'WK4 - PGI summary'!C90","v":"Cumulative PGI"},null,null,null,null,null,null,{"$f":"'WK4 - PGI summary'!G90","v":0},{"$f":"'WK4 - PGI summary'!H90","v":0},{"$f":"'WK4 - PGI summary'!I90","v":0},{"$f":"'WK4 - PGI summary'!J90","v":0},{"$f":"'WK4 - PGI summary'!K90","v":0},{"$f":"'WK4 - PGI summary'!L90","v":0},{"$f":"'WK4 - PGI summary'!M90","v":0},null,null,null,{"$f":"'WK4 - PGI summary'!N90","v":0},{"$f":"'WK4 - PGI summary'!O90","v":0}]
[null,{"$f":"'WK4 - PGI summary'!C91","v":"PGI with proposed SV"},null,{"$f":"'WK4 - PGI summary'!E91","v":"$ nominal"},null,null,null,null,{"$f":"'WK4 - PGI summary'!G91","v":23646213.304729152},{"$f":"'WK4 - PGI summary'!H91","v":48356506.208171114},{"$f":"'WK4 - PGI summary'!I91","v":74178762.292267963},{"$f":"'WK4 - PGI summary'!J91","v":101163019.90014917},{"$f":"'WK4 - PGI summary'!K91","v":"."},{"$f":"'WK4 - PGI summary'!L91","v":"."},{"$f":"'WK4 - PGI summary'!M91","v":"."},null,null,null,{"$f":"'WK4 - PGI summary'!N91","v":101163019.90014917},{"$f":"'WK4 - PGI summary'!O91","v":0}]
[null,{"$f":"'WK4 - PGI summary'!C92","v":"PGI if only the rate peg applied"},null,{"$f":"'WK4 - PGI summary'!E92","v":"$ nominal"},null,null,null,null,{"$f":"'WK4 - PGI summary'!G92","v":23193200.309414364},{"$f":"'WK4 - PGI summary'!H92","v":46966230.626564085},{"$f":"'WK4 - PGI summary'!I92","v":71333586.701642558},{"$f":"'WK4 - PGI summary'!J92","v":96310126.678597987},{"$f":"'WK4 - PGI summary'!K92","v":"."},{"$f":"'WK4 - PGI summary'!L92","v":"."},{"$f":"'WK4 - PGI summary'!M92","v":"."},null,null,null,{"$f":"'WK4 - PGI summary'!N92","v":96310126.678597987},{"$f":"'WK4 - PGI summary'!O92","v":0}]
[]
[]
[]
[]
[null,{"$f":"'WK5a - Impact on Rates'!$F$5","v":"WORKSHEET 5a"}]
[null,"IMPACT ON  AVERAGE RATES "]
[null,{"$f":"B$41","v":"Year number"},null,null,{"$f":"E$41","v":"Hist yr 3"},"Hist yr 2","Hist yr 1","Year 0","Year 1","Year 2","Year 3","Year 4","Year 5","Year 6","Year 7","Year 8","Year 9","Year 10"]
[null,{"$f":"B$42","v":"Financial year"},null,null,{"$f":"E$42","v":"2015-16"},"2016-17","2017-18","2018-19","2019-20","2020-21","2021-22","2022-23","2023-24","2024-25","2025-26","2026-27","2027-28","2028-29"]
[]
[null,{"$f":"'WK5a - Impact on Rates'!C57","v":"Average Ordinary and Special Rates - with proposed special variation"}]
[null,{"$f":"'WK5a - Impact on Rates'!C60","v":"Residential"},null,null,null,null,null,{"$f":"'WK5a - Impact on Rates'!E90","v":1326.5348651722388},{"$f":"'WK5a - Impact on Rates'!F90","v":1385.0356864069513},{"$f":"'WK5a - Impact on Rates'!G90","v":1447.3633383549827},{"$f":"'WK5a - Impact on Rates'!H90","v":1512.4929559178368},{"$f":"'WK5a - Impact on Rates'!I90","v":1580.5590976658709},{"$f":"'WK5a - Impact on Rates'!J90","v":1620.0739120732119},{"$f":"'WK5a - Impact on Rates'!K90","v":1660.5756837361071},{"$f":"'WK5a - Impact on Rates'!L90","v":1702.0900650730741}]
[null,{"$f":"'WK5a - Impact on Rates'!C91","v":"Business"},null,null,null,null,null,{"$f":"'WK5a - Impact on Rates'!E136","v":5897.3917803657705},{"$f":"'WK5a - Impact on Rates'!F136","v":6153.9974203649808},{"$f":"'WK5a - Impact on Rates'!G136","v":6430.9213774322307},{"$f":"'WK5a - Impact on Rates'!H136","v":6720.3168252120413},{"$f":"'WK5a - Impact on Rates'!I136","v":7022.7285402461348},{"$f":"'WK5a - Impact on Rates'!J136","v":7198.2982924496919},{"$f":"'WK5a - Impact on Rates'!K136","v":7378.2534446199907},{"$f":"'WK5a - Impact on Rates'!L136","v":7562.7108423415939}]
[null,{"$f":"'WK5a - Impact on Rates'!C137","v":"Farmland"},null,null,null,null,null,{"$f":"'WK5a - Impact on Rates'!E157","v":"."},{"$f":"'WK5a - Impact on Rates'!F157","v":"."},{"$f":"'WK5a - Impact on Rates'!G157","v":"."},{"$f":"'WK5a - Impact on Rates'!H157","v":"."},{"$f":"'WK5a - Impact on Rates'!I157","v":"."},{"$f":"'WK5a - Impact on Rates'!J157","v":"."},{"$f":"'WK5a - Impact on Rates'!K157","v":"."},{"$f":"'WK5a - Impact on Rates'!L157","v":"."}]
[null,{"$f":"'WK5a - Impact on Rates'!C158","v":"Mining"},null,null,null,null,null,{"$f":"'WK5a - Impact on Rates'!E178","v":"."},{"$f":"'WK5a - Impact on Rates'!F178","v":"."},{"$f":"'WK5a - Impact on Rates'!G178","v":"."},{"$f":"'WK5a - Impact on Rates'!H178","v":"."},{"$f":"'WK5a - Impact on Rates'!I178","v":"."},{"$f":"'WK5a - Impact on Rates'!J178","v":"."},{"$f":"'WK5a - Impact on Rates'!K178","v":"."},{"$f":"'WK5a - Impact on Rates'!L178","v":"."}]
[]
[null,{"$f":"'WK5a - Impact on Rates'!C182","v":"Average Ordinary and Special Rates - without proposed special variation (assumed rate peg only)"}]
[null,{"$f":"'WK5a - Impact on Rates'!C185","v":"Residential"},null,null,null,null,null,{"$f":"'WK5a - Impact on Rates'!E215","v":1326.5348651722388},{"$f":"'WK5a - Impact on Rates'!F215","v":1359.6971966069486},{"$f":"'WK5a - Impact on Rates'!G215","v":1393.6915723180018},{"$f":"'WK5a - Impact on Rates'!H215","v":1428.537252866091},{"$f":"'WK5a - Impact on Rates'!I215","v":1464.2477168789928},{"$f":"'WK5a - Impact on Rates'!J215","v":1500.8494857289309},{"$f":"'WK5a - Impact on Rates'!K215","v":1538.3738642529411},{"$f":"'WK5a - Impact on Rates'!L215","v":1576.8352000325053}]
[null,{"$f":"'WK5a - Impact on Rates'!C216","v":"Business"},null,null,null,null,null,{"$f":"'WK5a - Impact on Rates'!E261","v":5897.3917803657705},{"$f":"'WK5a - Impact on Rates'!F261","v":6044.8280833194749},{"$f":"'WK5a - Impact on Rates'!G261","v":6195.9463055047399},{"$f":"'WK5a - Impact on Rates'!H261","v":6350.8449929319822},{"$f":"'WK5a - Impact on Rates'!I261","v":6509.6147339098625},{"$f":"'WK5a - Impact on Rates'!J261","v":6672.3588512389833},{"$f":"'WK5a - Impact on Rates'!K261","v":6839.1666235656076},{"$f":"'WK5a - Impact on Rates'!L261","v":7010.1471432729086}]
[null,{"$f":"'WK5a - Impact on Rates'!C262","v":"Farmland"},null,null,null,null,null,{"$f":"'WK5a - Impact on Rates'!E282","v":"."},{"$f":"'WK5a - Impact on Rates'!F282","v":"."},{"$f":"'WK5a - Impact on Rates'!G282","v":"."},{"$f":"'WK5a - Impact on Rates'!H282","v":"."},{"$f":"'WK5a - Impact on Rates'!I282","v":"."},{"$f":"'WK5a - Impact on Rates'!J282","v":"."},{"$f":"'WK5a - Impact on Rates'!K282","v":"."},{"$f":"'WK5a - Impact on Rates'!L282","v":"."}]
[null,{"$f":"'WK5a - Impact on Rates'!C283","v":"Mining"},null,null,null,null,null,{"$f":"'WK5a - Impact on Rates'!E303","v":"."},{"$f":"'WK5a - Impact on Rates'!F303","v":"."},{"$f":"'WK5a - Impact on Rates'!G303","v":"."},{"$f":"'WK5a - Impact on Rates'!H303","v":"."},{"$f":"'WK5a - Impact on Rates'!I303","v":"."},{"$f":"'WK5a - Impact on Rates'!J303","v":"."},{"$f":"'WK5a - Impact on Rates'!K303","v":"."},{"$f":"'WK5a - Impact on Rates'!L303","v":"."}]
[]
[]
[]
[]
[null,{"$f":"'WK6 - Expenditure Program'!$J$5","v":"WORKSHEET 6"}]
[null,{"$f":"'WK6 - Expenditure Program'!J7","v":"PROPOSED ADDITIONAL SPECIAL VARIATION INCOME AND EXPENDITURE"},null,null,null,null,null,{"$f":"'WK6 - Expenditure Program'!G26","v":"$ nominal per year"}]
[null,{"$f":"B$41","v":"Year number"},null,null,{"$f":"E$41","v":"Hist yr 3"},"Hist yr 2","Hist yr 1","Year 0","Year 1","Year 2","Year 3","Year 4","Year 5","Year 6","Year 7","Year 8","Year 9","Year 10",{"$f":"'WK6 - Expenditure Program'!Q24","v":"Sum of 10 years"}]
[null,{"$f":"B$42","v":"Financial year"},null,null,{"$f":"E$42","v":"2015-16"},"2016-17","2017-18","2018-19","2019-20","2020-21","2021-22","2022-23","2023-24","2024-25","2025-26","2026-27","2027-28","2028-29"]
[]
[]
[null,{"$f":"'WK6 - Expenditure Program'!C27","v":"Proposed SV income above rate peg"},null,null,null,null,null,null,{"$f":"'WK6 - Expenditure Program'!G27","v":453012.99531478807},{"$f":"'WK6 - Expenditure Program'!H27","v":937262.58629224077},{"$f":"'WK6 - Expenditure Program'!I27","v":1454900.0090183839},{"$f":"'WK6 - Expenditure Program'!J27","v":2007717.630925782},{"$f":"'WK6 - Expenditure Program'!K27","v":2057910.5716989264},{"$f":"'WK6 - Expenditure Program'!L27","v":2109358.3359913994},{"$f":"'WK6 - Expenditure Program'!M27","v":2162092.2943911841},{"$f":"'WK6 - Expenditure Program'!N27","v":2216144.6017509634},{"$f":"'WK6 - Expenditure Program'!O27","v":2271548.2167947371},{"$f":"'WK6 - Expenditure Program'!P27","v":2328336.9222146054},{"$f":"'WK6 - Expenditure Program'!Q27","v":17998284.164393008}]
[null,{"$f":"'WK6 - Expenditure Program'!C30","v":"Change in Operating Balance due to proposed SV"},null,null,null,null,null,null,{"$f":"'WK6 - Expenditure Program'!G30","v":453012.99531478807},{"$f":"'WK6 - Expenditure Program'!H30","v":937262.58629224077},{"$f":"'WK6 - Expenditure Program'!I30","v":1454900.0090183839},{"$f":"'WK6 - Expenditure Program'!J30","v":2007717.630925782},{"$f":"'WK6 - Expenditure Program'!K30","v":2057910.5716989264},{"$f":"'WK6 - Expenditure Program'!L30","v":2109358.3359913994},{"$f":"'WK6 - Expenditure Program'!M30","v":2162092.2943911841},{"$f":"'WK6 - Expenditure Program'!N30","v":2216144.6017509634},{"$f":"'WK6 - Expenditure Program'!O30","v":2271548.2167947371},{"$f":"'WK6 - Expenditure Program'!P30","v":2328336.9222146054},{"$f":"'WK6 - Expenditure Program'!Q30","v":17998284.164393008}]
[]
[null,{"$f":"'WK6 - Expenditure Program'!C32","v":"Operating expenses (including loan interest costs)"}]
[null,{"$f":"'WK6 - Expenditure Program'!C33","v":"Fund existing service levels (eg, libraries)"},null,null,null,null,null,null,{"$f":"SUM('WK6 - Expenditure Program'!G34:G48)","v":0},{"$f":"SUM('WK6 - Expenditure Program'!H34:H48)","v":0},{"$f":"SUM('WK6 - Expenditure Program'!I34:I48)","v":0},{"$f":"SUM('WK6 - Expenditure Program'!J34:J48)","v":0},{"$f":"SUM('WK6 - Expenditure Program'!K34:K48)","v":0},{"$f":"SUM('WK6 - Expenditure Program'!L34:L48)","v":0},{"$f":"SUM('WK6 - Expenditure Program'!M34:M48)","v":0},{"$f":"SUM('WK6 - Expenditure Program'!N34:N48)","v":0},{"$f":"SUM('WK6 - Expenditure Program'!O34:O48)","v":0},{"$f":"SUM('WK6 - Expenditure Program'!P34:P48)","v":0},{"$f":"SUM('WK6 - Expenditure Program'!Q34:Q48)","v":0}]
[null,{"$f":"'WK6 - Expenditure Program'!C49","v":"Fund new/enhanced service levels (eg, sustainability program)"},null,null,null,null,null,null,{"$f":"SUM('WK6 - Expenditure Program'!G50:G64)","v":0},{"$f":"SUM('WK6 - Expenditure Program'!H50:H64)","v":0},{"$f":"SUM('WK6 - Expenditure Program'!I50:I64)","v":0},{"$f":"SUM('WK6 - Expenditure Program'!J50:J64)","v":0},{"$f":"SUM('WK6 - Expenditure Program'!K50:K64)","v":0},{"$f":"SUM('WK6 - Expenditure Program'!L50:L64)","v":0},{"$f":"SUM('WK6 - Expenditure Program'!M50:M64)","v":0},{"$f":"SUM('WK6 - Expenditure Program'!N50:N64)","v":0},{"$f":"SUM('WK6 - Expenditure Program'!O50:O64)","v":0},{"$f":"SUM('WK6 - Expenditure Program'!P50:P64)","v":0},{"$f":"SUM('WK6 - Expenditure Program'!Q50:Q64)","v":0}]
[null,{"$f":"'WK6 - Expenditure Program'!C65","v":"Annual total"},null,null,null,null,null,null,{"$f":"'WK6 - Expenditure Program'!G65","v":0},{"$f":"'WK6 - Expenditure Program'!H65","v":0},{"$f":"'WK6 - Expenditure Program'!I65","v":0},{"$f":"'WK6 - Expenditure Program'!J65","v":0},{"$f":"'WK6 - Expenditure Program'!K65","v":0},{"$f":"'WK6 - Expenditure Program'!L65","v":0},{"$f":"'WK6 - Expenditure Program'!M65","v":0},{"$f":"'WK6 - Expenditure Program'!N65","v":0},{"$f":"'WK6 - Expenditure Program'!O65","v":0},{"$f":"'WK6 - Expenditure Program'!P65","v":0},{"$f":"'WK6 - Expenditure Program'!Q65","v":0}]
[null,{"$f":"'WK6 - Expenditure Program'!C66","v":"Cumulative totals by year"},null,null,null,null,null,null,{"$f":"'WK6 - Expenditure Program'!G66","v":0},{"$f":"'WK6 - Expenditure Program'!H66","v":0},{"$f":"'WK6 - Expenditure Program'!I66","v":0},{"$f":"'WK6 - Expenditure Program'!J66","v":0},{"$f":"'WK6 - Expenditure Program'!K66","v":0},{"$f":"'WK6 - Expenditure Program'!L66","v":0},{"$f":"'WK6 - Expenditure Program'!M66","v":0},{"$f":"'WK6 - Expenditure Program'!N66","v":0},{"$f":"'WK6 - Expenditure Program'!O66","v":0},{"$f":"'WK6 - Expenditure Program'!P66","v":0}]
[null,"check = 0",null,null,null,null,null,null,{"$f":"SUM($I132:I133)-I135","v":0},{"$f":"SUM($I132:J133)-J135","v":0},{"$f":"SUM($I132:K133)-K135","v":0},{"$f":"SUM($I132:L133)-L135","v":0},{"$f":"SUM($I132:M133)-M135","v":0},{"$f":"SUM($I132:N133)-N135","v":0},{"$f":"SUM($I132:O133)-O135","v":0},{"$f":"SUM($I132:P133)-P135","v":0},{"$f":"SUM($I132:Q133)-Q135","v":0},{"$f":"SUM($I132:R133)-R135","v":0},{"$f":"R135-S134","v":0}]
[]
[null,{"$f":"'WK6 - Expenditure Program'!C68","v":"Capital expenditure"}]
[null,{"$f":"'WK6 - Expenditure Program'!C70","v":"Renewals:"},null,null,null,null,null,null,{"$f":"SUM('WK6 - Expenditure Program'!G71:G82)","v":453013},{"$f":"SUM('WK6 - Expenditure Program'!H71:H82)","v":937263},{"$f":"SUM('WK6 - Expenditure Program'!I71:I82)","v":1454900},{"$f":"SUM('WK6 - Expenditure Program'!J71:J82)","v":2007718},{"$f":"SUM('WK6 - Expenditure Program'!K71:K82)","v":2057911},{"$f":"SUM('WK6 - Expenditure Program'!L71:L82)","v":2109358},{"$f":"SUM('WK6 - Expenditure Program'!M71:M82)","v":2162092},{"$f":"SUM('WK6 - Expenditure Program'!N71:N82)","v":2216145},{"$f":"SUM('WK6 - Expenditure Program'!O71:O82)","v":2271548},{"$f":"SUM('WK6 - Expenditure Program'!P71:P82)","v":2328337},{"$f":"SUM('WK6 - Expenditure Program'!Q71:Q82)","v":17998285}]
[null,{"$f":"'WK6 - Expenditure Program'!C83","v":"New assets"},null,null,null,null,null,null,{"$f":"SUM('WK6 - Expenditure Program'!G84:G94)","v":0},{"$f":"SUM('WK6 - Expenditure Program'!H84:H94)","v":0},{"$f":"SUM('WK6 - Expenditure Program'!I84:I94)","v":0},{"$f":"SUM('WK6 - Expenditure Program'!J84:J94)","v":0},{"$f":"SUM('WK6 - Expenditure Program'!K84:K94)","v":0},{"$f":"SUM('WK6 - Expenditure Program'!L84:L94)","v":0},{"$f":"SUM('WK6 - Expenditure Program'!M84:M94)","v":0},{"$f":"SUM('WK6 - Expenditure Program'!N84:N94)","v":0},{"$f":"SUM('WK6 - Expenditure Program'!O84:O94)","v":0},{"$f":"SUM('WK6 - Expenditure Program'!P84:P94)","v":0},{"$f":"SUM('WK6 - Expenditure Program'!Q84:Q94)","v":0}]
[null,{"$f":"'WK6 - Expenditure Program'!C95","v":"Annual total"},null,null,null,null,null,null,{"$f":"'WK6 - Expenditure Program'!G95","v":453013},{"$f":"'WK6 - Expenditure Program'!H95","v":937263},{"$f":"'WK6 - Expenditure Program'!I95","v":1454900},{"$f":"'WK6 - Expenditure Program'!J95","v":2007718},{"$f":"'WK6 - Expenditure Program'!K95","v":2057911},{"$f":"'WK6 - Expenditure Program'!L95","v":2109358},{"$f":"'WK6 - Expenditure Program'!M95","v":2162092},{"$f":"'WK6 - Expenditure Program'!N95","v":2216145},{"$f":"'WK6 - Expenditure Program'!O95","v":2271548},{"$f":"'WK6 - Expenditure Program'!P95","v":2328337},{"$f":"'WK6 - Expenditure Program'!Q95","v":17998285}]
[null,{"$f":"'WK6 - Expenditure Program'!C96","v":"Cumulative totals by year"},null,null,null,null,null,null,{"$f":"'WK6 - Expenditure Program'!G96","v":453013},{"$f":"'WK6 - Expenditure Program'!H96","v":1390276},{"$f":"'WK6 - Expenditure Program'!I96","v":2845176},{"$f":"'WK6 - Expenditure Program'!J96","v":4852894},{"$f":"'WK6 - Expenditure Program'!K96","v":6910805},{"$f":"'WK6 - Expenditure Program'!L96","v":9020163},{"$f":"'WK6 - Expenditure Program'!M96","v":11182255},{"$f":"'WK6 - Expenditure Program'!N96","v":13398400},{"$f":"'WK6 - Expenditure Program'!O96","v":15669948},{"$f":"'WK6 - Expenditure Program'!P96","v":17998285}]
[null,"check = 0",null,null,null,null,null,null,{"$f":"SUM($I139:I140)-I142","v":0},{"$f":"SUM($I139:J140)-J142","v":0},{"$f":"SUM($I139:K140)-K142","v":0},{"$f":"SUM($I139:L140)-L142","v":0},{"$f":"SUM($I139:M140)-M142","v":0},{"$f":"SUM($I139:N140)-N142","v":0},{"$f":"SUM($I139:O140)-O142","v":0},{"$f":"SUM($I139:P140)-P142","v":0},{"$f":"SUM($I139:Q140)-Q142","v":0},{"$f":"SUM($I139:R140)-R142","v":0},{"$f":"R142-S141","v":0}]
[]
[null,{"$f":"'WK6 - Expenditure Program'!C98","v":"Other uses of proposed SV income (eg, loan principal repayments, transfers to reserves)"}]
[null,{"$f":"'WK6 - Expenditure Program'!C110","v":"Annual total"},null,null,null,null,null,null,{"$f":"'WK6 - Expenditure Program'!G110","v":0},{"$f":"'WK6 - Expenditure Program'!H110","v":0},{"$f":"'WK6 - Expenditure Program'!I110","v":0},{"$f":"'WK6 - Expenditure Program'!J110","v":0},{"$f":"'WK6 - Expenditure Program'!K110","v":0},{"$f":"'WK6 - Expenditure Program'!L110","v":0},{"$f":"'WK6 - Expenditure Program'!M110","v":0},{"$f":"'WK6 - Expenditure Program'!N110","v":0},{"$f":"'WK6 - Expenditure Program'!O110","v":0},{"$f":"'WK6 - Expenditure Program'!P110","v":0},{"$f":"'WK6 - Expenditure Program'!Q110","v":0}]
[null,{"$f":"'WK6 - Expenditure Program'!C111","v":"Cumulative totals by year"},null,null,null,null,null,null,{"$f":"'WK6 - Expenditure Program'!G111","v":0},{"$f":"'WK6 - Expenditure Program'!H111","v":0},{"$f":"'WK6 - Expenditure Program'!I111","v":0},{"$f":"'WK6 - Expenditure Program'!J111","v":0},{"$f":"'WK6 - Expenditure Program'!K111","v":0},{"$f":"'WK6 - Expenditure Program'!L111","v":0},{"$f":"'WK6 - Expenditure Program'!M111","v":0},{"$f":"'WK6 - Expenditure Program'!N111","v":0},{"$f":"'WK6 - Expenditure Program'!O111","v":0},{"$f":"'WK6 - Expenditure Program'!P111","v":0}]
[null,"check = 0",null,null,null,null,null,null,null,null,null,null,null,null,null,null,null,null,{"$f":"R147-S146","v":0}]
[]
[null,{"$f":"'WK6 - Expenditure Program'!C113","v":"Total   "}]
[null,{"$f":"'WK6 - Expenditure Program'!C114","v":"Total use of proposed SV income"},null,null,null,null,null,null,{"$f":"'WK6 - Expenditure Program'!G114","v":453013},{"$f":"'WK6 - Expenditure Program'!H114","v":937263},{"$f":"'WK6 - Expenditure Program'!I114","v":1454900},{"$f":"'WK6 - Expenditure Program'!J114","v":2007718},{"$f":"'WK6 - Expenditure Program'!K114","v":2057911},{"$f":"'WK6 - Expenditure Program'!L114","v":2109358},{"$f":"'WK6 - Expenditure Program'!M114","v":2162092},{"$f":"'WK6 - Expenditure Program'!N114","v":2216145},{"$f":"'WK6 - Expenditure Program'!O114","v":2271548},{"$f":"'WK6 - Expenditure Program'!P114","v":2328337},{"$f":"'WK6 - Expenditure Program'!Q114","v":17998285}]
[null,{"$f":"'WK6 - Expenditure Program'!C115","v":"Difference between additional SRV income and its uses"},null,null,null,null,null,null,{"$f":"'WK6 - Expenditure Program'!G115","v":-4.6852119266986847E-3},{"$f":"'WK6 - Expenditure Program'!H115","v":-0.41370775923132896},{"$f":"'WK6 - Expenditure Program'!I115","v":9.0183839201927185E-3},{"$f":"'WK6 - Expenditure Program'!J115","v":-0.36907421797513962},{"$f":"'WK6 - Expenditure Program'!K115","v":-0.42830107361078262},{"$f":"'WK6 - Expenditure Program'!L115","v":0.3359913993626833},{"$f":"'WK6 - Expenditure Program'!M115","v":0.29439118411391973},{"$f":"'WK6 - Expenditure Program'!N115","v":-0.39824903663247824},{"$f":"'WK6 - Expenditure Program'!O115","v":0.21679473714902997},{"$f":"'WK6 - Expenditure Program'!P115","v":-7.7785394620150328E-2},{"$f":"'WK6 - Expenditure Program'!Q115","v":-0.83560698945075274}]
[null,"check = 0"]
[null,"check = 0",null,null,null,null,null,null,{"$f":"I151-I146-I141-I134","v":0},{"$f":"J151-J146-J141-J134","v":0},0,0,0,0,0,0,0,0,{"$f":"S151-S146-S141-S134","v":0}]
[null,null,null,null,null,null,null,null,{"$f":"I128-I151-I152","v":0},{"$f":"J128-J151-J152","v":0},0,0,0,0,0,0,0,0,-2.7939677238464355E-9]
[]
[]
[]
[]
[null,{"$f":"'WK7 - Historical financials'!F5","v":"WORKSHEET 7"}]
[null,{"$f":"'WK7 - Historical financials'!F7","v":"HISTORICAL FINANCIAL INFORMATION"},null,null,{"$f":"'WK7 - Historical financials'!I71","v":"$'000 nominal"}]
[null,{"$f":"B$41","v":"Year number"},null,null,{"$f":"E$41","v":"Hist yr 3"},"Hist yr 2","Hist yr 1","Year 0","Year 1","Year 2","Year 3","Year 4","Year 5","Year 6","Year 7","Year 8","Year 9","Year 10"]
[null,{"$f":"B$42","v":"Financial year"},null,null,{"$f":"E$42","v":"2015-16"},"2016-17","2017-18","2018-19","2019-20","2020-21","2021-22","2022-23","2023-24","2024-25","2025-26","2026-27","2027-28","2028-29"]
[]
[]
[null,{"$f":"'WK7 - Historical financials'!C71","v":"Cash and investments"}]
[null,{"$f":"'WK7 - Historical financials'!C72","v":"Source:"},{"$f":"'WK7 - Historical financials'!D72","v":"Note 6a, 6b, 6c"}]
[]
[null,{"$f":"'WK7 - Historical financials'!C75","v":"6a - Cash and cash equivalents"}]
[null,{"$f":"'WK7 - Historical financials'!C76","v":"Cash on hand and at bank"},null,null,null,null,{"$f":"'WK7 - Historical financials'!I76","v":4064}]
[null,{"$f":"'WK7 - Historical financials'!C77","v":"Cash-equivalent assets"},null,null,null,null,{"$f":"'WK7 - Historical financials'!I77","v":3123}]
[null,{"$f":"'WK7 - Historical financials'!C78","v":"Total"},null,null,null,null,{"$f":"'WK7 - Historical financials'!I78","v":7187}]
[]
[null,{"$f":"'WK7 - Historical financials'!C80","v":"6b - Investments"}]
[null,{"$f":"'WK7 - Historical financials'!C81","v":"Current"},null,null,null,null,{"$f":"'WK7 - Historical financials'!I81","v":40000}]
[null,{"$f":"'WK7 - Historical financials'!C82","v":"Non-current"},null,null,null,null,{"$f":"'WK7 - Historical financials'!I82","v":10000}]
[null,{"$f":"'WK7 - Historical financials'!C83","v":"Total"},null,null,null,null,{"$f":"'WK7 - Historical financials'!I83","v":50000}]
[]
[null,{"$f":"'WK7 - Historical financials'!C85","v":"Total cash, cash equivalents, and investments"},null,null,null,null,{"$f":"'WK7 - Historical financials'!I85","v":57187}]
[null,"check = 0",null,null,null,null,{"$f":"G179-SUM(G170:G171,G175:G176)","v":0}]
[null,{"$f":"'WK7 - Historical financials'!C87","v":"6c Restricted cash, cash equivalents, and investments"}]
[null,{"$f":"'WK7 - Historical financials'!C88","v":"External restrictions"},null,null,null,null,{"$f":"'WK7 - Historical financials'!I88","v":22673}]
[null,{"$f":"'WK7 - Historical financials'!C89","v":"Internal restrictions"},null,null,null,null,{"$f":"'WK7 - Historical financials'!I89","v":28701}]
[null,{"$f":"'WK7 - Historical financials'!C90","v":"Unrestricted"},null,null,null,null,{"$f":"'WK7 - Historical financials'!I90","v":5813}]
[null,{"$f":"'WK7 - Historical financials'!C91","v":"Total"},null,null,null,null,{"$f":"'WK7 - Historical financials'!I91","v":57187}]
[null,null,null,null,null,null,{"$f":"G185-G179","v":0}]
[]
[null,{"$f":"'WK7 - Historical financials'!C97","v":"Balance sheet extract (General fund)"}]
[null,{"$f":"'WK7 - Historical financials'!C98","v":"Source:"},{"$f":"'WK7 - Historical financials'!D98","v":"Notes to financial statements"}]
[]
[null,{"$f":"'WK7 - Historical financials'!C101","v":"Assets"}]
[null,{"$f":"'WK7 - Historical financials'!C102","v":"Cash and cash equivalents"},null,null,null,null,{"$f":"'WK7 - Historical financials'!I102","v":47187}]
[null,{"$f":"'WK7 - Historical financials'!C103","v":"Receivables - current"},null,null,null,null,{"$f":"'WK7 - Historical financials'!I103","v":4724}]
[null,{"$f":"'WK7 - Historical financials'!C104","v":"Receivables - non current"},null,null,null,null,{"$f":"'WK7 - Historical financials'!I104","v":0}]
[null,{"$f":"'WK7 - Historical financials'!C105","v":"Total "},null,null,null,null,{"$f":"'WK7 - Historical financials'!I105","v":51911}]
[null,"check = 0",null,null,null,null,{"$f":"G195-SUM(G192:G194)","v":0}]
[null,{"$f":"'WK7 - Historical financials'!C107","v":"Liabilities"}]
[null,{"$f":"'WK7 - Historical financials'!C108","v":"Payables - current"},null,null,null,null,{"$f":"'WK7 - Historical financials'!I108","v":9713}]
[null,{"$f":"'WK7 - Historical financials'!C109","v":"Payables - non current"},null,null,null,null,{"$f":"'WK7 - Historical financials'!I109","v":0}]
[null,{"$f":"'WK7 - Historical financials'!C110","v":"Borrowings - current"},null,null,null,null,{"$f":"'WK7 - Historical financials'!I110","v":574}]
[null,{"$f":"'WK7 - Historical financials'!C111","v":"Borrowings - non current"},null,null,null,null,{"$f":"'WK7 - Historical financials'!I111","v":5920}]
[null,{"$f":"'WK7 - Historical financials'!C112","v":"Total "},null,null,null,null,{"$f":"'WK7 - Historical financials'!I112","v":16207}]
[null,"check = 0",null,null,null,null,{"$f":"G202-SUM(G198:G201)","v":0}]
[]
[]
[]
[]
[null,{"$f":"'WK8 - Long Term Financial Plan'!I5","v":"WORKSHEET 8"}]
[null,{"$f":"'WK8 - Long Term Financial Plan'!I7","v":"LONG TERM FINANCIAL PLAN - SV SCENARIO AND BASE CASE"}]
[null,{"$f":"B$41","v":"Year number"},null,null,{"$f":"E$41","v":"Hist yr 3"},"Hist yr 2","Hist yr 1","Year 0","Year 1","Year 2","Year 3","Year 4","Year 5","Year 6","Year 7","Year 8","Year 9","Year 10",{"$f":"'WK8 - Long Term Financial Plan'!Q17","v":"Sum of 10 years"},null,{"$f":"'WK8 - Long Term Financial Plan'!S17","v":"  Change over 10 years"},null,"check = 0"]
[null,{"$f":"B$42","v":"Financial year"},null,null,{"$f":"E$42","v":"2015-16"},"2016-17","2017-18","2018-19","2019-20","2020-21","2021-22","2022-23","2023-24","2024-25","2025-26","2026-27","2027-28","2028-29",null,null,{"$f":"'WK8 - Long Term Financial Plan'!S18","v":"$"},{"$f":"'WK8 - Long Term Financial Plan'!T18","v":"%"}]
[]
[null,{"$f":"'WK8 - Long Term Financial Plan'!C16","v":"SCENARIO 1: Proposed additional SV income and expenditure"}]
[null,{"$f":"'WK8 - Long Term Financial Plan'!C32","v":"Total Income Continuing Operations"},null,null,null,null,null,{"$f":"'WK8 - Long Term Financial Plan'!F32","v":62854133},{"$f":"'WK8 - Long Term Financial Plan'!G32","v":56992405},{"$f":"'WK8 - Long Term Financial Plan'!H32","v":59330876},{"$f":"'WK8 - Long Term Financial Plan'!I32","v":61180051},{"$f":"'WK8 - Long Term Financial Plan'!J32","v":61982053},{"$f":"'WK8 - Long Term Financial Plan'!K32","v":63830387},{"$f":"'WK8 - Long Term Financial Plan'!L32","v":65703770},{"$f":"'WK8 - Long Term Financial Plan'!M32","v":67834656},{"$f":"'WK8 - Long Term Financial Plan'!N32","v":69381647},{"$f":"'WK8 - Long Term Financial Plan'!O32","v":71344565},{"$f":"'WK8 - Long Term Financial Plan'!P32","v":73164934},{"$f":"'WK8 - Long Term Financial Plan'!Q32","v":650745344},null,{"$f":"'WK8 - Long Term Financial Plan'!S32","v":10310801},{"$f":"'WK8 - Long Term Financial Plan'!T32","v":0.16404332552005768},{"$f":"R214-H214-U214","v":0}]
[null,{"$f":"'WK8 - Long Term Financial Plan'!C34","v":"Income excluding capital grants and contributions"},null,null,null,null,null,{"$f":"'WK8 - Long Term Financial Plan'!F34","v":48097045},{"$f":"'WK8 - Long Term Financial Plan'!G34","v":49462405},{"$f":"'WK8 - Long Term Financial Plan'!H34","v":51790876},{"$f":"'WK8 - Long Term Financial Plan'!I34","v":54104131},{"$f":"'WK8 - Long Term Financial Plan'!J34","v":56364874},{"$f":"'WK8 - Long Term Financial Plan'!K34","v":58116566},{"$f":"'WK8 - Long Term Financial Plan'!L34","v":59852940},{"$f":"'WK8 - Long Term Financial Plan'!M34","v":61796447},{"$f":"'WK8 - Long Term Financial Plan'!N34","v":63505686},{"$f":"'WK8 - Long Term Financial Plan'!O34","v":65425445},{"$f":"'WK8 - Long Term Financial Plan'!P34","v":67202223},{"$f":"'WK8 - Long Term Financial Plan'!Q34","v":587621593},null,{"$f":"'WK8 - Long Term Financial Plan'!S34","v":19105178},{"$f":"'WK8 - Long Term Financial Plan'!T34","v":0.39722145092281658},{"$f":"R215-H215-U215","v":0}]
[null,{"$f":"'WK8 - Long Term Financial Plan'!C47","v":"Total expenses continuing operations"},null,null,null,null,null,{"$f":"'WK8 - Long Term Financial Plan'!F47","v":49803643},{"$f":"'WK8 - Long Term Financial Plan'!G47","v":50138642},{"$f":"'WK8 - Long Term Financial Plan'!H47","v":51389941},{"$f":"'WK8 - Long Term Financial Plan'!I47","v":52327912},{"$f":"'WK8 - Long Term Financial Plan'!J47","v":53757726},{"$f":"'WK8 - Long Term Financial Plan'!K47","v":55082843},{"$f":"'WK8 - Long Term Financial Plan'!L47","v":56793701},{"$f":"'WK8 - Long Term Financial Plan'!M47","v":58688165},{"$f":"'WK8 - Long Term Financial Plan'!N47","v":60002396},{"$f":"'WK8 - Long Term Financial Plan'!O47","v":61653075},{"$f":"'WK8 - Long Term Financial Plan'!P47","v":63213872},{"$f":"'WK8 - Long Term Financial Plan'!Q47","v":563048273},null,{"$f":"'WK8 - Long Term Financial Plan'!S47","v":13410229},{"$f":"'WK8 - Long Term Financial Plan'!T47","v":0.26926200960841357},{"$f":"R216-H216-U216","v":0}]
[null,{"$f":"'WK8 - Long Term Financial Plan'!C51","v":"Operating result from continuing operations"},null,null,null,null,null,{"$f":"'WK8 - Long Term Financial Plan'!F51","v":13050490},{"$f":"'WK8 - Long Term Financial Plan'!G51","v":6853763},{"$f":"'WK8 - Long Term Financial Plan'!H51","v":7940935},{"$f":"'WK8 - Long Term Financial Plan'!I51","v":8852139},{"$f":"'WK8 - Long Term Financial Plan'!J51","v":8224327},{"$f":"'WK8 - Long Term Financial Plan'!K51","v":8747544},{"$f":"'WK8 - Long Term Financial Plan'!L51","v":8910069},{"$f":"'WK8 - Long Term Financial Plan'!M51","v":9146491},{"$f":"'WK8 - Long Term Financial Plan'!N51","v":9379251},{"$f":"'WK8 - Long Term Financial Plan'!O51","v":9691490},{"$f":"'WK8 - Long Term Financial Plan'!P51","v":9951062},{"$f":"'WK8 - Long Term Financial Plan'!Q51","v":87697071},null,{"$f":"'WK8 - Long Term Financial Plan'!S51","v":-3099428},{"$f":"'WK8 - Long Term Financial Plan'!T51","v":-0.23749514386049872},{"$f":"R217-H217-U217","v":0}]
[null,{"$f":"'WK8 - Long Term Financial Plan'!C52","v":"Net operating result before capital grants and contributions"},null,null,null,null,null,{"$f":"'WK8 - Long Term Financial Plan'!F52","v":-1706598},{"$f":"'WK8 - Long Term Financial Plan'!G52","v":-676237},{"$f":"'WK8 - Long Term Financial Plan'!H52","v":400935},{"$f":"'WK8 - Long Term Financial Plan'!I52","v":1776219},{"$f":"'WK8 - Long Term Financial Plan'!J52","v":2607148},{"$f":"'WK8 - Long Term Financial Plan'!K52","v":3033723},{"$f":"'WK8 - Long Term Financial Plan'!L52","v":3059239},{"$f":"'WK8 - Long Term Financial Plan'!M52","v":3108282},{"$f":"'WK8 - Long Term Financial Plan'!N52","v":3503290},{"$f":"'WK8 - Long Term Financial Plan'!O52","v":3772370},{"$f":"'WK8 - Long Term Financial Plan'!P52","v":3988351},{"$f":"'WK8 - Long Term Financial Plan'!Q52","v":24573320},null,{"$f":"'WK8 - Long Term Financial Plan'!S52","v":5694949},{"$f":"'WK8 - Long Term Financial Plan'!T52","v":-3.3370184425388989},{"$f":"R218-H218-U218","v":0}]
[null,"check = 0",null,null,null,null,null,{"$f":"H215-H216-H218","v":0},{"$f":"I215-I216-I218","v":0},0,0,0,0,0,0,0,0,0,0,null,{"$f":"R218-H218-U218","v":0},{"$f":"R218/H218-1-V218","v":0}]
[]
[null,{"$f":"'WK8 - Long Term Financial Plan'!C61","v":"SCENARIO 2: Base case -  no SV income or expenditure"}]
[null,{"$f":"'WK8 - Long Term Financial Plan'!C77","v":"Total Income Continuing Operations"},null,null,null,null,null,{"$f":"'WK8 - Long Term Financial Plan'!F77","v":62854133},{"$f":"'WK8 - Long Term Financial Plan'!G77","v":56539391},{"$f":"'WK8 - Long Term Financial Plan'!H77","v":58393613},{"$f":"'WK8 - Long Term Financial Plan'!I77","v":59725151},{"$f":"'WK8 - Long Term Financial Plan'!J77","v":59974335},{"$f":"'WK8 - Long Term Financial Plan'!K77","v":61772476},{"$f":"'WK8 - Long Term Financial Plan'!L77","v":63594412},{"$f":"'WK8 - Long Term Financial Plan'!M77","v":65672564},{"$f":"'WK8 - Long Term Financial Plan'!N77","v":67165502},{"$f":"'WK8 - Long Term Financial Plan'!O77","v":69073017},{"$f":"'WK8 - Long Term Financial Plan'!P77","v":70836597},{"$f":"'WK8 - Long Term Financial Plan'!Q77","v":632747058},null,{"$f":"'WK8 - Long Term Financial Plan'!S77","v":7982464},{"$f":"'WK8 - Long Term Financial Plan'!T77","v":0.12699982672579382},{"$f":"R222-H222-U222","v":0}]
[null,{"$f":"'WK8 - Long Term Financial Plan'!C79","v":"Income excluding capital grants and contributions"},null,null,null,null,null,{"$f":"'WK8 - Long Term Financial Plan'!F79","v":48097045},{"$f":"'WK8 - Long Term Financial Plan'!G79","v":49009391},{"$f":"'WK8 - Long Term Financial Plan'!H79","v":50853613},{"$f":"'WK8 - Long Term Financial Plan'!I79","v":52649231},{"$f":"'WK8 - Long Term Financial Plan'!J79","v":54357156},{"$f":"'WK8 - Long Term Financial Plan'!K79","v":56058655},{"$f":"'WK8 - Long Term Financial Plan'!L79","v":57743582},{"$f":"'WK8 - Long Term Financial Plan'!M79","v":59634355},{"$f":"'WK8 - Long Term Financial Plan'!N79","v":61289541},{"$f":"'WK8 - Long Term Financial Plan'!O79","v":63153897},{"$f":"'WK8 - Long Term Financial Plan'!P79","v":64873886},{"$f":"'WK8 - Long Term Financial Plan'!Q79","v":569623307},null,{"$f":"'WK8 - Long Term Financial Plan'!S79","v":16776841},{"$f":"'WK8 - Long Term Financial Plan'!T79","v":0.34881230229424698},0]
[null,{"$f":"'WK8 - Long Term Financial Plan'!C92","v":"Total expenses continuing operations"},null,null,null,null,null,{"$f":"'WK8 - Long Term Financial Plan'!F92","v":49803643},{"$f":"'WK8 - Long Term Financial Plan'!G92","v":50138642},{"$f":"'WK8 - Long Term Financial Plan'!H92","v":51389941},{"$f":"'WK8 - Long Term Financial Plan'!I92","v":52327912},{"$f":"'WK8 - Long Term Financial Plan'!J92","v":53757726},{"$f":"'WK8 - Long Term Financial Plan'!K92","v":55082843},{"$f":"'WK8 - Long Term Financial Plan'!L92","v":56793701},{"$f":"'WK8 - Long Term Financial Plan'!M92","v":58688165},{"$f":"'WK8 - Long Term Financial Plan'!N92","v":60002396},{"$f":"'WK8 - Long Term Financial Plan'!O92","v":61653075},{"$f":"'WK8 - Long Term Financial Plan'!P92","v":63213872},{"$f":"'WK8 - Long Term Financial Plan'!Q92","v":563048273},null,{"$f":"'WK8 - Long Term Financial Plan'!S92","v":13410229},{"$f":"'WK8 - Long Term Financial Plan'!T92","v":0.26926200960841357},0]
[null,{"$f":"'WK8 - Long Term Financial Plan'!C96","v":"Operating result from continuing operations"},null,null,null,null,null,{"$f":"'WK8 - Long Term Financial Plan'!F96","v":13050490},{"$f":"'WK8 - Long Term Financial Plan'!G96","v":6400749},{"$f":"'WK8 - Long Term Financial Plan'!H96","v":7003672},{"$f":"'WK8 - Long Term Financial Plan'!I96","v":7397239},{"$f":"'WK8 - Long Term Financial Plan'!J96","v":6216609},{"$f":"'WK8 - Long Term Financial Plan'!K96","v":6689633},{"$f":"'WK8 - Long Term Financial Plan'!L96","v":6800711},{"$f":"'WK8 - Long Term Financial Plan'!M96","v":6984399},{"$f":"'WK8 - Long Term Financial Plan'!N96","v":7163106},{"$f":"'WK8 - Long Term Financial Plan'!O96","v":7419942},{"$f":"'WK8 - Long Term Financial Plan'!P96","v":7622725},{"$f":"'WK8 - Long Term Financial Plan'!Q96","v":69698785},null,{"$f":"'WK8 - Long Term Financial Plan'!S96","v":-5427765},{"$f":"'WK8 - Long Term Financial Plan'!T96","v":-0.41590507329609844},0]
[null,{"$f":"'WK8 - Long Term Financial Plan'!C97","v":"Net operating result before capital grants and contributions"},null,null,null,null,null,{"$f":"'WK8 - Long Term Financial Plan'!F97","v":-1706598},{"$f":"'WK8 - Long Term Financial Plan'!G97","v":-1129251},{"$f":"'WK8 - Long Term Financial Plan'!H97","v":-536328},{"$f":"'WK8 - Long Term Financial Plan'!I97","v":321319},{"$f":"'WK8 - Long Term Financial Plan'!J97","v":599430},{"$f":"'WK8 - Long Term Financial Plan'!K97","v":975812},{"$f":"'WK8 - Long Term Financial Plan'!L97","v":949881},{"$f":"'WK8 - Long Term Financial Plan'!M97","v":946190},{"$f":"'WK8 - Long Term Financial Plan'!N97","v":1287145},{"$f":"'WK8 - Long Term Financial Plan'!O97","v":1500822},{"$f":"'WK8 - Long Term Financial Plan'!P97","v":1660014},{"$f":"'WK8 - Long Term Financial Plan'!Q97","v":6575034},null,{"$f":"'WK8 - Long Term Financial Plan'!S97","v":3366612},{"$f":"'WK8 - Long Term Financial Plan'!T97","v":-1.9727035892459737},0]
[null,"check = 0",null,null,null,null,null,{"$f":"H223-H224-H226","v":0},{"$f":"I223-I224-I226","v":0},{"$f":"J223-J224-J226","v":0},{"$f":"K223-K224-K226","v":0},{"$f":"L223-L224-L226","v":0},{"$f":"M223-M224-M226","v":0},{"$f":"N223-N224-N226","v":0},{"$f":"O223-O224-O226","v":0},{"$f":"P223-P224-P226","v":0},{"$f":"Q223-Q224-Q226","v":0},{"$f":"R223-R224-R226","v":0},{"$f":"S223-S224-S226","v":0},null,{"$f":"R226-H226-U226","v":0},{"$f":"R226/H226-1-V226","v":0}]
[]
[null,{"$f":"'WK8 - Long Term Financial Plan'!C106","v":"SCENARIO 3: Hybrid case  - SV expenditure but no SV income "}]
[null,{"$f":"'WK8 - Long Term Financial Plan'!C122","v":"Total Income Continuing Operations"},null,null,null,null,null,{"$f":"'WK8 - Long Term Financial Plan'!F122","v":62854133},{"$f":"'WK8 - Long Term Financial Plan'!G122","v":56539391},{"$f":"'WK8 - Long Term Financial Plan'!H122","v":58393613},{"$f":"'WK8 - Long Term Financial Plan'!I122","v":59725151},{"$f":"'WK8 - Long Term Financial Plan'!J122","v":59974335},{"$f":"'WK8 - Long Term Financial Plan'!K122","v":61772476},{"$f":"'WK8 - Long Term Financial Plan'!L122","v":63594412},{"$f":"'WK8 - Long Term Financial Plan'!M122","v":65672564},{"$f":"'WK8 - Long Term Financial Plan'!N122","v":67165502},{"$f":"'WK8 - Long Term Financial Plan'!O122","v":69073017},{"$f":"'WK8 - Long Term Financial Plan'!P122","v":70836597},{"$f":"'WK8 - Long Term Financial Plan'!Q122","v":632747058},null,{"$f":"'WK8 - Long Term Financial Plan'!S122","v":7982464},{"$f":"'WK8 - Long Term Financial Plan'!T122","v":0.12699982672579382},{"$f":"R230-H230-U230","v":0}]
[null,{"$f":"'WK8 - Long Term Financial Plan'!C124","v":"Income excluding capital grants and contributions"},null,null,null,null,null,{"$f":"'WK8 - Long Term Financial Plan'!F124","v":48097045},{"$f":"'WK8 - Long Term Financial Plan'!G124","v":49009391},{"$f":"'WK8 - Long Term Financial Plan'!H124","v":50853613},{"$f":"'WK8 - Long Term Financial Plan'!I124","v":52649231},{"$f":"'WK8 - Long Term Financial Plan'!J124","v":54357156},{"$f":"'WK8 - Long Term Financial Plan'!K124","v":56058655},{"$f":"'WK8 - Long Term Financial Plan'!L124","v":57743582},{"$f":"'WK8 - Long Term Financial Plan'!M124","v":59634355},{"$f":"'WK8 - Long Term Financial Plan'!N124","v":61289541},{"$f":"'WK8 - Long Term Financial Plan'!O124","v":63153897},{"$f":"'WK8 - Long Term Financial Plan'!P124","v":64873886},{"$f":"'WK8 - Long Term Financial Plan'!Q124","v":569623307},null,{"$f":"'WK8 - Long Term Financial Plan'!S124","v":16776841},{"$f":"'WK8 - Long Term Financial Plan'!T124","v":0.34881230229424698},0]
[null,{"$f":"'WK8 - Long Term Financial Plan'!C137","v":"Total expenses continuing operations"},null,null,null,null,null,{"$f":"'WK8 - Long Term Financial Plan'!F137","v":49803643},{"$f":"'WK8 - Long Term Financial Plan'!G137","v":50138642},{"$f":"'WK8 - Long Term Financial Plan'!H137","v":51389941},{"$f":"'WK8 - Long Term Financial Plan'!I137","v":52327912},{"$f":"'WK8 - Long Term Financial Plan'!J137","v":53757726},{"$f":"'WK8 - Long Term Financial Plan'!K137","v":55082843},{"$f":"'WK8 - Long Term Financial Plan'!L137","v":56793701},{"$f":"'WK8 - Long Term Financial Plan'!M137","v":58688165},{"$f":"'WK8 - Long Term Financial Plan'!N137","v":60002396},{"$f":"'WK8 - Long Term Financial Plan'!O137","v":61653075},{"$f":"'WK8 - Long Term Financial Plan'!P137","v":63213872},{"$f":"'WK8 - Long Term Financial Plan'!Q137","v":563048273},null,{"$f":"'WK8 - Long Term Financial Plan'!S137","v":13410229},{"$f":"'WK8 - Long Term Financial Plan'!T137","v":0.26926200960841357},0]
[null,{"$f":"'WK8 - Long Term Financial Plan'!C141","v":"Operating result from continuing operations"},null,null,null,null,null,{"$f":"'WK8 - Long Term Financial Plan'!F141","v":13050490},{"$f":"'WK8 - Long Term Financial Plan'!G141","v":6400749},{"$f":"'WK8 - Long Term Financial Plan'!H141","v":7003672},{"$f":"'WK8 - Long Term Financial Plan'!I141","v":7397239},{"$f":"'WK8 - Long Term Financial Plan'!J141","v":6216609},{"$f":"'WK8 - Long Term Financial Plan'!K141","v":6689633},{"$f":"'WK8 - Long Term Financial Plan'!L141","v":6800711},{"$f":"'WK8 - Long Term Financial Plan'!M141","v":6984399},{"$f":"'WK8 - Long Term Financial Plan'!N141","v":7163106},{"$f":"'WK8 - Long Term Financial Plan'!O141","v":7419942},{"$f":"'WK8 - Long Term Financial Plan'!P141","v":7622725},{"$f":"'WK8 - Long Term Financial Plan'!Q141","v":69698785},null,{"$f":"'WK8 - Long Term Financial Plan'!S141","v":-5427765},{"$f":"'WK8 - Long Term Financial Plan'!T141","v":-0.41590507329609844},0]
[null,{"$f":"'WK8 - Long Term Financial Plan'!C142","v":"Net operating result before capital grants and contributions"},null,null,null,null,null,{"$f":"'WK8 - Long Term Financial Plan'!F142","v":-1706598},{"$f":"'WK8 - Long Term Financial Plan'!G142","v":-1129251},{"$f":"'WK8 - Long Term Financial Plan'!H142","v":-536328},{"$f":"'WK8 - Long Term Financial Plan'!I142","v":321319},{"$f":"'WK8 - Long Term Financial Plan'!J142","v":599430},{"$f":"'WK8 - Long Term Financial Plan'!K142","v":975812},{"$f":"'WK8 - Long Term Financial Plan'!L142","v":949881},{"$f":"'WK8 - Long Term Financial Plan'!M142","v":946190},{"$f":"'WK8 - Long Term Financial Plan'!N142","v":1287145},{"$f":"'WK8 - Long Term Financial Plan'!O142","v":1500822},{"$f":"'WK8 - Long Term Financial Plan'!P142","v":1660014},{"$f":"'WK8 - Long Term Financial Plan'!Q142","v":6575034},null,{"$f":"'WK8 - Long Term Financial Plan'!S142","v":3366612},{"$f":"'WK8 - Long Term Financial Plan'!T142","v":-1.9727035892459737},0]
[null,"check = 0",null,null,null,null,null,{"$f":"H231-H232-H234","v":0},{"$f":"I231-I232-I234","v":0},{"$f":"J231-J232-J234","v":0},{"$f":"K231-K232-K234","v":0},{"$f":"L231-L232-L234","v":0},{"$f":"M231-M232-M234","v":0},{"$f":"N231-N232-N234","v":0},{"$f":"O231-O232-O234","v":0},{"$f":"P231-P232-P234","v":0},{"$f":"Q231-Q232-Q234","v":0},{"$f":"R231-R232-R234","v":0},{"$f":"S231-S232-S234","v":0},null,{"$f":"R234-H234-U234","v":0},{"$f":"R234/H234-1-V234","v":0}]
[]
[null,{"$f":"'WK8 - Long Term Financial Plan'!C151","v":"Difference between Scenario 1 (with proposed SV income and expenditure) and Scenario 2 (base case - no SV income or expenditure)"}]
[null,{"$f":"'WK8 - Long Term Financial Plan'!C167","v":"Total Income Continuing Operations"},null,null,null,null,null,{"$f":"'WK8 - Long Term Financial Plan'!F167","v":0},{"$f":"'WK8 - Long Term Financial Plan'!G167","v":453014},{"$f":"'WK8 - Long Term Financial Plan'!H167","v":937263},{"$f":"'WK8 - Long Term Financial Plan'!I167","v":1454900},{"$f":"'WK8 - Long Term Financial Plan'!J167","v":2007718},{"$f":"'WK8 - Long Term Financial Plan'!K167","v":2057911},{"$f":"'WK8 - Long Term Financial Plan'!L167","v":2109358},{"$f":"'WK8 - Long Term Financial Plan'!M167","v":2162092},{"$f":"'WK8 - Long Term Financial Plan'!N167","v":2216145},{"$f":"'WK8 - Long Term Financial Plan'!O167","v":2271548},{"$f":"'WK8 - Long Term Financial Plan'!P167","v":2328337},{"$f":"'WK8 - Long Term Financial Plan'!Q167","v":17998286}]
[null,{"$f":"'WK8 - Long Term Financial Plan'!C169","v":"Income excluding capital grants and contributions"},null,null,null,null,null,{"$f":"'WK8 - Long Term Financial Plan'!F169","v":0},{"$f":"'WK8 - Long Term Financial Plan'!G169","v":453014},{"$f":"'WK8 - Long Term Financial Plan'!H169","v":937263},{"$f":"'WK8 - Long Term Financial Plan'!I169","v":1454900},{"$f":"'WK8 - Long Term Financial Plan'!J169","v":2007718},{"$f":"'WK8 - Long Term Financial Plan'!K169","v":2057911},{"$f":"'WK8 - Long Term Financial Plan'!L169","v":2109358},{"$f":"'WK8 - Long Term Financial Plan'!M169","v":2162092},{"$f":"'WK8 - Long Term Financial Plan'!N169","v":2216145},{"$f":"'WK8 - Long Term Financial Plan'!O169","v":2271548},{"$f":"'WK8 - Long Term Financial Plan'!P169","v":2328337},{"$f":"'WK8 - Long Term Financial Plan'!Q169","v":17998286}]
[null,{"$f":"'WK8 - Long Term Financial Plan'!C182","v":"Total expenses continuing operations"},null,null,null,null,null,{"$f":"'WK8 - Long Term Financial Plan'!F182","v":0},{"$f":"'WK8 - Long Term Financial Plan'!G182","v":0},{"$f":"'WK8 - Long Term Financial Plan'!H182","v":0},{"$f":"'WK8 - Long Term Financial Plan'!I182","v":0},{"$f":"'WK8 - Long Term Financial Plan'!J182","v":0},{"$f":"'WK8 - Long Term Financial Plan'!K182","v":0},{"$f":"'WK8 - Long Term Financial Plan'!L182","v":0},{"$f":"'WK8 - Long Term Financial Plan'!M182","v":0},{"$f":"'WK8 - Long Term Financial Plan'!N182","v":0},{"$f":"'WK8 - Long Term Financial Plan'!O182","v":0},{"$f":"'WK8 - Long Term Financial Plan'!P182","v":0},{"$f":"'WK8 - Long Term Financial Plan'!Q182","v":0}]
[null,{"$f":"'WK8 - Long Term Financial Plan'!C186","v":"Operating result from continuing operations"},null,null,null,null,null,{"$f":"'WK8 - Long Term Financial Plan'!F186","v":0},{"$f":"'WK8 - Long Term Financial Plan'!G186","v":453014},{"$f":"'WK8 - Long Term Financial Plan'!H186","v":937263},{"$f":"'WK8 - Long Term Financial Plan'!I186","v":1454900},{"$f":"'WK8 - Long Term Financial Plan'!J186","v":2007718},{"$f":"'WK8 - Long Term Financial Plan'!K186","v":2057911},{"$f":"'WK8 - Long Term Financial Plan'!L186","v":2109358},{"$f":"'WK8 - Long Term Financial Plan'!M186","v":2162092},{"$f":"'WK8 - Long Term Financial Plan'!N186","v":2216145},{"$f":"'WK8 - Long Term Financial Plan'!O186","v":2271548},{"$f":"'WK8 - Long Term Financial Plan'!P186","v":2328337},{"$f":"'WK8 - Long Term Financial Plan'!Q186","v":17998286}]
[null,{"$f":"'WK8 - Long Term Financial Plan'!C187","v":"Net operating result before capital grants and contributions"},null,null,null,null,null,{"$f":"'WK8 - Long Term Financial Plan'!F187","v":0},{"$f":"'WK8 - Long Term Financial Plan'!G187","v":453014},{"$f":"'WK8 - Long Term Financial Plan'!H187","v":937263},{"$f":"'WK8 - Long Term Financial Plan'!I187","v":1454900},{"$f":"'WK8 - Long Term Financial Plan'!J187","v":2007718},{"$f":"'WK8 - Long Term Financial Plan'!K187","v":2057911},{"$f":"'WK8 - Long Term Financial Plan'!L187","v":2109358},{"$f":"'WK8 - Long Term Financial Plan'!M187","v":2162092},{"$f":"'WK8 - Long Term Financial Plan'!N187","v":2216145},{"$f":"'WK8 - Long Term Financial Plan'!O187","v":2271548},{"$f":"'WK8 - Long Term Financial Plan'!P187","v":2328337},{"$f":"'WK8 - Long Term Financial Plan'!Q187","v":17998286}]
[null,"check = 0",null,null,null,null,null,{"$f":"H239-H240-H242","v":0},{"$f":"I239-I240-I242","v":0},{"$f":"J239-J240-J242","v":0},{"$f":"K239-K240-K242","v":0},{"$f":"L239-L240-L242","v":0},{"$f":"M239-M240-M242","v":0},{"$f":"N239-N240-N242","v":0},{"$f":"O239-O240-O242","v":0},{"$f":"P239-P240-P242","v":0},{"$f":"Q239-Q240-Q242","v":0},{"$f":"R239-R240-R242","v":0},{"$f":"S239-S240-S242","v":0}]
[null,"check = 0",null,null,null,null,null,{"$f":"H218-H226-H242","v":0},0,0,0,0,0,0,0,0,0,0,0]
[]
[]
[null,{"$f":"'WK8 - Long Term Financial Plan'!C196","v":"Key assumptions"},{"$f":"'WK8 - Long Term Financial Plan'!D201","v":"% pa"}]
[]
[null,{"$f":"'WK8 - Long Term Financial Plan'!C200","v":"Growth in labour costs"}]
[null,{"$f":"'WK8 - Long Term Financial Plan'!C201","v":"Scenario 1: Proposed (with SV)"},null,null,null,null,null,null,{"$f":"'WK8 - Long Term Financial Plan'!G201","v":8.5792330907040526E-2},{"$f":"'WK8 - Long Term Financial Plan'!H201","v":2.2624735414755737E-2},{"$f":"'WK8 - Long Term Financial Plan'!I201","v":2.4999983093863642E-2},{"$f":"'WK8 - Long Term Financial Plan'!J201","v":2.7199186552571808E-2},{"$f":"'WK8 - Long Term Financial Plan'!K201","v":2.8865272032385647E-2},{"$f":"'WK8 - Long Term Financial Plan'!L201","v":2.8928371233496009E-2},{"$f":"'WK8 - Long Term Financial Plan'!M201","v":2.9999979776285324E-2},{"$f":"'WK8 - Long Term Financial Plan'!N201","v":3.0000016100433458E-2},{"$f":"'WK8 - Long Term Financial Plan'!O201","v":3.0000028975442072E-2},{"$f":"'WK8 - Long Term Financial Plan'!P201","v":2.9999982973041739E-2}]
[null,{"$f":"'WK8 - Long Term Financial Plan'!C202","v":"Scenario 2 - Base case (no SV)"},null,null,null,null,null,null,{"$f":"'WK8 - Long Term Financial Plan'!G202","v":8.5792330907040526E-2},{"$f":"'WK8 - Long Term Financial Plan'!H202","v":2.2624735414755737E-2},{"$f":"'WK8 - Long Term Financial Plan'!I202","v":2.4999983093863642E-2},{"$f":"'WK8 - Long Term Financial Plan'!J202","v":2.7199186552571808E-2},{"$f":"'WK8 - Long Term Financial Plan'!K202","v":2.8865272032385647E-2},{"$f":"'WK8 - Long Term Financial Plan'!L202","v":2.8928371233496009E-2},{"$f":"'WK8 - Long Term Financial Plan'!M202","v":2.9999979776285324E-2},{"$f":"'WK8 - Long Term Financial Plan'!N202","v":3.0000016100433458E-2},{"$f":"'WK8 - Long Term Financial Plan'!O202","v":3.0000028975442072E-2},{"$f":"'WK8 - Long Term Financial Plan'!P202","v":2.9999982973041739E-2}]
[null,{"$f":"'WK8 - Long Term Financial Plan'!C203","v":"Growth in employee numbers"}]
[null,{"$f":"'WK8 - Long Term Financial Plan'!C204","v":"Scenario 1: Proposed (with SV)"},null,null,null,null,null,null,{"$f":"'WK8 - Long Term Financial Plan'!G204","v":0.03},{"$f":"'WK8 - Long Term Financial Plan'!H204","v":0},{"$f":"'WK8 - Long Term Financial Plan'!I204","v":0},{"$f":"'WK8 - Long Term Financial Plan'!J204","v":0},{"$f":"'WK8 - Long Term Financial Plan'!K204","v":0},{"$f":"'WK8 - Long Term Financial Plan'!L204","v":0},{"$f":"'WK8 - Long Term Financial Plan'!M204","v":0},{"$f":"'WK8 - Long Term Financial Plan'!N204","v":0},{"$f":"'WK8 - Long Term Financial Plan'!O204","v":0},{"$f":"'WK8 - Long Term Financial Plan'!P204","v":0}]
[null,{"$f":"'WK8 - Long Term Financial Plan'!C205","v":"Scenario 2 - Base case (no SV)"},null,null,null,null,null,null,{"$f":"'WK8 - Long Term Financial Plan'!G205","v":0.03},{"$f":"'WK8 - Long Term Financial Plan'!H205","v":0},{"$f":"'WK8 - Long Term Financial Plan'!I205","v":0},{"$f":"'WK8 - Long Term Financial Plan'!J205","v":0},{"$f":"'WK8 - Long Term Financial Plan'!K205","v":0},{"$f":"'WK8 - Long Term Financial Plan'!L205","v":0},{"$f":"'WK8 - Long Term Financial Plan'!M205","v":0},{"$f":"'WK8 - Long Term Financial Plan'!N205","v":0},{"$f":"'WK8 - Long Term Financial Plan'!O205","v":0},{"$f":"'WK8 - Long Term Financial Plan'!P205","v":0}]
[null,{"$f":"'WK8 - Long Term Financial Plan'!C206","v":"Growth in assessment numbers"}]
[null,{"$f":"'WK8 - Long Term Financial Plan'!C207","v":"Scenario 1: Proposed (with SV)"},null,null,null,null,null,null,{"$f":"'WK8 - Long Term Financial Plan'!G207","v":0},{"$f":"'WK8 - Long Term Financial Plan'!H207","v":1.4500000000000001E-2},{"$f":"'WK8 - Long Term Financial Plan'!I207","v":1.61E-2},{"$f":"'WK8 - Long Term Financial Plan'!J207","v":1.06E-2},{"$f":"'WK8 - Long Term Financial Plan'!K207","v":7.0000000000000001E-3},{"$f":"'WK8 - Long Term Financial Plan'!L207","v":0},{"$f":"'WK8 - Long Term Financial Plan'!M207","v":1.3899999999999999E-2},{"$f":"'WK8 - Long Term Financial Plan'!N207","v":0},{"$f":"'WK8 - Long Term Financial Plan'!O207","v":6.8999999999999999E-3},{"$f":"'WK8 - Long Term Financial Plan'!P207","v":0}]
[null,{"$f":"'WK8 - Long Term Financial Plan'!C208","v":"Scenario 2 - Base case (no SV)"},null,null,null,null,null,null,{"$f":"'WK8 - Long Term Financial Plan'!G208","v":0},{"$f":"'WK8 - Long Term Financial Plan'!H208","v":1.4500000000000001E-2},{"$f":"'WK8 - Long Term Financial Plan'!I208","v":1.61E-2},{"$f":"'WK8 - Long Term Financial Plan'!J208","v":1.06E-2},{"$f":"'WK8 - Long Term Financial Plan'!K208","v":7.0000000000000001E-3},{"$f":"'WK8 - Long Term Financial Plan'!L208","v":0},{"$f":"'WK8 - Long Term Financial Plan'!M208","v":1.3899999999999999E-2},{"$f":"'WK8 - Long Term Financial Plan'!N208","v":0},{"$f":"'WK8 - Long Term Financial Plan'!O208","v":6.8999999999999999E-3},{"$f":"'WK8 - Long Term Financial Plan'!P208","v":0}]
[null,{"$f":"'WK8 - Long Term Financial Plan'!C209","v":"Inflation rate applied to Materials & Contracts"}]
[null,{"$f":"'WK8 - Long Term Financial Plan'!C210","v":"Scenario 1: Proposed (with SV)"},null,null,null,null,null,null,{"$f":"'WK8 - Long Term Financial Plan'!G210","v":0.02},{"$f":"'WK8 - Long Term Financial Plan'!H210","v":0.02},{"$f":"'WK8 - Long Term Financial Plan'!I210","v":0.02},{"$f":"'WK8 - Long Term Financial Plan'!J210","v":0.02},{"$f":"'WK8 - Long Term Financial Plan'!K210","v":0.02},{"$f":"'WK8 - Long Term Financial Plan'!L210","v":0.02},{"$f":"'WK8 - Long Term Financial Plan'!M210","v":0.02},{"$f":"'WK8 - Long Term Financial Plan'!N210","v":0.02},{"$f":"'WK8 - Long Term Financial Plan'!O210","v":0.02},{"$f":"'WK8 - Long Term Financial Plan'!P210","v":0.02}]
[null,{"$f":"'WK8 - Long Term Financial Plan'!C211","v":"Scenario 2 - Base case (no SV)"},null,null,null,null,null,null,{"$f":"'WK8 - Long Term Financial Plan'!G211","v":0.02},{"$f":"'WK8 - Long Term Financial Plan'!H211","v":0.02},{"$f":"'WK8 - Long Term Financial Plan'!I211","v":0.02},{"$f":"'WK8 - Long Term Financial Plan'!J211","v":0.02},{"$f":"'WK8 - Long Term Financial Plan'!K211","v":0.02},{"$f":"'WK8 - Long Term Financial Plan'!L211","v":0.02},{"$f":"'WK8 - Long Term Financial Plan'!M211","v":0.02},{"$f":"'WK8 - Long Term Financial Plan'!N211","v":0.02},{"$f":"'WK8 - Long Term Financial Plan'!O211","v":0.02},{"$f":"'WK8 - Long Term Financial Plan'!P211","v":0.02}]
[null,{"$f":"'WK8 - Long Term Financial Plan'!C212","v":"Planned operating cost savings"}]
[null,{"$f":"'WK8 - Long Term Financial Plan'!C213","v":"Scenario 1: Proposed (with SV)"},null,null,null,null,null,null,{"$f":"'WK8 - Long Term Financial Plan'!G213","v":0},{"$f":"'WK8 - Long Term Financial Plan'!H213","v":0},{"$f":"'WK8 - Long Term Financial Plan'!I213","v":0},{"$f":"'WK8 - Long Term Financial Plan'!J213","v":0},{"$f":"'WK8 - Long Term Financial Plan'!K213","v":0},{"$f":"'WK8 - Long Term Financial Plan'!L213","v":0},{"$f":"'WK8 - Long Term Financial Plan'!M213","v":0},{"$f":"'WK8 - Long Term Financial Plan'!N213","v":0},{"$f":"'WK8 - Long Term Financial Plan'!O213","v":0},{"$f":"'WK8 - Long Term Financial Plan'!P213","v":0}]
[null,{"$f":"'WK8 - Long Term Financial Plan'!C214","v":"Scenario 2 - Base case (no SV)"},null,null,null,null,null,null,{"$f":"'WK8 - Long Term Financial Plan'!G214","v":0},{"$f":"'WK8 - Long Term Financial Plan'!H214","v":0},{"$f":"'WK8 - Long Term Financial Plan'!I214","v":0},{"$f":"'WK8 - Long Term Financial Plan'!J214","v":0},{"$f":"'WK8 - Long Term Financial Plan'!K214","v":0},{"$f":"'WK8 - Long Term Financial Plan'!L214","v":0},{"$f":"'WK8 - Long Term Financial Plan'!M214","v":0},{"$f":"'WK8 - Long Term Financial Plan'!N214","v":0},{"$f":"'WK8 - Long Term Financial Plan'!O214","v":0},{"$f":"'WK8 - Long Term Financial Plan'!P214","v":0}]
[]
[]
[]
[]
[null,{"$f":"'WK9 - Ratios'!F5","v":"WORKSHEET 9"}]
[null,{"$f":"'WK9 - Ratios'!F7","v":"FINANCIAL RATIOS"}]
[null,null,null,null,null,{"$f":"'WK9 - Ratios'!H15","v":"Historical ratios"},null,null,null,null,null,{"$f":"'WK9 - Ratios'!N15","v":"Forecast ratios"},null,null,null,null,null,null,null,"Ratio definitions"]
[null,{"$f":"B$41","v":"Year number"},null,null,{"$f":"E$41","v":"Hist yr 3"},"Hist yr 2","Hist yr 1","Year 0","Year 1","Year 2","Year 3","Year 4","Year 5","Year 6","Year 7","Year 8","Year 9","Year 10"]
[null,{"$f":"B$42","v":"Financial year"},null,null,{"$f":"E$42","v":"2015-16"},"2016-17","2017-18","2018-19","2019-20","2020-21","2021-22","2022-23","2023-24","2024-25","2025-26","2026-27","2027-28","2028-29"]
[null,null,null,null,null,null,null,null,null,null,null,null,null,null,null,null,null,null,null,{"$f":"B276","v":"Operating Performance Ratio"}]
[null,{"$f":"'WK9 - Ratios'!C19","v":"1. Sustainability"},null,null,null,null,null,null,null,null,null,null,null,null,null,null,null,null,null,{"$f":"'WK9 - Ratios'!D21","v":"Net continuing operating result"}]
[null,null,null,null,null,null,null,null,null,null,null,null,null,null,null,null,null,null,null,{"$f":"'WK9 - Ratios'!D22","v":"(excl capital grants and contributions)"}]
[null,{"$f":"'WK9 - Ratios'!C21","v":"Operating Performance Ratio"},null,null,null,null,null,null,null,null,null,null,null,null,null,null,null,null,null,{"$f":"'WK9 - Ratios'!D23","v":"Total continuing operating revenue"}]
[null,{"$f":"B$213","v":"SCENARIO 1: Proposed additional SV income and expenditure"},null,null,{"$f":"'WK9 - Ratios'!G22","v":-1.0755453716476888E-3},{"$f":"'WK9 - Ratios'!H22","v":5.8970780443499259E-2},{"$f":"'WK9 - Ratios'!I22","v":7.5729386027682935E-2},{"$f":"'WK9 - Ratios'!J22","v":-3.5482387743363444E-2},{"$f":"'WK9 - Ratios'!K22","v":-1.3671737150670292E-2},{"$f":"'WK9 - Ratios'!L22","v":7.7414214812663142E-3},{"$f":"'WK9 - Ratios'!M22","v":3.2829637352460202E-2},{"$f":"'WK9 - Ratios'!N22","v":4.6254835946231337E-2},{"$f":"'WK9 - Ratios'!O22","v":5.2200658242608486E-2},{"$f":"'WK9 - Ratios'!P22","v":5.1112593633662773E-2},{"$f":"'WK9 - Ratios'!Q22","v":5.0298717011999089E-2},{"$f":"'WK9 - Ratios'!R22","v":5.5164981604954241E-2},{"$f":"'WK9 - Ratios'!S22","v":5.7659065215376067E-2},{"$f":"'WK9 - Ratios'!T22","v":5.9348498040012757E-2},null,{"$f":"'WK9 - Ratios'!D24","v":"(excl. capital grants and contributions)"}]
[null,{"$f":"B$221","v":"SCENARIO 2: Base case -  no SV income or expenditure"},null,null,{"$f":"'WK9 - Ratios'!G23","v":-1.0755453716476888E-3},{"$f":"'WK9 - Ratios'!H23","v":5.8970780443499259E-2},{"$f":"'WK9 - Ratios'!I23","v":7.5729386027682935E-2},{"$f":"'WK9 - Ratios'!J23","v":-3.5482387743363444E-2},{"$f":"'WK9 - Ratios'!K23","v":-2.304152279713086E-2},{"$f":"'WK9 - Ratios'!L23","v":-1.0546507285529545E-2},{"$f":"'WK9 - Ratios'!M23","v":6.1030141161985824E-3},{"$f":"'WK9 - Ratios'!N23","v":1.1027618884255092E-2},{"$f":"'WK9 - Ratios'!O23","v":1.7406982026236625E-2},{"$f":"'WK9 - Ratios'!P23","v":1.6449983999953448E-2},{"$f":"'WK9 - Ratios'!Q23","v":1.5866525260481143E-2},{"$f":"'WK9 - Ratios'!R23","v":2.1001054649764796E-2},{"$f":"'WK9 - Ratios'!S23","v":2.3764519234656254E-2},{"$f":"'WK9 - Ratios'!T23","v":2.558832378254634E-2}]
[null,{"$f":"B$229","v":"SCENARIO 3: Hybrid case  - SV expenditure but no SV income "},null,null,{"$f":"'WK9 - Ratios'!G24","v":-1.0755453716476888E-3},{"$f":"'WK9 - Ratios'!H24","v":5.8970780443499259E-2},{"$f":"'WK9 - Ratios'!I24","v":7.5729386027682935E-2},{"$f":"'WK9 - Ratios'!J24","v":-3.5482387743363444E-2},{"$f":"'WK9 - Ratios'!K24","v":-2.304152279713086E-2},{"$f":"'WK9 - Ratios'!L24","v":-1.0546507285529545E-2},{"$f":"'WK9 - Ratios'!M24","v":6.1030141161985824E-3},{"$f":"'WK9 - Ratios'!N24","v":1.1027618884255092E-2},{"$f":"'WK9 - Ratios'!O24","v":1.7406982026236625E-2},{"$f":"'WK9 - Ratios'!P24","v":1.6449983999953448E-2},{"$f":"'WK9 - Ratios'!Q24","v":1.5866525260481143E-2},{"$f":"'WK9 - Ratios'!R24","v":2.1001054649764796E-2},{"$f":"'WK9 - Ratios'!S24","v":2.3764519234656254E-2},{"$f":"'WK9 - Ratios'!T24","v":2.558832378254634E-2},null,{"$f":"B281","v":"Own Source Revenue Ratio"}]
[null,null,null,null,null,null,null,null,null,null,null,null,null,null,null,null,null,null,null,{"$f":"'WK9 - Ratios'!D27","v":"Total continuing operating revenue"}]
[null,{"$f":"'WK9 - Ratios'!C27","v":"Own Source Revenue Ratio"},null,null,null,null,null,null,null,null,null,null,null,null,null,null,null,null,null,{"$f":"'WK9 - Ratios'!D28","v":"(excl all grants and contributions)"}]
[null,{"$f":"B$277","v":"SCENARIO 1: Proposed additional SV income and expenditure"},null,null,{"$f":"'WK9 - Ratios'!G28","v":0.76876888662140419},{"$f":"'WK9 - Ratios'!H28","v":0.84040715983664849},{"$f":"'WK9 - Ratios'!I28","v":0.72050733254062627},{"$f":"'WK9 - Ratios'!J28","v":0.71125001437852942},{"$f":"'WK9 - Ratios'!K28","v":0.80616420731850147},{"$f":"'WK9 - Ratios'!L28","v":0.81212229194121455},{"$f":"'WK9 - Ratios'!M28","v":0.82387762311607093},{"$f":"'WK9 - Ratios'!N28","v":0.84809164033337203},{"$f":"'WK9 - Ratios'!O28","v":0.84935981979867992},{"$f":"'WK9 - Ratios'!P28","v":0.84990944964040871},{"$f":"'WK9 - Ratios'!Q28","v":0.85019645415464329},{"$f":"'WK9 - Ratios'!R28","v":0.85419998749813475},{"$f":"'WK9 - Ratios'!S28","v":0.85593069352935292},{"$f":"'WK9 - Ratios'!T28","v":0.85723838690266574},null,{"$f":"'WK9 - Ratios'!D29","v":"Total continuing operating revenue"}]
[null,{"$f":"B$278","v":"SCENARIO 2: Base case -  no SV income or expenditure"},null,null,{"$f":"'WK9 - Ratios'!G29","v":0.76876888662140419},{"$f":"'WK9 - Ratios'!H29","v":0.84040715983664849},{"$f":"'WK9 - Ratios'!I29","v":0.72050733254062627},{"$f":"'WK9 - Ratios'!J29","v":0.71125001437852942},{"$f":"'WK9 - Ratios'!K29","v":0.80461112501194076},{"$f":"'WK9 - Ratios'!L29","v":0.8091067082970187},{"$f":"'WK9 - Ratios'!M29","v":0.81958729581110645},{"$f":"'WK9 - Ratios'!N29","v":0.84300631261688852},{"$f":"'WK9 - Ratios'!O29","v":0.84434133739434369},{"$f":"'WK9 - Ratios'!P29","v":0.84493110809798821},{"$f":"'WK9 - Ratios'!Q29","v":0.84526457654371467},{"$f":"'WK9 - Ratios'!R29","v":0.84938927427356981},{"$f":"'WK9 - Ratios'!S29","v":0.85119280369641304},{"$f":"'WK9 - Ratios'!T29","v":0.85254593751870944},null,{"$f":"'WK9 - Ratios'!D30","v":"(incl. capital grants and contributions)"}]
[]
[null,{"$f":"'WK9 - Ratios'!C33","v":"Infrastructure Renewals Ratio"},null,null,null,null,null,null,null,null,null,null,null,null,null,null,null,null,null,{"$f":"B285","v":"Infrastructure Renewals Ratio"}]
[null,{"$f":"B$277","v":"SCENARIO 1: Proposed additional SV income and expenditure"},null,null,{"$f":"'WK9 - Ratios'!G33","v":1.3973},{"$f":"'WK9 - Ratios'!H33","v":1.1771},{"$f":"'WK9 - Ratios'!I33","v":1.7062999999999999},{"$f":"'WK9 - Ratios'!J33","v":2.4590999999999998},{"$f":"'WK9 - Ratios'!K33","v":1.8482000000000001},{"$f":"'WK9 - Ratios'!L33","v":1.9532},{"$f":"'WK9 - Ratios'!M33","v":1.5722},{"$f":"'WK9 - Ratios'!N33","v":1.4021999999999999},{"$f":"'WK9 - Ratios'!O33","v":1.4511000000000001},{"$f":"'WK9 - Ratios'!P33","v":1.4641999999999999},{"$f":"'WK9 - Ratios'!Q33","v":1.5154000000000001},{"$f":"'WK9 - Ratios'!R33","v":1.5321},{"$f":"'WK9 - Ratios'!S33","v":1.5622},{"$f":"'WK9 - Ratios'!T33","v":1.5979000000000001},null,{"$f":"'WK9 - Ratios'!D33","v":"Asset renewals (building and infrastructure)"}]
[null,{"$f":"B$278","v":"SCENARIO 2: Base case -  no SV income or expenditure"},null,null,{"$f":"'WK9 - Ratios'!G34","v":1.3973},{"$f":"'WK9 - Ratios'!H34","v":1.1771},{"$f":"'WK9 - Ratios'!I34","v":1.7062999999999999},{"$f":"'WK9 - Ratios'!J34","v":2.4590999999999998},{"$f":"'WK9 - Ratios'!K34","v":1.7588999999999999},{"$f":"'WK9 - Ratios'!L34","v":1.7743},{"$f":"'WK9 - Ratios'!M34","v":1.3024},{"$f":"'WK9 - Ratios'!N34","v":1.0370999999999999},{"$f":"'WK9 - Ratios'!O34","v":1.0860000000000001},{"$f":"'WK9 - Ratios'!P34","v":1.0991},{"$f":"'WK9 - Ratios'!Q34","v":1.151},{"$f":"'WK9 - Ratios'!R34","v":1.1685000000000001},{"$f":"'WK9 - Ratios'!S34","v":1.1996},{"$f":"'WK9 - Ratios'!T34","v":1.2367999999999999},null,{"$f":"'WK9 - Ratios'!D34","v":"Depreciation, amortisation and impairment"}]
[null,null,null,null,null,null,null,null,null,null,null,null,null,null,null,null,null,null,null,{"$f":"'WK9 - Ratios'!D35","v":"(building and infrastructure)"}]
[]
[null,{"$f":"'WK9 - Ratios'!C37","v":"2. Effective infrastructure and service management"}]
[null,null,null,null,null,null,null,null,null,null,null,null,null,null,null,null,null,null,null,{"$f":"B292","v":"Infrastructure Backlog Ratio"}]
[null,{"$f":"'WK9 - Ratios'!C39","v":"Infrastructure Backlog Ratio"},null,null,null,null,null,null,null,null,null,null,null,null,null,null,null,null,null,{"$f":"'WK9 - Ratios'!D40","v":"Estimated cost to bring assets to satisfactory condition"}]
[null,{"$f":"B$277","v":"SCENARIO 1: Proposed additional SV income and expenditure"},null,null,{"$f":"'WK9 - Ratios'!G40","v":7.6399999999999996E-2},{"$f":"'WK9 - Ratios'!H40","v":7.2800000000000004E-2},{"$f":"'WK9 - Ratios'!I40","v":7.0900000000000005E-2},{"$f":"'WK9 - Ratios'!J40","v":7.0000000000000007E-2},{"$f":"'WK9 - Ratios'!K40","v":0.06},{"$f":"'WK9 - Ratios'!L40","v":0.06},{"$f":"'WK9 - Ratios'!M40","v":0.06},{"$f":"'WK9 - Ratios'!N40","v":0.05},{"$f":"'WK9 - Ratios'!O40","v":0.05},{"$f":"'WK9 - Ratios'!P40","v":0.04},{"$f":"'WK9 - Ratios'!Q40","v":0.04},{"$f":"'WK9 - Ratios'!R40","v":0.03},{"$f":"'WK9 - Ratios'!S40","v":0.02},{"$f":"'WK9 - Ratios'!T40","v":0.02},null,{"$f":"'WK9 - Ratios'!D41","v":"Total (WDV)b of infrastructure, buildings, other"}]
[null,{"$f":"B$278","v":"SCENARIO 2: Base case -  no SV income or expenditure"},null,null,{"$f":"'WK9 - Ratios'!G41","v":7.6399999999999996E-2},{"$f":"'WK9 - Ratios'!H41","v":7.2800000000000004E-2},{"$f":"'WK9 - Ratios'!I41","v":7.0900000000000005E-2},{"$f":"'WK9 - Ratios'!J41","v":7.0000000000000007E-2},{"$f":"'WK9 - Ratios'!K41","v":7.0000000000000007E-2},{"$f":"'WK9 - Ratios'!L41","v":0.06},{"$f":"'WK9 - Ratios'!M41","v":0.06},{"$f":"'WK9 - Ratios'!N41","v":0.06},{"$f":"'WK9 - Ratios'!O41","v":0.06},{"$f":"'WK9 - Ratios'!P41","v":0.06},{"$f":"'WK9 - Ratios'!Q41","v":0.06},{"$f":"'WK9 - Ratios'!R41","v":0.06},{"$f":"'WK9 - Ratios'!S41","v":0.06},{"$f":"'WK9 - Ratios'!T41","v":0.06},null,{"$f":"'WK9 - Ratios'!D42","v":"  structures, depreciable land, and improvement assets"}]
[]
[null,null,null,null,null,null,null,null,null,null,null,null,null,null,null,null,null,null,null,{"$f":"B297","v":"Asset Maintenance Ratio"}]
[null,{"$f":"'WK9 - Ratios'!C45","v":"Asset Maintenance Ratio"},null,null,null,null,null,null,null,null,null,null,null,null,null,null,null,null,null,{"$f":"'WK9 - Ratios'!D46","v":"Actual asset maintenance"}]
[null,{"$f":"B$277","v":"SCENARIO 1: Proposed additional SV income and expenditure"},null,null,{"$f":"'WK9 - Ratios'!G46","v":0.90859999999999996},{"$f":"'WK9 - Ratios'!H46","v":1.0259},{"$f":"'WK9 - Ratios'!I46","v":1.2041999999999999},{"$f":"'WK9 - Ratios'!J46","v":0.91},{"$f":"'WK9 - Ratios'!K46","v":0.92},{"$f":"'WK9 - Ratios'!L46","v":0.92},{"$f":"'WK9 - Ratios'!M46","v":0.93},{"$f":"'WK9 - Ratios'!N46","v":0.93},{"$f":"'WK9 - Ratios'!O46","v":0.94},{"$f":"'WK9 - Ratios'!P46","v":0.94},{"$f":"'WK9 - Ratios'!Q46","v":0.95},{"$f":"'WK9 - Ratios'!R46","v":0.95},{"$f":"'WK9 - Ratios'!S46","v":0.96},{"$f":"'WK9 - Ratios'!T46","v":0.96},null,{"$f":"'WK9 - Ratios'!D47","v":"Required asset maintenance"}]
[null,{"$f":"B$278","v":"SCENARIO 2: Base case -  no SV income or expenditure"},null,null,{"$f":"'WK9 - Ratios'!G47","v":0.90859999999999996},{"$f":"'WK9 - Ratios'!H47","v":1.0259},{"$f":"'WK9 - Ratios'!I47","v":1.2041999999999999},{"$f":"'WK9 - Ratios'!J47","v":0.91},{"$f":"'WK9 - Ratios'!K47","v":0.92},{"$f":"'WK9 - Ratios'!L47","v":0.92},{"$f":"'WK9 - Ratios'!M47","v":0.92},{"$f":"'WK9 - Ratios'!N47","v":0.92},{"$f":"'WK9 - Ratios'!O47","v":0.93},{"$f":"'WK9 - Ratios'!P47","v":0.93},{"$f":"'WK9 - Ratios'!Q47","v":0.93},{"$f":"'WK9 - Ratios'!R47","v":0.94},{"$f":"'WK9 - Ratios'!S47","v":0.94},{"$f":"'WK9 - Ratios'!T47","v":0.94}]
[null,null,null,null,null,null,null,null,null,null,null,null,null,null,null,null,null,null,null,{"$f":"B301","v":"Debt Service Ratio"}]
[null,{"$f":"'WK9 - Ratios'!C50","v":"Debt Service Ratio"},null,null,null,null,null,null,null,null,null,null,null,null,null,null,null,null,null,{"$f":"'WK9 - Ratios'!D51","v":"Cost of debt service"}]
[null,{"$f":"B$277","v":"SCENARIO 1: Proposed additional SV income and expenditure"},null,null,{"$f":"'WK9 - Ratios'!G52","v":1.8151660982105314E-2},{"$f":"'WK9 - Ratios'!H52","v":1.7231856843035458E-2},{"$f":"'WK9 - Ratios'!I52","v":1.6070004702418678E-2},{"$f":"'WK9 - Ratios'!J52","v":2.0500000000000001E-2},{"$f":"'WK9 - Ratios'!K52","v":2.1999999999999999E-2},{"$f":"'WK9 - Ratios'!L52","v":2.1100000000000001E-2},{"$f":"'WK9 - Ratios'!M52","v":1.9E-2},{"$f":"'WK9 - Ratios'!N52","v":1.7100000000000001E-2},{"$f":"'WK9 - Ratios'!O52","v":1.55E-2},{"$f":"'WK9 - Ratios'!P52","v":1.18E-2},{"$f":"'WK9 - Ratios'!Q52","v":9.4999999999999998E-3},{"$f":"'WK9 - Ratios'!R52","v":9.1999999999999998E-3},{"$f":"'WK9 - Ratios'!S52","v":9.1000000000000004E-3},{"$f":"'WK9 - Ratios'!T52","v":6.7000000000000002E-3},null,{"$f":"'WK9 - Ratios'!D52","v":"(interest expense and principal repayments)"}]
[null,{"$f":"B$278","v":"SCENARIO 2: Base case -  no SV income or expenditure"},null,null,{"$f":"'WK9 - Ratios'!G53","v":1.8151660982105314E-2},{"$f":"'WK9 - Ratios'!H53","v":1.7231856843035458E-2},{"$f":"'WK9 - Ratios'!I53","v":1.6070004702418678E-2},{"$f":"'WK9 - Ratios'!J53","v":2.0500000000000001E-2},{"$f":"'WK9 - Ratios'!K53","v":2.2200000000000001E-2},{"$f":"'WK9 - Ratios'!L53","v":2.1600000000000001E-2},{"$f":"'WK9 - Ratios'!M53","v":1.9599999999999999E-2},{"$f":"'WK9 - Ratios'!N53","v":1.77E-2},{"$f":"'WK9 - Ratios'!O53","v":1.61E-2},{"$f":"'WK9 - Ratios'!P53","v":1.23E-2},{"$f":"'WK9 - Ratios'!Q53","v":9.7999999999999997E-3},{"$f":"'WK9 - Ratios'!R53","v":9.5999999999999992E-3},{"$f":"'WK9 - Ratios'!S53","v":9.4999999999999998E-3},{"$f":"'WK9 - Ratios'!T53","v":6.8999999999999999E-3},null,{"$f":"'WK9 - Ratios'!D53","v":"Total continuing operating revenue"}]
[null,null,null,null,null,null,null,null,null,null,null,null,null,null,null,null,null,null,null,{"$f":"'WK9 - Ratios'!D54","v":"(excl capital grants and contributions)"}]

{"sheet":"WK1 - Identification","index":5,"n_rows":72,"n_cols":18,"rows_kept":72,"cut":false,"hidden":false,"merged":[]}
[]
[]
[null,null,null,null,"             APPLICATION FOR SPECIAL VARIATION TO GENERAL INCOME        ",null,null,null,null,null,null,null,{"$f":"'WK0 - Input data'!$D$45","v":"2019-20"}]
[]
[null,null,null,null,null,"WORKSHEET 1"]
[]
[null,null,null,"Step 1: Fill out council details"]
[null,null,null,"Step 2: Fill out any existing variation information"]
[null,null,null,"Step 3: Fill out crown land adjustments, catch up & excess, valuation objections"]
[null,null,null,"Step 4: Fill out proposed special variation amounts"]
[null,null,"                                                                                                          All dollars in nominal terms "]
[]
[null,null,"Council Name:",null,"Burwood Council",null,null,null,{"$f":"\"If your councils' name is not in the list, please enter it in cell E\"&ROW(C14)","v":"If your councils' name is not in the list, please enter it in cell E14"}]
[null,null,"Council Name if not listed:"]
[]
[null,null,"Contact Details:"]
[null,null,"  Name:",null,"Wayne Armitage"]
[null,null,"  Position:",null,"Chief Finance Officer"]
[null,null," Telephone:"]
[null,null,"  Email:","."]
[]
[]
[null,null,"A. Existing special variations (SVs)",null,null,null,null,null,null,null,null,null,null,null,null,null,null,"DO NOT DELETE"]
[null,null,{"$f":"\"1. Does the council have any existing SV(s) that means it has an increase above the rate peg for any year from \"&G57&\" (\"&G56&\") onwards?\"","v":"1. Does the council have any existing SV(s) that means it has an increase above the rate peg for any year from 2019-20 (Year 1) onwards?"},null,null,null,null,null,null,null,"no",null,null,null,null,null,null,{"$f":"IF(K24='WK0 - Input data'!B247,1,2)","v":2}]
[]
[null,null,"B. Proposed special variations (SVs)"]
[]
[null,null,"2. Is the council applying for a one-year increase (s508(2)) or a multi-year increase (s508A)?",null,null,null,null,null,null,"select option","s508A",null,null,null,null,null,null,{"$f":"IF(K28=\"\",0,MATCH(K28,'WK0 - Input data'!B228:B229,0))","v":2}]
[null,null,"3. For s508A applications: for how many years is the council requesting % increases as part of this application?",null,null,null,null,null,null,"select option","4 years",null,null,null,null,null,null,{"$f":"IF(K29=\"\",0,MATCH(K29,'WK0 - Input data'!E234:E240,0))","v":4}]
[null,null,"4. For s508A & s508(2) applications: is the special variation permanent or temporary?   ",null,null,null,null,null,null,"select option","Permanent"]
[null,null,"    If temporary, enter the number of years before the special variation is due to expire.",null,null,null,null,null,null," enter years",null,null,null,null,null,null,null,{"$f":"IF(R28+R29=0,0,IF(R28=1,1,R29))","v":4}]
[null,null,{"$f":"CHOOSE($R$24,\"5. Enter the percentage above the existing full SV (ie, incl rate peg) the council is applying for in the first year \",\"5. Enter the percentage above the rate peg the council is applying for in the first year\")","v":"5. Enter the percentage above the rate peg the council is applying for in the first year"},null,null,null,null,null,null,"enter % ",0.02]
[]
[null,null,"C. Expiring special variations (SVs)"]
[null,null,"6. Does the council have an expiring variation? If yes, please specify when.",null,null,null,null,null,"1st Expiring SV","select option","na"]
[null,null,null,null,null,null,null,null,"2nd Expiring SV","select option","na"]
[]
[null,null,"7.  If the council has an expiring variation, enter the % of the original approval in full",null,null,null,null,"Full SV %",{"$f":"I35","v":"1st Expiring SV"},{"$f":"J32","v":"enter % "},0]
[null,null,"   (i.e. including rate peg) as well as the % which is due to expire (i.e. excluding ",null,null,null,null,"(ie, incl rate peg)",{"$f":"I36","v":"2nd Expiring SV"},{"$f":"J32","v":"enter % "},0]
[null,null,"    the rate peg).",null,null,null,null,"Expiring %",{"$f":"I38","v":"1st Expiring SV"},{"$f":"J32","v":"enter % "},0]
[null,null,null,null,null,null,null,"(ie, excl rate peg)",{"$f":"I39","v":"2nd Expiring SV"},{"$f":"J32","v":"enter % "},0]
[null,null,{"$f":"\"8. If the council has an expiring variation, enter the $ amount expiring in row \"&ROW(C70)&\" below.\"","v":"8. If the council has an expiring variation, enter the $ amount expiring in row 70 below."}]
[]
[null,null,"D. Crown Land adjustments, catch ups, valuation objections",null,null,null,null,null,null,null,"$","% Y 0 income"]
[null,null,"  9. Enter the amount of any Crown Land adjustments required",null,null,null,null,null,null,"enter $ ",0,{"$f":"IF('WK2 - Notional General Income'!$M$161-$F$71=0,0,K45/('WK2 - Notional General Income'!$M$161-$F$71))","v":0}]
[null,null,"10. Enter the amount for any catch ups or excess adjustments required",null,null,null,null,null,null,{"$f":"J45","v":"enter $ "},-69017,{"$f":"IF('WK2 - Notional General Income'!$M$161-$F$71=0,0,K46/('WK2 - Notional General Income'!$M$161-$F$71))","v":-3.0470207571878473E-3}]
[null,null,"11. Enter any valuation objections required (input as a positive whole number)",null,null,null,null,null,null,{"$f":"J46","v":"enter $ "},0,{"$f":"IF('WK2 - Notional General Income'!$M$161-$F$71=0,0,K47/('WK2 - Notional General Income'!$M$161-$F$71))","v":0}]
[]
[]
[null,null,"E. Requested annual percentage increases and expiring SV amounts"]
[null,null,"A special variation is the total % increase permitted in a council's general income, Including the rate peg and Crown land adjustments, before adjustments are made for "]
[null,null,"catch ups/excesses and valuation objections.  "]
[null,null,"Note: Approved SV% increases do not change if the actual rate peg turns out to be different from that assumed for a particular year."]
[]
[null,null,"Table 1","Requested annual percentage increases and expiring SV amounts"]
[null,null,null,null,null,{"$f":"'WK0 - Input data'!F$55","v":"Year 0"},{"$f":"'WK0 - Input data'!G$55","v":"Year 1"},{"$f":"'WK0 - Input data'!H$55","v":"Year 2"},{"$f":"'WK0 - Input data'!I$55","v":"Year 3"},{"$f":"'WK0 - Input data'!J$55","v":"Year 4"},{"$f":"'WK0 - Input data'!K$55","v":"Year 5"},{"$f":"'WK0 - Input data'!L$55","v":"Year 6"},{"$f":"'WK0 - Input data'!M$55","v":"Year 7"}]
[null,null,{"$f":"'WK0 - Input data'!B$58","v":"Financial year"},null,null,{"$f":"'WK0 - Input data'!F$58","v":"2018-19"},{"$f":"'WK0 - Input data'!G$58","v":"2019-20"},{"$f":"'WK0 - Input data'!H$58","v":"2020-21"},{"$f":"'WK0 - Input data'!I$58","v":"2021-22"},{"$f":"'WK0 - Input data'!J$58","v":"2022-23"},{"$f":"'WK0 - Input data'!K$58","v":"2023-24"},{"$f":"'WK0 - Input data'!L$58","v":"2024-25"},{"$f":"'WK0 - Input data'!M$58","v":"2025-26"}]
[null,null,"1= included in SV period",null,null,{"$f":"IF(VALUE(RIGHT(F56,1))>$R$31,0,1)","v":1},1,1,1,1,0,0,0]
[null,null,"Annual % increases"]
[null,null,{"$f":"CHOOSE($R$24,\"   Enter existing full SV (ie, incl the rate peg) in the years in which it applies\",\"na - leave blank\")","v":"na - leave blank"}]
[null,null,{"$f":"CHOOSE($R$24,\"   Existing full SV followed by rate peg only\",\"Rate peg only\")","v":"Rate peg only"},null,null,null,{"$f":"IF($K$24='WK0 - Input data'!$B$248,'WK0 - Input data'!G60,MAX(G60,'WK0 - Input data'!G60))","v":2.7E-2},{"$f":"IF($K$24='WK0 - Input data'!$B$248,'WK0 - Input data'!H60,MAX(H60,'WK0 - Input data'!H60))","v":2.5000000000000001E-2},{"$f":"IF($K$24='WK0 - Input data'!$B$248,'WK0 - Input data'!I60,MAX(I60,'WK0 - Input data'!I60))","v":2.5000000000000001E-2},{"$f":"IF($K$24='WK0 - Input data'!$B$248,'WK0 - Input data'!J60,MAX(J60,'WK0 - Input data'!J60))","v":2.5000000000000001E-2},{"$f":"IF($K$24='WK0 - Input data'!$B$248,'WK0 - Input data'!K60,MAX(K60,'WK0 - Input data'!K60))","v":2.5000000000000001E-2},{"$f":"IF($K$24='WK0 - Input data'!$B$248,'WK0 - Input data'!L60,MAX(L60,'WK0 - Input data'!L60))","v":2.5000000000000001E-2},{"$f":"IF($K$24='WK0 - Input data'!$B$248,'WK0 - Input data'!M60,MAX(M60,'WK0 - Input data'!M60))","v":2.5000000000000001E-2}]
[null,null,"     plus",{"$f":"CHOOSE($R$24,\"percentage above the rate peg/existing SV\",\"percentage above the rate peg\")","v":"percentage above the rate peg"},null,null,{"$f":"K32","v":0.02},{"$f":"IF(H58=0,\".\",MAX(0,H64-H61))","v":1.9999999999999997E-2},{"$f":"IF(I58=0,\".\",MAX(0,I64-I61))","v":1.9999999999999997E-2},1.9999999999999997E-2,".",".","."]
[null,null,{"$f":"$C$62","v":"     plus"},"Crown Land adjustment",null,null,{"$f":"L45","v":0},{"$f":"IF(H58=0,\".\",0)","v":0},{"$f":"IF(I58=0,\".\",0)","v":0},0,".",".","."]
[null,null,{"$f":"CHOOSE($R$24,\"   Proposed SV (total proposed and existing SV)\",\"   Proposed SV \")","v":"   Proposed SV "},null,null,"na",{"$f":"SUM(G61:G63)","v":4.7E-2},4.4999999999999998E-2,4.4999999999999998E-2,4.4999999999999998E-2]
[null,null,"Cumulative % increase"]
[null,null,{"$f":"C61","v":"Rate peg only"},null,null,"na",{"$f":"G61","v":2.7E-2},{"$f":"(1+G66)*(1+H61)-1","v":5.2674999999999805E-2},7.8991874999999601E-2,0.10596667187499942,0.13361583867187421,0.16195623463867093,0.19100514050463757]
[null,null,{"$f":"CHOOSE($R$24,\"   Percentage above the rate peg/existing SV\",\"   Percentage above the rate peg\")","v":"   Percentage above the rate peg"},null,null,null,{"$f":"IF(G62=0,\".\",G62)","v":0.02},{"$f":"IF(H58=0,\".\",MAX(0,H68-H66))","v":4.1440000000000143E-2},{"$f":"IF(I58=0,\".\",MAX(0,I68-I66))","v":6.4358300000000312E-2},8.8834261000000359E-2,".",".","."]
[null,null,{"$f":"C64","v":"   Proposed SV "},null,null,"na",{"$f":"IF(G64=0,\".\",G64)","v":4.7E-2},{"$f":"IF(H58=0,\".\",IF(H64=\"\",(1+G68)*(1+H61)-1,(1+G68)*(1+H64)-1))","v":9.4114999999999949E-2},{"$f":"IF(I58=0,\".\",IF(I64=\"\",(1+H68)*(1+I61)-1,(1+H68)*(1+I64)-1))","v":0.14335017499999991},0.19480093287499978,".",".","."]
[]
[null,null,"Expiring special variations"]
[null,null,"$ value of expiring special",null,"$ (nominal)",null,0,0,0,0]
[null,null," variations (ESV)",null,"% value of ESV",{"$f":"IF(OR(F58=0,'WK4 - PGI summary'!F52=0),\".\",F71/'WK4 - PGI summary'!F52)","v":0},{"$f":"IF(OR(G58=0,'WK4 - PGI summary'!G52=0),\".\",G71/'WK4 - PGI summary'!G52)","v":0},{"$f":"IF(OR(H58=0,'WK4 - PGI summary'!H52=0),\".\",H71/'WK4 - PGI summary'!H52)","v":0},{"$f":"IF(OR(I58=0,'WK4 - PGI summary'!I52=0),\".\",I71/'WK4 - PGI summary'!I52)","v":0},{"$f":"IF(OR(J58=0,'WK4 - PGI summary'!J52=0),\".\",J71/'WK4 - PGI summary'!J52)","v":0},{"$f":"IF(OR(K58=0,'WK4 - PGI summary'!K52=0),\".\",K71/'WK4 - PGI summary'!K52)","v":"."},{"$f":"IF(OR(L58=0,'WK4 - PGI summary'!L52=0),\".\",L71/'WK4 - PGI summary'!L52)","v":"."},{"$f":"IF(OR(M58=0,'WK4 - PGI summary'!M52=0),\".\",M71/'WK4 - PGI summary'!M52)","v":"."}]

{"sheet":"WK2 - Notional General Income","index":6,"n_rows":163,"n_cols":13,"rows_kept":163,"cut":false,"hidden":false,"merged":[]}
[]
[]
[null,null,{"$f":"IF(ISBLANK('WK1 - Identification'!$E$13),'WK1 - Identification'!$E$14,'WK1 - Identification'!$E$13)","v":"Burwood Council"}]
[]
[null,null,null,null,null,null,null,"WORKSHEET 2"]
[]
[null,null,null,null,null,null,null,{"$f":"\"CALCULATION OF NOTIONAL GENERAL INCOME \"&'WK0 - Input data'!$F$58","v":"CALCULATION OF NOTIONAL GENERAL INCOME 2018-19"}]
[null,null,null,null,null,null,null,"Applicable to the first year of the application"]
[]
[null,null,null,null,null,null,null,"All dollars in nominal terms "]
[null,null,null,null,null,null,null,"This worksheet must reflect the rating structure levied in the previous year "]
[null,null,null,null,{"$f":"\"NOTE: Valuations used here are to be taken from Council's valuation list on 1 July \"&'WK0 - Input data'!$F$57&\" and are to include:\"","v":"NOTE: Valuations used here are to be taken from Council's valuation list on 1 July 2018 and are to include:"}]
[null,null,null,null,"(i) supplementaries having the same base date and furnished to Council during that year, and"]
[null,null,null,null,"(ii) estimates of increases in valuations provided to the Council under section 513."]
[]
[null,null,null,null,null,null,null,"Calculation of Notional General Income - Ordinary Rates"]
[]
[null,null,"Rating Category   (s514-518)","Name of \nsub-category ","Number of Assessments","Ad Valorem Rate (cents)","Base Amount\n$","Base Amount %","Minimum\nAmount\n$","Number on Minimum","Land Value\n(see note above)\n$","Land Value of Land on Minimum","Notional General \nIncome"]
[null,null,"Residential","Residential",{"$f":"9805.92+48+43-1+0+120","v":10015.92},0.122642,null,{"$f":"IF(G19=\"\",\".\",E19*G19/M19)","v":"."},930,{"$f":"3857.07+48+44-1+0+125","v":4073.07},{"$f":"9304497622+9751040+7560960+0-70000-212840","v":9321526782},{"$f":"1383827967+9751040+7120960-75000+18837160","v":1419462127},{"$f":"IF(E19=\"\",\".\",IF(G19<>\"\",G19*E19+K19*(F19/100),(K19-L19)*(F19/100)+I19*J19))","v":13479205.2341851}]
[null,null,"Residential","Town Centre",{"$f":"2747+35","v":2782},8.0435000000000006E-2,null,{"$f":"IF(G20=\"\",\".\",E20*G20/M20)","v":"."},1186,{"$f":"2702+37","v":2739},{"$f":"1091033054-9400960","v":1081632094},{"$f":"773803054-2020960","v":771782094},3497681.8475000001]
[null,null,"Residential",null,null,null,null,".",null,null,null,null,"."]
[null,null,"Residential",null,null,null,null,".",null,null,null,null,"."]
[null,null,"Residential",null,null,null,null,".",null,null,null,null,"."]
[null,null,"Residential",null,null,null,null,".",null,null,null,null,"."]
[null,null,"Residential",null,null,null,null,".",null,null,null,null,"."]
[null,null,"Residential",null,null,null,null,".",null,null,null,null,"."]
[null,null,"Residential",null,null,null,null,".",null,null,null,null,"."]
[null,null,"Residential",null,null,null,null,".",null,null,null,null,"."]
[null,null,"Residential",null,null,null,null,".",null,null,null,null,"."]
[null,null,"Residential",null,null,null,null,".",null,null,null,null,"."]
[null,null,"Residential",null,null,null,null,".",null,null,null,null,"."]
[null,null,"Residential",null,null,null,null,".",null,null,null,null,"."]
[null,null,"Residential",null,null,null,null,".",null,null,null,null,"."]
[null,null,"Residential",null,null,null,null,".",null,null,null,null,"."]
[null,null,"Residential",null,null,null,null,".",null,null,null,null,"."]
[null,null,"Residential",null,null,null,null,".",null,null,null,null,"."]
[null,null,"Residential",null,null,null,null,".",null,null,null,null,"."]
[null,null,"Residential",null,null,null,null,".",null,null,null,null,"."]
[null,null,null,"Total Residential",{"$f":"SUM(E19:E38)","v":12797.92},null,null,null,null,{"$f":"SUM(J19:J38)","v":6812.07},{"$f":"SUM(K19:K38)","v":10403158876},{"$f":"SUM(L19:L38)","v":2191244221},{"$f":"SUM(M19:M38)","v":16976887.0816851}]
[null,null,"Business","Business A",{"$f":"458.08+1","v":459.08},0.20671999999999999,null,".",1017,{"$f":"135.79+3","v":138.79},{"$f":"667025497-9778200","v":657247297},{"$f":"33613173+811800","v":34424973},{"$f":"IF(E40=\"\",\".\",IF(G40<>\"\",G40*E40+K40*(F40/100),(K40-L40)*(F40/100)+I40*J40))","v":1428647.7381727998}]
[null,null,"Business","Business B",43,0.289018,null,".",1017,3,{"$f":"198865100","v":198865100},607740,576050.45672480005]
[null,null,"Business","Business C",31,0.52863899999999997,null,".",1017,2,75276920,126840,399306.63141119992]
[null,null,"Business","Business D",42,0.67462599999999995,null,".",1301,4,285381000,512500,1927000.9668099999]
[null,null,"Business","Town Centre Minor",387,0.20344899999999999,null,".",1301,222,553951121,35917171,1342756.8909354999]
[null,null,"Business",null,null,null,null,".",null,null,null,null,"."]
[null,null,"Business",null,null,null,null,".",null,null,null,null,"."]
[null,null,"Business",null,null,null,null,".",null,null,null,null,"."]
[null,null,"Business",null,null,null,null,".",null,null,null,null,"."]
[null,null,"Business",null,null,null,null,".",null,null,null,null,"."]
[null,null,"Business",null,null,null,null,".",null,null,null,null,"."]
[null,null,"Business",null,null,null,null,".",null,null,null,null,"."]
[null,null,"Business",null,null,null,null,".",null,null,null,null,"."]
[null,null,"Business",null,null,null,null,".",null,null,null,null,"."]
[null,null,"Business",null,null,null,null,".",null,null,null,null,"."]
[null,null,"Business",null,null,null,null,".",null,null,null,null,"."]
[null,null,"Business",null,null,null,null,".",null,null,null,null,"."]
[null,null,"Business",null,null,null,null,".",null,null,null,null,"."]
[null,null,"Business",null,null,null,null,".",null,null,null,null,"."]
[null,null,"Business",null,null,null,null,".",null,null,null,null,"."]
[null,null,"Business",null,null,null,null,".",null,null,null,null,"."]
[null,null,"Business",null,null,null,null,".",null,null,null,null,"."]
[null,null,"Business",null,null,null,null,".",null,null,null,null,"."]
[null,null,"Business",null,null,null,null,".",null,null,null,null,"."]
[null,null,"Business",null,null,null,null,".",null,null,null,null,"."]
[null,null,null,"Total Business",{"$f":"SUM(E40:E64)","v":962.07999999999993},null,null,null,null,{"$f":"SUM(J40:J64)","v":369.78999999999996},{"$f":"SUM(K40:K64)","v":1770721438},{"$f":"SUM(L40:L64)","v":71589224},{"$f":"SUM(M40:M64)","v":5673762.6840543002}]
[null,null,"Farmland","Not Applicable",null,null,null,".",null,null,null,null,{"$f":"IF(E66=\"\",\".\",IF(G66<>\"\",G66*E66+K66*(F66/100),(K66-L66)*(F66/100)+I66*J66))","v":"."}]
[null,null,"Farmland",null,null,null,null,".",null,null,null,null,"."]
[null,null,"Farmland",null,null,null,null,".",null,null,null,null,"."]
[null,null,"Farmland",null,null,null,null,".",null,null,null,null,"."]
[null,null,"Farmland",null,null,null,null,".",null,null,null,null,"."]
[null,null,"Farmland",null,null,null,null,".",null,null,null,null,"."]
[null,null,"Farmland",null,null,null,null,".",null,null,null,null,"."]
[null,null,"Farmland",null,null,null,null,".",null,null,null,null,"."]
[null,null,"Farmland",null,null,null,null,".",null,null,null,null,"."]
[null,null,"Farmland",null,null,null,null,".",null,null,null,null,{"$f":"IF(E75=\"\",\".\",IF(G75<>\"\",G75*E75+K75*(F75/100),(K75-L75)*(F75/100)+I75*J75))","v":"."}]
[null,null,null,"Total Farmland",{"$f":"SUM(E66:E75)","v":0},null,null,null,null,{"$f":"SUM(J66:J75)","v":0},{"$f":"SUM(K66:K75)","v":0},{"$f":"SUM(L66:L75)","v":0},{"$f":"SUM(M66:M75)","v":0}]
[null,null,"Mining","Not Applicable",null,null,null,".",null,null,null,null,{"$f":"IF(E77=\"\",\".\",IF(G77<>\"\",G77*E77+K77*(F77/100),(K77-L77)*(F77/100)+I77*J77))","v":"."}]
[null,null,"Mining",null,null,null,null,".",null,null,null,null,"."]
[null,null,"Mining",null,null,null,null,".",null,null,null,null,"."]
[null,null,"Mining",null,null,null,null,".",null,null,null,null,"."]
[null,null,"Mining",null,null,null,null,".",null,null,null,null,"."]
[null,null,"Mining",null,null,null,null,".",null,null,null,null,"."]
[null,null,"Mining",null,null,null,null,".",null,null,null,null,"."]
[null,null,"Mining",null,null,null,null,{"$f":"IF(G84=\"\",\".\",E84*G84/M84)","v":"."},null,null,null,null,"."]
[null,null,"Mining",null,null,null,null,".",null,null,null,null,"."]
[null,null,"Mining",null,null,null,null,".",null,null,null,null,{"$f":"IF(E86=\"\",\".\",IF(G86<>\"\",G86*E86+K86*(F86/100),(K86-L86)*(F86/100)+I86*J86))","v":"."}]
[null,null,null,"Total Mining",{"$f":"SUM(E77:E86)","v":0},null,null,".",null,{"$f":"SUM(J77:J86)","v":0},{"$f":"SUM(K77:K86)","v":0},{"$f":"SUM(L77:L86)","v":0},{"$f":"SUM(M77:M86)","v":0}]
[null,null,"Total Assessments:",null,{"$f":"E39+E65+E76+E87","v":13760},null,null,"Total Rateable Land Value:",null,null,{"$f":"K39+K65+K76+K87","v":12173880314},"Sub-Total:",{"$f":"M39+M65+M76+M87","v":22650649.7657394}]
[]
[]
[null,null,null,null,null,null,null,"Calculation of Notional General Income - Special Rates"]
[]
[null,null,"Rating Category   (s514-518)","Name of special rate","Number of Assessments","Ad Valorem Rate","Base Amount\n$","Base Amount %","Minimum\nAmount\n$","Number on Minimum","Land Value\n(see note above)","Land Value of Land on Minimum","Notional\nIncome\n"]
[null,null,"Residential","Not Applicable",null,null,null,{"$f":"IF(G94=\"\",\".\",E94*G94/M94)","v":"."},null,null,null,null,{"$f":"IF(E94=\"\",\".\",IF(G94<>\"\",G94*E94+K94*(F94/100),(K94-L94)*(F94/100)+I94*J94))","v":"."}]
[null,null,"Residential",null,null,null,null,".",null,null,null,null,"."]
[null,null,"Residential",null,null,null,null,".",null,null,null,null,"."]
[null,null,"Residential",null,null,null,null,".",null,null,null,null,"."]
[null,null,"Residential",null,null,null,null,".",null,null,null,null,"."]
[null,null,"Residential",null,null,null,null,".",null,null,null,null,"."]
[null,null,"Residential",null,null,null,null,".",null,null,null,null,"."]
[null,null,"Residential",null,null,null,null,".",null,null,null,null,"."]
[null,null,"Residential",null,null,null,null,".",null,null,null,null,"."]
[null,null,"Residential",null,null,null,null,".",null,null,null,null,"."]
[null,null,"Business","Not Applicable",null,null,null,".",null,null,null,null,"."]
[null,null,"Business",null,null,null,null,".",null,null,null,null,"."]
[null,null,"Business",null,null,null,null,".",null,null,null,null,"."]
[null,null,"Business",null,null,null,null,".",null,null,null,null,"."]
[null,null,"Business",null,null,null,null,".",null,null,null,null,"."]
[null,null,"Business",null,null,null,null,".",null,null,null,null,"."]
[null,null,"Business",null,null,null,null,".",null,null,null,null,"."]
[null,null,"Business",null,null,null,null,".",null,null,null,null,"."]
[null,null,"Business",null,null,null,null,".",null,null,null,null,"."]
[null,null,"Business",null,null,null,null,".",null,null,null,null,"."]
[null,null,"Business",null,null,null,null,".",null,null,null,null,"."]
[null,null,"Business",null,null,null,null,".",null,null,null,null,"."]
[null,null,"Business",null,null,null,null,".",null,null,null,null,"."]
[null,null,"Business",null,null,null,null,".",null,null,null,null,"."]
[null,null,"Business",null,null,null,null,".",null,null,null,null,"."]
[null,null,"Business",null,null,null,null,".",null,null,null,null,"."]
[null,null,"Business",null,null,null,null,".",null,null,null,null,"."]
[null,null,"Business",null,null,null,null,".",null,null,null,null,"."]
[null,null,"Business",null,null,null,null,".",null,null,null,null,"."]
[null,null,"Business",null,null,null,null,".",null,null,null,null,"."]
[null,null,"Farmland","Not Applicable",null,null,null,".",null,null,null,null,"."]
[null,null,"Farmland",null,null,null,null,".",null,null,null,null,"."]
[null,null,"Farmland",null,null,null,null,{"$f":"IF(G126=\"\",\".\",E126*G126/M126)","v":"."},null,null,null,null,"."]
[null,null,"Farmland",null,null,null,null,".",null,null,null,null,"."]
[null,null,"Farmland",null,null,null,null,".",null,null,null,null,"."]
[null,null,"Farmland",null,null,null,null,".",null,null,null,null,"."]
[null,null,"Farmland",null,null,null,null,".",null,null,null,null,"."]
[null,null,"Farmland",null,null,null,null,".",null,null,null,null,"."]
[null,null,"Farmland",null,null,null,null,".",null,null,null,null,"."]
[null,null,"Farmland",null,null,null,null,".",null,null,null,null,"."]
[null,null,"Mining","Not Applicable",null,null,null,".",null,null,null,null,"."]
[null,null,"Mining",null,null,null,null,".",null,null,null,null,"."]
[null,null,"Mining",null,null,null,null,".",null,null,null,null,"."]
[null,null,"Mining",null,null,null,null,".",null,null,null,null,"."]
[null,null,"Mining",null,null,null,null,".",null,null,null,null,"."]
[null,null,"Mining",null,null,null,null,".",null,null,null,null,"."]
[null,null,"Mining",null,null,null,null,".",null,null,null,null,"."]
[null,null,"Mining",null,null,null,null,".",null,null,null,null,"."]
[null,null,"Mining",null,null,null,null,".",null,null,null,null,"."]
[null,null,"Mining",null,null,null,null,".",null,null,null,null,{"$f":"IF(E143=\"\",\".\",IF(G143<>\"\",G143*E143+K143*(F143/100),(K143-L143)*(F143/100)+I143*J143))","v":"."}]
[null,null,null,null,null,null,null,null,null,null,null,"Sub-Total:",{"$f":"SUM(M94:M143)","v":0}]
[]
[]
[null,null,null,null,null,null,null,"Calculation of Notional General Income - Annual Charges"]
[]
[null,null,"Annual Charges (excluding water supply, sewerage and domestic and non-domestic waste management services)",null,null,null,null,null,null,null,"Number of\nAssessments","Amount of Charge\n$","Notional\nIncome\n"]
[null,null,"Not Applicable",null,null,null,null,null,null,null,0,0,{"$f":"IF(C150=\"\",\".\",K150*L150)","v":0}]
[null,null,null,null,null,null,null,null,null,null,null,null,{"$f":"IF(C151=\"\",\".\",K151*L151)","v":"."}]
[null,null,null,null,null,null,null,null,null,null,null,null,"."]
[null,null,null,null,null,null,null,null,null,null,null,null,"."]
[null,null,null,null,null,null,null,null,null,null,null,null,"."]
[null,null,null,null,null,null,null,null,null,null,null,null,"."]
[null,null,null,null,null,null,null,null,null,null,null,null,"."]
[null,null,null,null,null,null,null,null,null,null,null,null,"."]
[null,null,null,null,null,null,null,null,null,null,null,"Sub-Total:",{"$f":"SUM(M150:M157)","v":0}]
[]
[]
[null,null,null,null,null,null,null,null,null,null,"Total Notional General Income:",null,{"$f":"M88+M144+M158","v":22650649.7657394}]
[]
[null,null,"Note: Section 505(a) of the Act provides for those rates and charges that are to be included in general income, including certain section 501 annual charges."]

{"sheet":"WK3 - Notional GI Yr1 YIELD","index":7,"n_rows":168,"n_cols":13,"rows_kept":168,"cut":false,"hidden":false,"merged":[]}
[]
[]
[null,null,{"$f":"'WK2 - Notional General Income'!$C$3","v":"Burwood Council"}]
[]
[null,null,null,null,null,null,null,"WORKSHEET 3"]
[]
[null,null,null,null,null,null,null,{"$f":"\"CALCULATION OF NOTIONAL GENERAL INCOME \"&'WK0 - Input data'!$G$58","v":"CALCULATION OF NOTIONAL GENERAL INCOME 2019-20"}]
[]
[null,null,null,null,null,null,null,"All dollars in nominal terms "]
[]
[null,null,null,null,null,null,null,"This worksheet must contain the rating structure proposed  for the first year of the special variation application. "]
[null,null,null,null,null,null,null,"Note: A rating structure that does not comply with the legislation may not be approved.  It is Council's responsibility to check its rating structure with OLG before submission to IPART."]
[]
[null,null,null,null,null,null,null,"Calculation of Notional General Income - Ordinary Rates"]
[]
[]
[]
[null,null,"Rating Category   (s514-518)","Name of \nsub-category ","Number of Assessments","Ad valorem rate\n(cents)","Base Amount\n$","Base Amount\n%","Minimum\nAmount\n$","Number on Minimum","Land Value as at\nstart of year\n$","Land Value of Land on Minimum $","Notional General\nIncome"]
[null,null,"Residential","Residential",{"$f":"9805.92+48+43-1+0+120","v":10015.92},0.12787499999999999,null,{"$f":"IF(G19=\"\",\".\",E19*G19/M19)","v":"."},973.71,{"$f":"3857.07+48+44-1+0+125","v":4073.07},{"$f":"9304497622+9751040+7560960+0-70000-212840","v":9321526782},{"$f":"1383827967+9751040+7120960-75000+18837160","v":1419462127},{"$f":"IF(E19=\"\",\".\",IF(G19<>\"\",G19*E19+K19*(F19/100),(K19-L19)*(F19/100)+I19*J19))","v":14070754.16728125}]
[null,null,"Residential","Town Centre",{"$f":"2747+35","v":2782},8.1877000000000005E-2,null,{"$f":"IF(G20=\"\",\".\",E20*G20/M20)","v":"."},1241.74,{"$f":"2702+37","v":2739},{"$f":"1091033054-9400960","v":1081632094},{"$f":"773803054-2020960","v":771782094},3654821.7445]
[null,null,"Residential",null,null,null,null,".",null,null,null,null,"."]
[null,null,"Residential",null,null,null,null,".",null,null,null,null,"."]
[null,null,"Residential",null,null,null,null,".",null,null,null,null,"."]
[null,null,"Residential",null,null,null,null,".",null,null,null,null,"."]
[null,null,"Residential",null,null,null,null,".",null,null,null,null,"."]
[null,null,"Residential",null,null,null,null,".",null,null,null,null,"."]
[null,null,"Residential",null,null,null,null,".",null,null,null,null,"."]
[null,null,"Residential",null,null,null,null,".",null,null,null,null,"."]
[null,null,"Residential",null,null,null,null,".",null,null,null,null,"."]
[null,null,"Residential",null,null,null,null,".",null,null,null,null,"."]
[null,null,"Residential",null,null,null,null,".",null,null,null,null,"."]
[null,null,"Residential",null,null,null,null,".",null,null,null,null,"."]
[null,null,"Residential",null,null,null,null,".",null,null,null,null,"."]
[null,null,"Residential",null,null,null,null,".",null,null,null,null,"."]
[null,null,"Residential",null,null,null,null,".",null,null,null,null,"."]
[null,null,"Residential",null,null,null,null,".",null,null,null,null,"."]
[null,null,"Residential",null,null,null,null,".",null,null,null,null,"."]
[null,null,"Residential",null,null,null,null,".",null,null,null,null,"."]
[null,null,null,"Total Residential",{"$f":"SUM(E19:E38)","v":12797.92},null,null,null,null,{"$f":"SUM(J19:J38)","v":6812.07},{"$f":"SUM(K19:K38)","v":10403158876},{"$f":"SUM(L19:L38)","v":2191244221},{"$f":"SUM(M19:M38)","v":17725575.911781251}]
[null,null,"Business","Business A",{"$f":"458.08+1","v":459.08},0.21613599999999999,null,".",1064.8,{"$f":"135.79+3","v":138.79},{"$f":"667025497-9778200","v":657247297},{"$f":"33613173+811800","v":34424973},{"$f":"IF(E40=\"\",\".\",IF(G40<>\"\",G40*E40+K40*(F40/100),(K40-L40)*(F40/100)+I40*J40))","v":1493926.8502006398}]
[null,null,"Business","Business B",43,0.302201,null,".",1064.8,3,{"$f":"198865100","v":198865100},607740,602330.12449359999]
[null,null,"Business","Business C",31,0.55262500000000003,null,".",1064.8,2,75276920,126840,417427.72959999996]
[null,null,"Business","Business D",42,0.70116900000000004,null,".",1362.15,4,285381000,512500,2002858.2127650001]
[null,null,"Business","Town Centre Minor",387,0.212669,null,".",1362.15,222,553951121,35917171,1404094.9211255]
[null,null,"Business",null,null,null,null,".",null,null,null,null,"."]
[null,null,"Business",null,null,null,null,".",null,null,null,null,"."]
[null,null,"Business",null,null,null,null,".",null,null,null,null,"."]
[null,null,"Business",null,null,null,null,".",null,null,null,null,"."]
[null,null,"Business",null,null,null,null,".",null,null,null,null,"."]
[null,null,"Business",null,null,null,null,".",null,null,null,null,"."]
[null,null,"Business",null,null,null,null,".",null,null,null,null,"."]
[null,null,"Business",null,null,null,null,".",null,null,null,null,"."]
[null,null,"Business",null,null,null,null,".",null,null,null,null,"."]
[null,null,"Business",null,null,null,null,".",null,null,null,null,"."]
[null,null,"Business",null,null,null,null,".",null,null,null,null,"."]
[null,null,"Business",null,null,null,null,".",null,null,null,null,"."]
[null,null,"Business",null,null,null,null,".",null,null,null,null,"."]
[null,null,"Business",null,null,null,null,".",null,null,null,null,"."]
[null,null,"Business",null,null,null,null,".",null,null,null,null,"."]
[null,null,"Business",null,null,null,null,".",null,null,null,null,"."]
[null,null,"Business",null,null,null,null,".",null,null,null,null,"."]
[null,null,"Business",null,null,null,null,".",null,null,null,null,"."]
[null,null,"Business",null,null,null,null,".",null,null,null,null,"."]
[null,null,"Business",null,null,null,null,".",null,null,null,null,"."]
[null,null,null,"Total Business",{"$f":"SUM(E40:E64)","v":962.07999999999993},null,null,null,null,{"$f":"SUM(J40:J64)","v":369.78999999999996},{"$f":"SUM(K40:K64)","v":1770721438},{"$f":"SUM(L40:L64)","v":71589224},{"$f":"SUM(M40:M64)","v":5920637.8381847404}]
[null,null,"Farmland","Not Applicable",null,null,null,{"$f":"IF(G66=\"\",\".\",E66*G66/M66)","v":"."},null,null,null,null,{"$f":"IF(E66=\"\",\".\",IF(G66<>\"\",G66*E66+K66*(F66/100),(K66-L66)*(F66/100)+I66*J66))","v":"."}]
[null,null,"Farmland",null,null,null,null,".",null,null,null,null,"."]
[null,null,"Farmland",null,null,null,null,".",null,null,null,null,"."]
[null,null,"Farmland",null,null,null,null,".",null,null,null,null,"."]
[null,null,"Farmland",null,null,null,null,".",null,null,null,null,"."]
[null,null,"Farmland",null,null,null,null,".",null,null,null,null,"."]
[null,null,"Farmland",null,null,null,null,".",null,null,null,null,"."]
[null,null,"Farmland",null,null,null,null,".",null,null,null,null,"."]
[null,null,"Farmland",null,null,null,null,".",null,null,null,null,"."]
[null,null,"Farmland",null,null,null,null,".",null,null,null,null,"."]
[null,null,null,"Total Farmland",{"$f":"SUM(E66:E75)","v":0},null,null,null,null,{"$f":"SUM(J66:J75)","v":0},{"$f":"SUM(K66:K75)","v":0},{"$f":"SUM(L66:L75)","v":0},{"$f":"SUM(M66:M75)","v":0}]
[null,null,"Mining","Not Applicable",null,null,null,{"$f":"IF(G77=\"\",\".\",E77*G77/M77)","v":"."},null,null,null,null,{"$f":"IF(E77=\"\",\".\",IF(G77<>\"\",G77*E77+K77*(F77/100),(K77-L77)*(F77/100)+I77*J77))","v":"."}]
[null,null,"Mining",null,null,null,null,".",null,null,null,null,"."]
[null,null,"Mining",null,null,null,null,".",null,null,null,null,"."]
[null,null,"Mining",null,null,null,null,".",null,null,null,null,"."]
[null,null,"Mining",null,null,null,null,".",null,null,null,null,"."]
[null,null,"Mining",null,null,null,null,".",null,null,null,null,"."]
[null,null,"Mining",null,null,null,null,".",null,null,null,null,"."]
[null,null,"Mining",null,null,null,null,".",null,null,null,null,"."]
[null,null,"Mining",null,null,null,null,".",null,null,null,null,"."]
[null,null,"Mining",null,null,null,null,".",null,null,null,null,"."]
[null,null,null,"Total Mining",{"$f":"SUM(E77:E86)","v":0},null,null,null,null,{"$f":"SUM(J77:J86)","v":0},{"$f":"SUM(K77:K86)","v":0},{"$f":"SUM(L77:L86)","v":0},{"$f":"SUM(M77:M86)","v":0}]
[null,null,"Total Assessments:",null,{"$f":"E39+E65+E76+E87","v":13760},null,null,"Total Rateable Land Value:",null,null,{"$f":"K39+K65+K76+K87","v":12173880314},"Sub-Total:",{"$f":"M39+M65+M76+M87","v":23646213.749965992}]
[]
[]
[null,null,null,null,null,null,null,"Calculation of Notional General Income - Special Rates"]
[]
[null,null,"Rating Category   (s514-518)","Name of special rate","Number of Assessments","Ad Valorem Rate","Base Amount\n$","Base Amount %","Minimum\nAmount\n$","Number on Minimum","Land Value\nas at\nstart of year","Land Value of Land on Minimum","Notional\nIncome\n"]
[null,null,"Residential","Not Applicable",null,null,null,{"$f":"IF(G94=\"\",\".\",E94*G94/M94)","v":"."},null,null,null,null,{"$f":"IF(E94=\"\",\".\",IF(G94<>\"\",G94*E94+K94*(F94/100),(K94-L94)*(F94/100)+I94*J94))","v":"."}]
[null,null,"Residential",null,null,null,null,".",null,null,null,null,"."]
[null,null,"Residential",null,null,null,null,".",null,null,null,null,"."]
[null,null,"Residential",null,null,null,null,".",null,null,null,null,"."]
[null,null,"Residential",null,null,null,null,".",null,null,null,null,"."]
[null,null,"Residential",null,null,null,null,".",null,null,null,null,"."]
[null,null,"Residential",null,null,null,null,".",null,null,null,null,"."]
[null,null,"Residential",null,null,null,null,".",null,null,null,null,"."]
[null,null,"Residential",null,null,null,null,".",null,null,null,null,"."]
[null,null,"Residential",null,null,null,null,".",null,null,null,null,"."]
[null,null,"Business","Not Applicable",null,null,null,".",null,null,null,null,"."]
[null,null,"Business",null,null,null,null,".",null,null,null,null,"."]
[null,null,"Business",null,null,null,null,".",null,null,null,null,"."]
[null,null,"Business",null,null,null,null,".",null,null,null,null,"."]
[null,null,"Business",null,null,null,null,".",null,null,null,null,"."]
[null,null,"Business",null,null,null,null,".",null,null,null,null,"."]
[null,null,"Business",null,null,null,null,".",null,null,null,null,"."]
[null,null,"Business",null,null,null,null,".",null,null,null,null,"."]
[null,null,"Business",null,null,null,null,".",null,null,null,null,"."]
[null,null,"Business",null,null,null,null,".",null,null,null,null,"."]
[null,null,"Business",null,null,null,null,".",null,null,null,null,"."]
[null,null,"Business",null,null,null,null,".",null,null,null,null,"."]
[null,null,"Business",null,null,null,null,".",null,null,null,null,"."]
[null,null,"Business",null,null,null,null,".",null,null,null,null,"."]
[null,null,"Business",null,null,null,null,".",null,null,null,null,"."]
[null,null,"Business",null,null,null,null,".",null,null,null,null,"."]
[null,null,"Business",null,null,null,null,".",null,null,null,null,"."]
[null,null,"Business",null,null,null,null,".",null,null,null,null,"."]
[null,null,"Business",null,null,null,null,".",null,null,null,null,"."]
[null,null,"Business",null,null,null,null,".",null,null,null,null,"."]
[null,null,"Farmland","Not Applicable",null,null,null,".",null,null,null,null,"."]
[null,null,"Farmland",null,null,null,null,".",null,null,null,null,"."]
[null,null,"Farmland",null,null,null,null,{"$f":"IF(G126=\"\",\".\",E126*G126/M126)","v":"."},null,null,null,null,{"$f":"IF(E126=\"\",\".\",IF(G126<>\"\",G126*E126+K126*(F126/100),(K126-L126)*(F126/100)+I126*J126))","v":"."}]
[null,null,"Farmland",null,null,null,null,".",null,null,null,null,"."]
[null,null,"Farmland",null,null,null,null,".",null,null,null,null,"."]
[null,null,"Farmland",null,null,null,null,".",null,null,null,null,"."]
[null,null,"Farmland",null,null,null,null,".",null,null,null,null,"."]
[null,null,"Farmland",null,null,null,null,".",null,null,null,null,"."]
[null,null,"Farmland",null,null,null,null,".",null,null,null,null,"."]
[null,null,"Farmland",null,null,null,null,".",null,null,null,null,"."]
[null,null,"Mining","Not Applicable",null,null,null,".",null,null,null,null,"."]
[null,null,"Mining",null,null,null,null,".",null,null,null,null,"."]
[null,null,"Mining",null,null,null,null,".",null,null,null,null,"."]
[null,null,"Mining",null,null,null,null,".",null,null,null,null,"."]
[null,null,"Mining",null,null,null,null,".",null,null,null,null,"."]
[null,null,"Mining",null,null,null,null,".",null,null,null,null,"."]
[null,null,"Mining",null,null,null,null,".",null,null,null,null,"."]
[null,null,"Mining",null,null,null,null,".",null,null,null,null,"."]
[null,null,"Mining",null,null,null,null,".",null,null,null,null,"."]
[null,null,"Mining",null,null,null,null,".",null,null,null,null,"."]
[null,null,null,null,null,null,null,null,null,null,null,"Sub-Total:",{"$f":"SUM(M94:M143)","v":0}]
[]
[]
[null,null,null,null,null,null,null,"Calculation of Notional General Income - Annual Charges"]
[]
[null,null,"Annual Charges (excluding water supply, sewerage and domestic and non-domestic waste management services)",null,null,null,null,null,null,null,"Number of\nAssessments","Amount of Charge\n$","Notional Income\n"]
[null,null,"Not Applicable",null,null,null,null,null,null,null,0,0,{"$f":"IF(C150=\"\",\".\",K150*L150)","v":0}]
[null,null,null,null,null,null,null,null,null,null,null,null,"."]
[null,null,null,null,null,null,null,null,null,null,null,null,"."]
[null,null,null,null,null,null,null,null,null,null,null,null,"."]
[null,null,null,null,null,null,null,null,null,null,null,null,"."]
[null,null,null,null,null,null,null,null,null,null,null,null,"."]
[null,null,null,null,null,null,null,null,null,null,null,null,"."]
[null,null,null,null,null,null,null,null,null,null,null,null,"."]
[null,null,null,null,null,null,null,null,null,null,null,"Sub-Total:",{"$f":"SUM(M150:M157)","v":0}]
[]
[]
[null,null,null,null,null,null,"Total Notional General Income",null,null,null,null,null,{"$f":"M88+M144+M158","v":23646213.749965992}]
[]
[null,null,null,null,null,null,"LESS: Valuation Objection Income ",null,null,null,null,null,{"$f":"-'WK1 - Identification'!K47","v":0}]
[]
[null,null,null,null,null,null,"NET   Notional General Income",null,null,null,null,null,{"$f":"M161+M163","v":23646213.749965992}]
[]
[]
[null,null,"Note: Section 505(a) of the Act provides for those rates and charges that are to be included in general income, including certain section 501 annual charges."]

{"sheet":"WK4 - PGI summary","index":8,"n_rows":97,"n_cols":17,"rows_kept":97,"cut":false,"hidden":false,"merged":[]}
[]
[]
[null,null,{"$f":"'WK2 - Notional General Income'!$C$3","v":"Burwood Council"}]
[]
[null,null,null,null,"WORKSHEET 4"]
[]
[null,null,null,null,{"$f":"\"PERMISSIBLE GENERAL INCOME SUMMARY FOR \"&'WK0 - Input data'!$D$45","v":"PERMISSIBLE GENERAL INCOME SUMMARY FOR 2019-20"}]
[null,null,null,null,"  All dollars in nominal terms"]
[null,null,null,null,"Please check all income adjustments and expiring variation amounts with OLG"]
[null,null,null,null,"before submitting the application.",null,null,null,null,"check = 0"]
[null,null,"Prior year Notional General Income",null,null,null,null,{"$f":"'WK2 - Notional General Income'!M161","v":22650649.7657394},null,{"$f":"IF(H11=0,0,H11-G41)","v":0}]
[null,null,"Less:","Expiry of a prior special variation",null,null,null,{"$f":"'WK1 - Identification'!F71","v":0},null,{"$f":"IF(H12=0,0,H12-G42)","v":0}]
[]
[null,null,"Adjusted first year Notional General Income",null,null,null,"$",{"$f":"H11-H12","v":22650649.7657394}]
[]
[null,null,"Plus:",{"$f":"CHOOSE('WK1 - Identification'!$R$24,\"Existing SV increase - first year\",\"Rate peg increase - first year\")","v":"Rate peg increase - first year"},null,{"$f":"'WK1 - Identification'!G61","v":2.7E-2},null,{"$f":"H14*F16","v":611567.54367496376},null,{"$f":"IF(H16=0,0,H16-G45)","v":0}]
[null,null,"Plus:","Additional increase - first year",null,{"$f":"'WK1 - Identification'!K32","v":0.02},null,{"$f":"H14*F17","v":453012.99531478802},null,{"$f":"IF(H17=0,0,H17-G46)","v":0}]
[null,null,"Plus:","Crown Land adjustment - first year",null,{"$f":"IF(H14=0,0,H18/H14)","v":0},null,{"$f":"'WK1 - Identification'!K45","v":0},null,{"$f":"IF(H18=0,0,H18-G47)","v":0}]
[]
[null,null,null,"Total special variation - first year",null,{"$f":"(F16+F17+F18)","v":4.7E-2},"$",{"$f":"H14*F20","v":1064580.5389897518},null,{"$f":"IF(H20=0,0,H20-G48)","v":0}]
[]
[null,null,"Other First Year Adjustments:"]
[null,null,"Plus/Minus:","Prior year Catch-up/(Excess)",null,null,null,{"$f":"'WK1 - Identification'!K46","v":-69017}]
[null,null,"Minus:","Valuation Objections claimed in prior year",null,null,null,{"$f":"-'WK1 - Identification'!K47","v":0}]
[]
[]
[null,null,null,null,null,"Total Adjustments",null,{"$f":"H23+H24","v":-69017},null,{"$f":"H27-G51","v":0}]
[]
[null,null,null,"First year Permissible General Income",null,null,"$",{"$f":"H14+H20+H27","v":23646213.304729152},null,{"$f":"IF(H29=0,0,H29-G52)","v":0}]
[]
[]
[]
[]
[]
[]
[null,{"$f":"\"PERMISSABLE GENERAL INCOME (PGI) OVER PROPOSED SV PERIOD (\"&E41&\")\"","v":"PERMISSABLE GENERAL INCOME (PGI) OVER PROPOSED SV PERIOD ($ nominal)"}]
[null,null,null,null,null,{"$f":"IF('WK1 - Identification'!F$58=0,\".\",'WK0 - Input data'!F$55)","v":"Year 0"},{"$f":"IF('WK1 - Identification'!G$58=0,\".\",'WK0 - Input data'!G$55)","v":"Year 1"},{"$f":"IF('WK1 - Identification'!H$58=0,\".\",'WK0 - Input data'!H$55)","v":"Year 2"},{"$f":"IF('WK1 - Identification'!I$58=0,\".\",'WK0 - Input data'!I$55)","v":"Year 3"},{"$f":"IF('WK1 - Identification'!J$58=0,\".\",'WK0 - Input data'!J$55)","v":"Year 4"},{"$f":"IF('WK1 - Identification'!K$58=0,\".\",'WK0 - Input data'!K$55)","v":"."},{"$f":"IF('WK1 - Identification'!L$58=0,\".\",'WK0 - Input data'!L$55)","v":"."},{"$f":"IF('WK1 - Identification'!M$58=0,\".\",'WK0 - Input data'!M$55)","v":"."},"Total","increase"]
[null,null,{"$f":"'WK0 - Input data'!B$58","v":"Financial year"},null,"units",{"$f":"IF('WK1 - Identification'!F$58=0,\".\",'WK0 - Input data'!F$58)","v":"2018-19"},{"$f":"IF('WK1 - Identification'!G$58=0,\".\",'WK0 - Input data'!G$58)","v":"2019-20"},{"$f":"IF('WK1 - Identification'!H$58=0,\".\",'WK0 - Input data'!H$58)","v":"2020-21"},{"$f":"IF('WK1 - Identification'!I$58=0,\".\",'WK0 - Input data'!I$58)","v":"2021-22"},{"$f":"IF('WK1 - Identification'!J$58=0,\".\",'WK0 - Input data'!J$58)","v":"2022-23"},{"$f":"IF('WK1 - Identification'!K$58=0,\".\",'WK0 - Input data'!K$58)","v":"."},{"$f":"IF('WK1 - Identification'!L$58=0,\".\",'WK0 - Input data'!L$58)","v":"."},{"$f":"IF('WK1 - Identification'!M$58=0,\".\",'WK0 - Input data'!M$58)","v":"."},{"$f":"E41","v":"$ nominal"},"%"]
[]
[null,null,"Permissible General Income (PGI) with proposed SV"]
[null,null,"Prior year Notional General Income (NGI)",null,{"$f":"'WK0 - Input data'!$C$62","v":"$ nominal"},null,{"$f":"IF('WK1 - Identification'!G$58=0,\".\",F52)","v":22650649.7657394},{"$f":"IF('WK1 - Identification'!H$58=0,\".\",G52)","v":23646213.304729152},{"$f":"IF('WK1 - Identification'!I$58=0,\".\",H52)","v":24710292.903441966},{"$f":"IF('WK1 - Identification'!J$58=0,\".\",I52)","v":25822256.084096853},{"$f":"IF('WK1 - Identification'!K$58=0,\".\",J52)","v":"."},{"$f":"IF('WK1 - Identification'!L$58=0,\".\",K52)","v":"."},{"$f":"IF('WK1 - Identification'!M$58=0,\".\",L52)","v":"."}]
[null,null,"  less","expiry of a prior special variation",{"$f":"E41","v":"$ nominal"},null,{"$f":"IF(G41=\".\",\".\",'WK1 - Identification'!F71)","v":0},{"$f":"IF(H41=\".\",\".\",'WK1 - Identification'!G71)","v":0},{"$f":"IF(I41=\".\",\".\",'WK1 - Identification'!H71)","v":0},{"$f":"IF(J41=\".\",\".\",'WK1 - Identification'!I71)","v":0},{"$f":"IF(K41=\".\",\".\",'WK1 - Identification'!J71)","v":"."},{"$f":"IF(L41=\".\",\".\",'WK1 - Identification'!K71)","v":"."},{"$f":"IF(M41=\".\",\".\",'WK1 - Identification'!L71)","v":"."}]
[null,null,"Adjusted Notional General income",null,{"$f":"E42","v":"$ nominal"},null,{"$f":"IF(G41=\".\",\".\",G41-G42)","v":22650649.7657394},23646213.304729152,24710292.903441966,25822256.084096853,".",".","."]
[]
[null,null,"     plus",{"$f":"CHOOSE('WK1 - Identification'!$R$24,\"existing SV/rate peg increase\",\"rate peg increase\")","v":"rate peg increase"},{"$f":"$E$41","v":"$ nominal"},null,{"$f":"IF('WK1 - Identification'!G$58=0,\".\",G$43*'WK1 - Identification'!G61)","v":611567.54367496376},{"$f":"IF('WK1 - Identification'!H$58=0,\".\",H$43*'WK1 - Identification'!H61)","v":591155.33261822886},{"$f":"IF('WK1 - Identification'!I$58=0,\".\",I$43*'WK1 - Identification'!I61)","v":617757.32258604921},{"$f":"IF('WK1 - Identification'!J$58=0,\".\",J$43*'WK1 - Identification'!J61)","v":645556.40210242139},{"$f":"IF('WK1 - Identification'!K$58=0,\".\",K$43*'WK1 - Identification'!K61)","v":"."},{"$f":"IF('WK1 - Identification'!L$58=0,\".\",L$43*'WK1 - Identification'!L61)","v":"."},{"$f":"IF('WK1 - Identification'!M$58=0,\".\",M$43*'WK1 - Identification'!M61)","v":"."}]
[null,null,{"$f":"C45","v":"     plus"},"additional increase",{"$f":"E45","v":"$ nominal"},null,{"$f":"IF('WK1 - Identification'!G$58=0,\".\",G$43*'WK1 - Identification'!G62)","v":453012.99531478802},{"$f":"IF('WK1 - Identification'!H$58=0,\".\",H$43*'WK1 - Identification'!H62)","v":472924.26609458297},{"$f":"IF('WK1 - Identification'!I$58=0,\".\",I$43*'WK1 - Identification'!I62)","v":494205.85806883924},{"$f":"IF('WK1 - Identification'!J$58=0,\".\",J$43*'WK1 - Identification'!J62)","v":516445.12168193696},{"$f":"IF('WK1 - Identification'!K$58=0,\".\",K$43*'WK1 - Identification'!K62)","v":"."},{"$f":"IF('WK1 - Identification'!L$58=0,\".\",L$43*'WK1 - Identification'!L62)","v":"."},{"$f":"IF('WK1 - Identification'!M$58=0,\".\",M$43*'WK1 - Identification'!M62)","v":"."}]
[null,null,{"$f":"C46","v":"     plus"},"Crown Land adjustment",{"$f":"E46","v":"$ nominal"},null,{"$f":"IF('WK1 - Identification'!G$58=0,\".\",G$43*'WK1 - Identification'!G63)","v":0},{"$f":"IF('WK1 - Identification'!H$58=0,\".\",H$43*'WK1 - Identification'!H63)","v":0},{"$f":"IF('WK1 - Identification'!I$58=0,\".\",0)","v":0},{"$f":"IF('WK1 - Identification'!J$58=0,\".\",0)","v":0},{"$f":"IF('WK1 - Identification'!K$58=0,\".\",0)","v":"."},{"$f":"IF('WK1 - Identification'!L$58=0,\".\",0)","v":"."},{"$f":"IF('WK1 - Identification'!M$58=0,\".\",0)","v":"."}]
[null,null,"Total proposed SV",null,"$ nominal",null,{"$f":"IF('WK1 - Identification'!G$58=0,\".\",SUM(G45:G47))","v":1064580.5389897518},{"$f":"IF('WK1 - Identification'!H$58=0,\".\",SUM(H45:H47))","v":1064079.5987128117},{"$f":"IF('WK1 - Identification'!I$58=0,\".\",SUM(I45:I47))","v":1111963.1806548885},{"$f":"IF('WK1 - Identification'!J$58=0,\".\",SUM(J45:J47))","v":1162001.5237843583},{"$f":"IF('WK1 - Identification'!K$58=0,\".\",SUM(K45:K47))","v":"."},{"$f":"IF('WK1 - Identification'!L$58=0,\".\",SUM(L45:L47))","v":"."},{"$f":"IF('WK1 - Identification'!M$58=0,\".\",SUM(M45:M47))","v":"."}]
[]
[null,null,"Notional General Income after SV applied",null,{"$f":"$E$41","v":"$ nominal"},null,{"$f":"IF('WK1 - Identification'!G$58=0,\".\",G43+G48)","v":23715230.304729152},{"$f":"IF('WK1 - Identification'!H$58=0,\".\",H43+H48)","v":24710292.903441966},{"$f":"IF('WK1 - Identification'!I$58=0,\".\",I43+I48)","v":25822256.084096853},{"$f":"IF('WK1 - Identification'!J$58=0,\".\",J43+J48)","v":26984257.607881211},{"$f":"IF('WK1 - Identification'!K$58=0,\".\",K43+K48)","v":"."},{"$f":"IF('WK1 - Identification'!L$58=0,\".\",L43+L48)","v":"."},{"$f":"IF('WK1 - Identification'!M$58=0,\".\",M43+M48)","v":"."}]
[null,null,{"$f":"C45","v":"     plus"},"other 1st-year adjustments",{"$f":"E50","v":"$ nominal"},null,{"$f":"'WK1 - Identification'!K46-'WK1 - Identification'!K47","v":-69017},{"$f":"IF(ISNUMBER(H50),0,\".\")","v":0},0,0,".",".","."]
[null,null,"PGI with proposed SV",null,{"$f":"E51","v":"$ nominal"},{"$f":"'WK2 - Notional General Income'!M161","v":22650649.7657394},{"$f":"IF('WK1 - Identification'!G$58=0,\".\",G50+G51)","v":23646213.304729152},{"$f":"IF('WK1 - Identification'!H$58=0,\".\",H50+H51)","v":24710292.903441966},{"$f":"IF('WK1 - Identification'!I$58=0,\".\",I50+I51)","v":25822256.084096853},{"$f":"IF('WK1 - Identification'!J$58=0,\".\",J50+J51)","v":26984257.607881211},{"$f":"IF('WK1 - Identification'!K$58=0,\".\",K50+K51)","v":"."},{"$f":"IF('WK1 - Identification'!L$58=0,\".\",L50+L51)","v":"."},{"$f":"IF('WK1 - Identification'!M$58=0,\".\",M50+M51)","v":"."},{"$f":"INDEX(F52:M52,'WK1 - Identification'!$R$31+1)-F52","v":4333607.8421418108},{"$f":"IF(F52=0,0,N52/F52)","v":0.19132377600472539}]
[]
[null,null,{"$f":"CHOOSE('WK1 - Identification'!$R$24,\"Permissible General Income if only the existing SV/rate peg applied\",\"Permissible General Income if only the rate peg applied\")","v":"Permissible General Income if only the rate peg applied"}]
[null,null,{"$f":"C41","v":"Prior year Notional General Income (NGI)"},null,{"$f":"$E$41","v":"$ nominal"},null,{"$f":"IF('WK1 - Identification'!G$58=0,\".\",F61)","v":22650649.7657394},{"$f":"IF('WK1 - Identification'!H$58=0,\".\",G61)","v":23193200.309414364},{"$f":"IF('WK1 - Identification'!I$58=0,\".\",H61)","v":23773030.317149725},{"$f":"IF('WK1 - Identification'!J$58=0,\".\",I61)","v":24367356.075078469},{"$f":"IF('WK1 - Identification'!K$58=0,\".\",J61)","v":"."},{"$f":"IF('WK1 - Identification'!L$58=0,\".\",K61)","v":"."},{"$f":"IF('WK1 - Identification'!M$58=0,\".\",L61)","v":"."}]
[null,null,{"$f":"C42","v":"  less"},{"$f":"D42","v":"expiry of a prior special variation"},{"$f":"E55","v":"$ nominal"},null,{"$f":"G42","v":0},0,0,0,".",".","."]
[null,null,{"$f":"C43","v":"Adjusted Notional General income"},null,{"$f":"E56","v":"$ nominal"},null,{"$f":"IF('WK1 - Identification'!G$58=0,\".\",G55-G56)","v":22650649.7657394},{"$f":"IF('WK1 - Identification'!H$58=0,\".\",H55-H56)","v":23193200.309414364},{"$f":"IF('WK1 - Identification'!I$58=0,\".\",I55-I56)","v":23773030.317149725},{"$f":"IF('WK1 - Identification'!J$58=0,\".\",J55-J56)","v":24367356.075078469},{"$f":"IF('WK1 - Identification'!K$58=0,\".\",K55-K56)","v":"."},{"$f":"IF('WK1 - Identification'!L$58=0,\".\",L55-L56)","v":"."},{"$f":"IF('WK1 - Identification'!M$58=0,\".\",M55-M56)","v":"."}]
[]
[null,null,{"$f":"C45","v":"     plus"},{"$f":"D45","v":"rate peg increase"},{"$f":"$E$41","v":"$ nominal"},{"$f":"IF('WK1 - Identification'!F$58=0,\".\",'WK1 - Identification'!F61*F57)","v":0},{"$f":"IF('WK1 - Identification'!G$58=0,\".\",'WK1 - Identification'!G61*G57)","v":611567.54367496376},{"$f":"IF('WK1 - Identification'!H$58=0,\".\",'WK1 - Identification'!H61*H57)","v":579830.00773535913},{"$f":"IF('WK1 - Identification'!I$58=0,\".\",'WK1 - Identification'!I61*I57)","v":594325.75792874314},{"$f":"IF('WK1 - Identification'!J$58=0,\".\",'WK1 - Identification'!J61*J57)","v":609183.9018769617},{"$f":"IF('WK1 - Identification'!K$58=0,\".\",'WK1 - Identification'!K61*K57)","v":"."},{"$f":"IF('WK1 - Identification'!L$58=0,\".\",'WK1 - Identification'!L61*L57)","v":"."},{"$f":"IF('WK1 - Identification'!M$58=0,\".\",'WK1 - Identification'!M61*M57)","v":"."}]
[null,null,{"$f":"C51","v":"     plus"},{"$f":"D51","v":"other 1st-year adjustments"},{"$f":"E59","v":"$ nominal"},null,{"$f":"G51","v":-69017},0,0,0,".",".","."]
[null,null,{"$f":"CHOOSE('WK1 - Identification'!$R$24,\"PGI if only the existing SV/rate peg applied\",\"PGI if only the rate peg applied\")","v":"PGI if only the rate peg applied"},null,{"$f":"E60","v":"$ nominal"},{"$f":"F52","v":22650649.7657394},{"$f":"IF('WK1 - Identification'!G$58=0,\".\",SUM(G57:G60))","v":23193200.309414364},{"$f":"IF('WK1 - Identification'!H$58=0,\".\",SUM(H57:H60))","v":23773030.317149725},{"$f":"IF('WK1 - Identification'!I$58=0,\".\",SUM(I57:I60))","v":24367356.075078469},{"$f":"IF('WK1 - Identification'!J$58=0,\".\",SUM(J57:J60))","v":24976539.976955429},{"$f":"IF('WK1 - Identification'!K$58=0,\".\",SUM(K57:K60))","v":"."},{"$f":"IF('WK1 - Identification'!L$58=0,\".\",SUM(L57:L60))","v":"."},{"$f":"IF('WK1 - Identification'!M$58=0,\".\",SUM(M57:M60))","v":"."},{"$f":"INDEX(F61:M61,'WK1 - Identification'!$R$31+1)-F61","v":2325890.2112160288},{"$f":"IF(F61=0,0,N61/F61)","v":0.10268536378740406}]
[]
[null,null,{"$f":"CHOOSE('WK1 - Identification'!$R$24,\"PGI if expiring SV renewed and existing SV/rate peg applied\",\"PGI if expiring SV renewed and rate peg applied\")","v":"PGI if expiring SV renewed and rate peg applied"}]
[null,null,{"$f":"C55","v":"Prior year Notional General Income (NGI)"},null,{"$f":"$E$41","v":"$ nominal"},null,{"$f":"IF('WK1 - Identification'!G$58=0,\".\",F67)","v":22650649.7657394},{"$f":"IF('WK1 - Identification'!H$58=0,\".\",G67)","v":23193200.309414364},{"$f":"IF('WK1 - Identification'!I$58=0,\".\",H67)","v":23773030.317149725},{"$f":"IF('WK1 - Identification'!J$58=0,\".\",I67)","v":24367356.075078469},{"$f":"IF('WK1 - Identification'!K$58=0,\".\",J67)","v":"."},{"$f":"IF('WK1 - Identification'!L$58=0,\".\",K67)","v":"."},{"$f":"IF('WK1 - Identification'!M$58=0,\".\",L67)","v":"."}]
[null,null,{"$f":"C59","v":"     plus"},{"$f":"D59","v":"rate peg increase"},{"$f":"E64","v":"$ nominal"},null,{"$f":"IF('WK1 - Identification'!G$58=0,\".\",G64*'WK1 - Identification'!G61)","v":611567.54367496376},{"$f":"IF('WK1 - Identification'!H$58=0,\".\",H64*'WK1 - Identification'!H61)","v":579830.00773535913},{"$f":"IF('WK1 - Identification'!I$58=0,\".\",I64*'WK1 - Identification'!I61)","v":594325.75792874314},{"$f":"IF('WK1 - Identification'!J$58=0,\".\",J64*'WK1 - Identification'!J61)","v":609183.9018769617},{"$f":"IF('WK1 - Identification'!K$58=0,\".\",K64*'WK1 - Identification'!K61)","v":"."},{"$f":"IF('WK1 - Identification'!L$58=0,\".\",L64*'WK1 - Identification'!L61)","v":"."},{"$f":"IF('WK1 - Identification'!M$58=0,\".\",M64*'WK1 - Identification'!M61)","v":"."}]
[null,null,{"$f":"C60","v":"     plus"},{"$f":"D60","v":"other 1st-year adjustments"},{"$f":"E65","v":"$ nominal"},null,{"$f":"G51","v":-69017},0,0,0,".",".","."]
[null,null,{"$f":"C63","v":"PGI if expiring SV renewed and rate peg applied"},null,"$ nominal",{"$f":"F52","v":22650649.7657394},{"$f":"IF('WK1 - Identification'!G$58=0,\".\",SUM(G64:G66))","v":23193200.309414364},{"$f":"IF('WK1 - Identification'!H$58=0,\".\",SUM(H64:H66))","v":23773030.317149725},{"$f":"IF('WK1 - Identification'!I$58=0,\".\",SUM(I64:I66))","v":24367356.075078469},{"$f":"IF('WK1 - Identification'!J$58=0,\".\",SUM(J64:J66))","v":24976539.976955429},{"$f":"IF('WK1 - Identification'!K$58=0,\".\",SUM(K64:K66))","v":"."},{"$f":"IF('WK1 - Identification'!L$58=0,\".\",SUM(L64:L66))","v":"."},{"$f":"IF('WK1 - Identification'!M$58=0,\".\",SUM(M64:M66))","v":"."},{"$f":"INDEX(F67:M67,'WK1 - Identification'!$R$31+1)-F67","v":2325890.2112160288},{"$f":"IF(F67=0,0,N67/F67)","v":0.10268536378740406}]
[]
[]
[]
[]
[null,"INCREASES IN PERMISSABLE GENERAL INCOME (PGI) OVER PROPOSED SV PERIOD (nominal)"]
[null,null,null,null,null,{"$f":"F$37","v":"Year 0"},"Year 1","Year 2","Year 3","Year 4",".",".",".","Total","increase",null,"check = 0"]
[null,null,{"$f":"C$38","v":"Financial year"},null,null,{"$f":"F$38","v":"2018-19"},"2019-20","2020-21","2021-22","2022-23",".",".",".",{"$f":"E82","v":"$ nominal"},"%"]
[]
[null,null,"Annual % increase in PGI"]
[null,null,{"$f":"$C$52","v":"PGI with proposed SV"},null,"%",null,{"$f":"IF('WK1 - Identification'!G$58=0,\".\",G82/F$52)","v":4.3952979242812183E-2},{"$f":"IF('WK1 - Identification'!H$58=0,\".\",H82/G$52)","v":4.5000000000000054E-2},{"$f":"IF('WK1 - Identification'!I$58=0,\".\",I82/H$52)","v":4.4999999999999943E-2},{"$f":"IF('WK1 - Identification'!J$58=0,\".\",J82/I$52)","v":4.4999999999999984E-2},{"$f":"IF('WK1 - Identification'!K$58=0,\".\",K82/J$52)","v":"."},{"$f":"IF('WK1 - Identification'!L$58=0,\".\",L82/K$52)","v":"."},{"$f":"IF('WK1 - Identification'!M$58=0,\".\",M82/L$52)","v":"."},null,{"$f":"O52","v":0.19132377600472539}]
[null,null,{"$f":"$C$61","v":"PGI if only the rate peg applied"},null,{"$f":"E77","v":"%"},null,{"$f":"IF('WK1 - Identification'!G$58=0,\".\",G83/F$61)","v":2.3952979242812183E-2},{"$f":"IF('WK1 - Identification'!H$58=0,\".\",H83/G61)","v":2.5000000000000057E-2},{"$f":"IF('WK1 - Identification'!I$58=0,\".\",I83/H61)","v":2.5000000000000036E-2},{"$f":"IF('WK1 - Identification'!J$58=0,\".\",J83/I61)","v":2.4999999999999929E-2},{"$f":"IF('WK1 - Identification'!K$58=0,\".\",K83/J61)","v":"."},{"$f":"IF('WK1 - Identification'!L$58=0,\".\",L83/K61)","v":"."},{"$f":"IF('WK1 - Identification'!M$58=0,\".\",M83/L61)","v":"."},null,{"$f":"O61","v":0.10268536378740406}]
[null,null,{"$f":"C67","v":"PGI if expiring SV renewed and rate peg applied"},null,{"$f":"E78","v":"%"},null,{"$f":"IF('WK1 - Identification'!G$58=0,\".\",G84/F$61)","v":2.3952979242812183E-2},{"$f":"IF('WK1 - Identification'!H$58=0,\".\",H84/G$61)","v":2.5000000000000057E-2},{"$f":"IF('WK1 - Identification'!I$58=0,\".\",I84/H$61)","v":2.5000000000000036E-2},{"$f":"IF('WK1 - Identification'!J$58=0,\".\",J84/I$61)","v":2.4999999999999929E-2},{"$f":"IF('WK1 - Identification'!K$58=0,\".\",K84/J$61)","v":"."},{"$f":"IF('WK1 - Identification'!L$58=0,\".\",L84/K$61)","v":"."},{"$f":"IF('WK1 - Identification'!M$58=0,\".\",M84/L$61)","v":"."},null,{"$f":"O67","v":0.10268536378740406}]
[]
[null,null,"Annual and cumulative $ increase in PGI"]
[null,null,{"$f":"C77","v":"PGI with proposed SV"},null,{"$f":"$E$41","v":"$ nominal"},null,{"$f":"IF('WK1 - Identification'!G$58=0,\".\",(G52-F52))","v":995563.53898975253},{"$f":"IF('WK1 - Identification'!H$58=0,\".\",(H52-G52))","v":1064079.5987128131},{"$f":"IF('WK1 - Identification'!I$58=0,\".\",(I52-H52))","v":1111963.1806548871},{"$f":"IF('WK1 - Identification'!J$58=0,\".\",(J52-I52))","v":1162001.5237843581},{"$f":"IF('WK1 - Identification'!K$58=0,\".\",(K52-J52))","v":"."},{"$f":"IF('WK1 - Identification'!L$58=0,\".\",(L52-K52))","v":"."},{"$f":"IF('WK1 - Identification'!M$58=0,\".\",(M52-L52))","v":"."},{"$f":"SUM(G82:M82)","v":4333607.8421418108},{"$f":"IF($F$52=0,0,N82/$F$52)","v":0.19132377600472539},null,{"$f":"N82-N52","v":0}]
[null,null,{"$f":"C78","v":"PGI if only the rate peg applied"},null,{"$f":"E82","v":"$ nominal"},null,{"$f":"IF(G41=\".\",\".\",G61-F61)","v":542550.54367496446},579830.00773536041,594325.75792874396,609183.90187695995,".",".",".",{"$f":"SUM(G83:M83)","v":2325890.2112160288},{"$f":"IF($F$52=0,0,N83/$F$52)","v":0.10268536378740406},null,{"$f":"N83-N61","v":0}]
[null,null,{"$f":"C79","v":"PGI if expiring SV renewed and rate peg applied"},null,{"$f":"E83","v":"$ nominal"},null,{"$f":"IF('WK1 - Identification'!G$58=0,\".\",G67-F67)","v":542550.54367496446},{"$f":"IF('WK1 - Identification'!H$58=0,\".\",H67-G67)","v":579830.00773536041},{"$f":"IF('WK1 - Identification'!I$58=0,\".\",I67-H67)","v":594325.75792874396},{"$f":"IF('WK1 - Identification'!J$58=0,\".\",J67-I67)","v":609183.90187695995},{"$f":"IF('WK1 - Identification'!K$58=0,\".\",K67-J67)","v":"."},{"$f":"IF('WK1 - Identification'!L$58=0,\".\",L67-K67)","v":"."},{"$f":"IF('WK1 - Identification'!M$58=0,\".\",M67-L67)","v":"."},{"$f":"SUM(G84:M84)","v":2325890.2112160288},0.10268536378740406,null,{"$f":"N84-N67","v":0}]
[]
[null,null,"Annual $ increase in PGI with proposed SV more than"]
[null,null,{"$f":"C78","v":"PGI if only the rate peg applied"},null,{"$f":"$E$41","v":"$ nominal"},null,{"$f":"IF('WK1 - Identification'!G$58=0,\".\",G82-G83)","v":453012.99531478807},{"$f":"IF('WK1 - Identification'!H$58=0,\".\",H82-H83)","v":484249.5909774527},{"$f":"IF('WK1 - Identification'!I$58=0,\".\",I82-I83)","v":517637.42272614315},{"$f":"IF('WK1 - Identification'!J$58=0,\".\",J82-J83)","v":552817.6219073981},{"$f":"IF('WK1 - Identification'!K$58=0,\".\",K82-K83)","v":"."},{"$f":"IF('WK1 - Identification'!L$58=0,\".\",L82-L83)","v":"."},{"$f":"IF('WK1 - Identification'!M$58=0,\".\",M82-M83)","v":"."},{"$f":"SUM(G87:M87)","v":2007717.630925782},{"$f":"O82-O83","v":8.8638412217321327E-2},null,{"$f":"IF(F61=0,0,(N52-N61)/F61-O87)","v":1.3877787807814457E-17}]
[null,null,{"$f":"C79","v":"PGI if expiring SV renewed and rate peg applied"},null,{"$f":"E87","v":"$ nominal"},null,{"$f":"IF('WK1 - Identification'!G$58=0,\".\",G82-G84)","v":453012.99531478807},{"$f":"IF('WK1 - Identification'!H$58=0,\".\",H82-H84)","v":484249.5909774527},{"$f":"IF('WK1 - Identification'!I$58=0,\".\",I82-I84)","v":517637.42272614315},{"$f":"IF('WK1 - Identification'!J$58=0,\".\",J82-J84)","v":552817.6219073981},{"$f":"IF('WK1 - Identification'!K$58=0,\".\",K82-K84)","v":"."},{"$f":"IF('WK1 - Identification'!L$58=0,\".\",L82-L84)","v":"."},{"$f":"IF('WK1 - Identification'!M$58=0,\".\",M82-M84)","v":"."},{"$f":"SUM(G88:M88)","v":2007717.630925782},{"$f":"O82-O84","v":8.8638412217321327E-2},null,{"$f":"IF(F67=0,0,(N52-N67)/F67-O88)","v":1.3877787807814457E-17}]
[null,null,null,null,null,null,null,null,null,null,null,null,null,null,null,null,{"$f":"N83-N82+N87","v":0}]
[null,null,"Cumulative PGI",null,null,null,null,null,null,null,null,null,null,null,null,null,{"$f":"N84-N82+N88","v":0}]
[null,null,{"$f":"$C$52","v":"PGI with proposed SV"},null,{"$f":"E88","v":"$ nominal"},null,{"$f":"IF('WK1 - Identification'!G$58=0,\".\",SUM($G52:G52))","v":23646213.304729152},{"$f":"IF('WK1 - Identification'!H$58=0,\".\",SUM($G52:H52))","v":48356506.208171114},{"$f":"IF('WK1 - Identification'!I$58=0,\".\",SUM($G52:I52))","v":74178762.292267963},{"$f":"IF('WK1 - Identification'!J$58=0,\".\",SUM($G52:J52))","v":101163019.90014917},{"$f":"IF('WK1 - Identification'!K$58=0,\".\",SUM($G52:K52))","v":"."},{"$f":"IF('WK1 - Identification'!L$58=0,\".\",SUM($G52:L52))","v":"."},{"$f":"IF('WK1 - Identification'!M$58=0,\".\",SUM($G52:M52))","v":"."},{"$f":"INDEX(F91:M91,'WK1 - Identification'!$R$31+1)-F91","v":101163019.90014917}]
[null,null,{"$f":"$C$61","v":"PGI if only the rate peg applied"},null,{"$f":"E91","v":"$ nominal"},null,{"$f":"IF('WK1 - Identification'!G$58=0,\".\",SUM($G61:G61))","v":23193200.309414364},{"$f":"IF('WK1 - Identification'!H$58=0,\".\",SUM($G61:H61))","v":46966230.626564085},{"$f":"IF('WK1 - Identification'!I$58=0,\".\",SUM($G61:I61))","v":71333586.701642558},{"$f":"IF('WK1 - Identification'!J$58=0,\".\",SUM($G61:J61))","v":96310126.678597987},{"$f":"IF('WK1 - Identification'!K$58=0,\".\",SUM($G61:K61))","v":"."},{"$f":"IF('WK1 - Identification'!L$58=0,\".\",SUM($G61:L61))","v":"."},{"$f":"IF('WK1 - Identification'!M$58=0,\".\",SUM($G61:M61))","v":"."},{"$f":"INDEX(F92:M92,'WK1 - Identification'!$R$31+1)-F92","v":96310126.678597987}]
[null,null,{"$f":"C84","v":"PGI if expiring SV renewed and rate peg applied"},null,{"$f":"E92","v":"$ nominal"},null,{"$f":"IF('WK1 - Identification'!G$58=0,\".\",SUM($G67:G67))","v":23193200.309414364},{"$f":"IF('WK1 - Identification'!H$58=0,\".\",SUM($G67:H67))","v":46966230.626564085},{"$f":"IF('WK1 - Identification'!I$58=0,\".\",SUM($G67:I67))","v":71333586.701642558},{"$f":"IF('WK1 - Identification'!J$58=0,\".\",SUM($G67:J67))","v":96310126.678597987},{"$f":"IF('WK1 - Identification'!K$58=0,\".\",SUM($G67:K67))","v":"."},{"$f":"IF('WK1 - Identification'!L$58=0,\".\",SUM($G67:L67))","v":"."},{"$f":"IF('WK1 - Identification'!M$58=0,\".\",SUM($G67:M67))","v":"."},{"$f":"INDEX(F93:M93,'WK1 - Identification'!$R$31+1)-F93","v":96310126.678597987}]
[]
[null,null,"Increase in cumulative PGI with proposed SV that exceeds the increase in the PGI under"]
[null,null,{"$f":"C78","v":"PGI if only the rate peg applied"},null,{"$f":"$E$41","v":"$ nominal"},null,{"$f":"IF('WK1 - Identification'!G$58=0,\".\",G91-G92)","v":453012.99531478807},{"$f":"IF('WK1 - Identification'!H$58=0,\".\",H91-H92)","v":1390275.5816070288},{"$f":"IF('WK1 - Identification'!I$58=0,\".\",I91-I92)","v":2845175.5906254053},{"$f":"IF('WK1 - Identification'!J$58=0,\".\",J91-J92)","v":4852893.2215511799},{"$f":"IF('WK1 - Identification'!K$58=0,\".\",K91-K92)","v":"."},{"$f":"IF('WK1 - Identification'!L$58=0,\".\",L91-L92)","v":"."},{"$f":"IF('WK1 - Identification'!M$58=0,\".\",M91-M92)","v":"."},{"$f":"INDEX(F96:M96,'WK1 - Identification'!$R$31+1)-F96","v":4852893.2215511799},{"$f":"IF(N92=0,0,N96/N92)","v":5.0388192694897457E-2},null,{"$f":"N91-N92-N96","v":0}]
[null,null,{"$f":"C79","v":"PGI if expiring SV renewed and rate peg applied"},null,{"$f":"E96","v":"$ nominal"},null,{"$f":"IF('WK1 - Identification'!G$58=0,\".\",G91-G93)","v":453012.99531478807},{"$f":"IF('WK1 - Identification'!H$58=0,\".\",H91-H93)","v":1390275.5816070288},{"$f":"IF('WK1 - Identification'!I$58=0,\".\",I91-I93)","v":2845175.5906254053},{"$f":"IF('WK1 - Identification'!J$58=0,\".\",J91-J93)","v":4852893.2215511799},{"$f":"IF('WK1 - Identification'!K$58=0,\".\",K91-K93)","v":"."},{"$f":"IF('WK1 - Identification'!L$58=0,\".\",L91-L93)","v":"."},{"$f":"IF('WK1 - Identification'!M$58=0,\".\",M91-M93)","v":"."},{"$f":"INDEX(F97:M97,'WK1 - Identification'!$R$31+1)-F97","v":4852893.2215511799},{"$f":"IF(N93=0,0,N97/N93)","v":5.0388192694897457E-2},null,{"$f":"N91-N93-N97","v":0}]

{"sheet":"WK5a - Impact on Rates","index":9,"n_rows":412,"n_cols":49,"rows_kept":412,"cut":false,"hidden":false,"merged":[]}
[]
[]
[null,null,{"$f":"'WK2 - Notional General Income'!$C$3","v":"Burwood Council"}]
[]
[null,null,null,null,null,"WORKSHEET 5a"]
[]
[null,null,null,null,null,"IMPACT ON MINIMUM RATES, AVERAGE RATES AND OTHER CHARGES"]
[null,null,null,null,null,"  All dollars in nominal terms"]
[]
[null,null,null,"    The aim of this sheet is to show the minimum rate increase (if applicable), the average rate increase per sub-category"]
[null,null,null,"    (inclusive of all relevant rates) and the proposed annual charges in each year of the proposed special variation."]
[null,null,null,"    It also aims to compare average rates with and without the proposed special variation."]
[null,null,null,"    All ordinary rates and special rates need to be included."]
[null,null,null,"Note: rate estimates should reflect expected minimum or average rates, inclusive of any expiring variations."]
[]
[null,null,null,null,null,"    Minimum Rates - with proposed special variation"]
[null,null,null,"   If the council levies minimum rates for any category or sub-category, these rates should be detailed below. "]
[null,null,null,"   A separate minimum rates application is not necessary if the council is applying for a special variation "]
[null,null,null,"   that will have the effect of causing a minimum rate to exceed the statutory limit.",null,null,null,null,null,null,null,null,null,null,null,null,null,null,"Annual and cumulative increases"]
[]
[null,null,"Minimum Rates - with proposed special variation",null,null,null,null,"$ per year",null,null,null,null,null,null,"Number of assessments",null,null,null,"Annual increases (nominal $ per year)",null,null,null,null,null,null,null,"Annual increases (%)",null,null,null,null,null,null,null,"Cumulative increases (nominal $ per year)",null,null,null,null,null,null,null,"Cumulative increases (%)"]
[null,null,"Category","Sub-category or Special Rate name","Current Minimum Rate","Minimum\nRate\nYear 1","Minimum\nRate\nYear 2","Minimum\nRate\nYear 3","Minimum\nRate\nYear 4","Minimum\nRate\nYear 5","Minimum\nRate\nYear 6","Minimum\nRate\nYear 7",null,null,"(used to calculate average",null,null,null,{"$f":"C21","v":"Minimum Rates - with proposed special variation"},null,null,null,null,null,null,null,{"$f":"$S22","v":"Minimum Rates - with proposed special variation"},null,null,null,null,null,null,null,{"$f":"$S22","v":"Minimum Rates - with proposed special variation"},null,null,null,null,null,null,null,{"$f":"$S22","v":"Minimum Rates - with proposed special variation"}]
[null,null,null,null,{"$f":"'WK1 - Identification'!F$57","v":"2018-19"},{"$f":"'WK1 - Identification'!G$57","v":"2019-20"},{"$f":"'WK1 - Identification'!H$57","v":"2020-21"},{"$f":"'WK1 - Identification'!I$57","v":"2021-22"},{"$f":"'WK1 - Identification'!J$57","v":"2022-23"},{"$f":"'WK1 - Identification'!K$57","v":"2023-24"},{"$f":"'WK1 - Identification'!L$57","v":"2024-25"},{"$f":"'WK1 - Identification'!M$57","v":"2025-26"},null,null,"rates)",null,null,null,{"$f":"'WK0 - Input data'!G55","v":"Year 1"},{"$f":"'WK0 - Input data'!H55","v":"Year 2"},{"$f":"'WK0 - Input data'!I55","v":"Year 3"},{"$f":"'WK0 - Input data'!J55","v":"Year 4"},{"$f":"'WK0 - Input data'!K55","v":"Year 5"},{"$f":"'WK0 - Input data'!L55","v":"Year 6"},{"$f":"'WK0 - Input data'!M55","v":"Year 7"},null,{"$f":"AI23","v":"Year 1"},"Year 2","Year 3","Year 4","Year 5","Year 6","Year 7",null,{"$f":"S23","v":"Year 1"},{"$f":"T23","v":"Year 2"},"Year 3","Year 4","Year 5",{"$f":"X23","v":"Year 6"},{"$f":"Y23","v":"Year 7"},null,{"$f":"AA23","v":"Year 1"},"Year 2","Year 3","Year 4","Year 5","Year 6","Year 7"]
[null,null,"Residential","Residential",930,973.71,1017.53,1063.32,1111.17,1138.95,1167.42,1196.6099999999999,null,null,null,null,null,null,{"$f":"IF(F24=0,\".\",F24-E24)","v":43.710000000000036},{"$f":"IF(G24=\"\",\".\",G24-F24)","v":43.819999999999936},{"$f":"IF(H24=\"\",\".\",H24-G24)","v":45.789999999999964},{"$f":"IF(I24=\"\",\".\",I24-H24)","v":47.850000000000136},{"$f":"IF(J24=\"\",\".\",J24-I24)","v":27.779999999999973},{"$f":"IF(K24=\"\",\".\",K24-J24)","v":28.470000000000027},{"$f":"IF(L24=\"\",\".\",L24-K24)","v":29.189999999999827},null,{"$f":"IF(ISNUMBER(E24),F24/E24-1,\".\")","v":4.6999999999999931E-2},{"$f":"IF(ISNUMBER(F24),G24/F24-1,\".\")","v":4.5003132349467512E-2},{"$f":"IF(ISNUMBER(G24),H24/G24-1,\".\")","v":4.5001130187807714E-2},{"$f":"IF(ISNUMBER(H24),I24/H24-1,\".\")","v":4.5000564270398558E-2},{"$f":"IF(ISNUMBER(I24),J24/I24-1,\".\")","v":2.5000674964226866E-2},{"$f":"IF(ISNUMBER(J24),K24/J24-1,\".\")","v":2.4996707493744275E-2},{"$f":"IF(ISNUMBER(K24),L24/K24-1,\".\")","v":2.500385465385202E-2},null,{"$f":"IF(S24=\".\",\".\",SUM($S24:S24))","v":43.710000000000036},{"$f":"IF(T24=\".\",\".\",SUM($S24:T24))","v":87.529999999999973},{"$f":"IF(U24=\".\",\".\",SUM($S24:U24))","v":133.31999999999994},{"$f":"IF(V24=\".\",\".\",SUM($S24:V24))","v":181.17000000000007},{"$f":"IF(W24=\".\",\".\",SUM($S24:W24))","v":208.95000000000005},{"$f":"IF(X24=\".\",\".\",SUM($S24:X24))","v":237.42000000000007},{"$f":"IF(Y24=\".\",\".\",SUM($S24:Y24))","v":266.6099999999999},null,{"$f":"IF(ISNUMBER($E24),F24/$E24-1,\".\")","v":4.6999999999999931E-2},{"$f":"IF(ISNUMBER($E24),G24/$E24-1,\".\")","v":9.4118279569892493E-2},{"$f":"IF(ISNUMBER($E24),H24/$E24-1,\".\")","v":0.14335483870967725},{"$f":"IF(ISNUMBER($E24),I24/$E24-1,\".\")","v":0.19480645161290333},{"$f":"IF(ISNUMBER($E24),J24/$E24-1,\".\")","v":0.22467741935483865},{"$f":"IF(ISNUMBER($E24),K24/$E24-1,\".\")","v":0.25529032258064532},{"$f":"IF(ISNUMBER($E24),L24/$E24-1,\".\")","v":0.2866774193548387}]
[null,null,"Residential","Town Centre",1186,1241.74,1297.6199999999999,1356.01,1417.03,1452.46,1488.77,1525.99,null,null,null,null,null,null,{"$f":"IF(F25=\"\",\".\",F25-E25)","v":55.740000000000009},55.879999999999882,58.3900000000001,61.019999999999982,35.430000000000064,36.309999999999945,37.220000000000027,null,4.6998313659359248E-2,4.5001369046660189E-2,4.4997765139255019E-2,4.4999668144040328E-2,2.5002999230785639E-2,2.499896726932227E-2,2.5000503771569926E-2,null,{"$f":"IF(S25=\".\",\".\",SUM($S25:S25))","v":55.740000000000009},{"$f":"IF(T25=\".\",\".\",SUM($S25:T25))","v":111.61999999999989},{"$f":"IF(U25=\".\",\".\",SUM($S25:U25))","v":170.01},{"$f":"IF(V25=\".\",\".\",SUM($S25:V25))","v":231.02999999999997},{"$f":"IF(W25=\".\",\".\",SUM($S25:W25))","v":266.46000000000004},{"$f":"IF(X25=\".\",\".\",SUM($S25:X25))","v":302.77},{"$f":"IF(Y25=\".\",\".\",SUM($S25:Y25))","v":339.99},null,4.6998313659359248E-2,9.411467116357497E-2,0.14334738617200671,0.19479763912310277,0.22467116357504224,0.25528667790893755,0.28666947723440139]
[null,null,"Business","Business A",1017,1064.8,1112.72,1162.79,1215.1199999999999,1245.5,1276.6400000000001,1308.55,null,null,null,null,null,null,{"$f":"IF(F26=\"\",\".\",F26-E26)","v":47.799999999999955},47.920000000000073,50.069999999999936,52.329999999999927,30.380000000000109,31.1400000000001,31.909999999999854,null,4.7000983284169129E-2,4.5003756574004683E-2,4.4997843123157688E-2,4.5003827002296104E-2,2.500164592797427E-2,2.5002007226013756E-2,2.4995300162927503E-2,null,{"$f":"IF(S26=\".\",\".\",SUM($S26:S26))","v":47.799999999999955},{"$f":"IF(T26=\".\",\".\",SUM($S26:T26))","v":95.720000000000027},{"$f":"IF(U26=\".\",\".\",SUM($S26:U26))","v":145.78999999999996},{"$f":"IF(V26=\".\",\".\",SUM($S26:V26))","v":198.11999999999989},{"$f":"IF(W26=\".\",\".\",SUM($S26:W26))","v":228.5},{"$f":"IF(X26=\".\",\".\",SUM($S26:X26))","v":259.6400000000001},{"$f":"IF(Y26=\".\",\".\",SUM($S26:Y26))","v":291.54999999999995},null,4.7000983284169129E-2,9.4119960668633151E-2,0.14335299901671572,0.19480825958702064,0.22468043264503446,0.25529990167158312,0.28667649950835794]
[null,null,"Business","Business B",1017,1064.8,1112.72,1162.79,1215.1199999999999,1245.5,1276.6400000000001,1308.55,null,null,null,null,null,null,47.799999999999955,47.920000000000073,50.069999999999936,52.329999999999927,30.380000000000109,31.1400000000001,31.909999999999854,null,4.7000983284169129E-2,4.5003756574004683E-2,4.4997843123157688E-2,4.5003827002296104E-2,2.500164592797427E-2,2.5002007226013756E-2,2.4995300162927503E-2,null,{"$f":"IF(S27=\".\",\".\",SUM($S27:S27))","v":47.799999999999955},{"$f":"IF(T27=\".\",\".\",SUM($S27:T27))","v":95.720000000000027},{"$f":"IF(U27=\".\",\".\",SUM($S27:U27))","v":145.78999999999996},{"$f":"IF(V27=\".\",\".\",SUM($S27:V27))","v":198.11999999999989},{"$f":"IF(W27=\".\",\".\",SUM($S27:W27))","v":228.5},{"$f":"IF(X27=\".\",\".\",SUM($S27:X27))","v":259.6400000000001},{"$f":"IF(Y27=\".\",\".\",SUM($S27:Y27))","v":291.54999999999995},null,4.7000983284169129E-2,9.4119960668633151E-2,0.14335299901671572,0.19480825958702064,0.22468043264503446,0.25529990167158312,0.28667649950835794]
[null,null,"Business","Business C",1017,1064.8,1112.72,1162.79,1215.1199999999999,1245.5,1276.6400000000001,1308.55,null,null,null,null,null,null,47.799999999999955,47.920000000000073,50.069999999999936,52.329999999999927,30.380000000000109,31.1400000000001,31.909999999999854,null,4.7000983284169129E-2,4.5003756574004683E-2,4.4997843123157688E-2,4.5003827002296104E-2,2.500164592797427E-2,2.5002007226013756E-2,2.4995300162927503E-2,null,{"$f":"IF(S28=\".\",\".\",SUM($S28:S28))","v":47.799999999999955},{"$f":"IF(T28=\".\",\".\",SUM($S28:T28))","v":95.720000000000027},{"$f":"IF(U28=\".\",\".\",SUM($S28:U28))","v":145.78999999999996},{"$f":"IF(V28=\".\",\".\",SUM($S28:V28))","v":198.11999999999989},{"$f":"IF(W28=\".\",\".\",SUM($S28:W28))","v":228.5},{"$f":"IF(X28=\".\",\".\",SUM($S28:X28))","v":259.6400000000001},{"$f":"IF(Y28=\".\",\".\",SUM($S28:Y28))","v":291.54999999999995},null,4.7000983284169129E-2,9.4119960668633151E-2,0.14335299901671572,0.19480825958702064,0.22468043264503446,0.25529990167158312,0.28667649950835794]
[null,null,"Business","Business D",1301,1362.15,1423.45,1487.51,1554.45,1593.31,1633.14,1673.97,null,null,null,null,null,null,61.150000000000091,61.299999999999955,64.059999999999945,66.940000000000055,38.8599999999999,39.830000000000155,40.829999999999927,null,4.7002305918524279E-2,4.500238593400141E-2,4.5003336963012286E-2,4.5001378141995785E-2,2.4999195857055456E-2,2.4998274033301904E-2,2.5000918476064449E-2,null,{"$f":"IF(S29=\".\",\".\",SUM($S29:S29))","v":61.150000000000091},{"$f":"IF(T29=\".\",\".\",SUM($S29:T29))","v":122.45000000000005},{"$f":"IF(U29=\".\",\".\",SUM($S29:U29))","v":186.51},{"$f":"IF(V29=\".\",\".\",SUM($S29:V29))","v":253.45000000000005},{"$f":"IF(W29=\".\",\".\",SUM($S29:W29))","v":292.30999999999995},{"$f":"IF(X29=\".\",\".\",SUM($S29:X29))","v":332.1400000000001},{"$f":"IF(Y29=\".\",\".\",SUM($S29:Y29))","v":372.97},null,4.7002305918524279E-2,9.411990776325907E-2,0.14335895465026893,0.19481168332052268,0.22468101460415069,0.25529592621060737,0.28667947732513444]
[null,null,"Business","Town Centre Minor",1301,1362.15,1423.45,1487.51,1554.45,1593.31,1633.14,1673.97,null,null,null,null,null,null,61.150000000000091,61.299999999999955,64.059999999999945,66.940000000000055,38.8599999999999,39.830000000000155,40.829999999999927,null,4.7002305918524279E-2,4.500238593400141E-2,4.5003336963012286E-2,4.5001378141995785E-2,2.4999195857055456E-2,2.4998274033301904E-2,2.5000918476064449E-2,null,{"$f":"IF(S30=\".\",\".\",SUM($S30:S30))","v":61.150000000000091},{"$f":"IF(T30=\".\",\".\",SUM($S30:T30))","v":122.45000000000005},{"$f":"IF(U30=\".\",\".\",SUM($S30:U30))","v":186.51},{"$f":"IF(V30=\".\",\".\",SUM($S30:V30))","v":253.45000000000005},{"$f":"IF(W30=\".\",\".\",SUM($S30:W30))","v":292.30999999999995},{"$f":"IF(X30=\".\",\".\",SUM($S30:X30))","v":332.1400000000001},{"$f":"IF(Y30=\".\",\".\",SUM($S30:Y30))","v":372.97},null,4.7002305918524279E-2,9.411990776325907E-2,0.14335895465026893,0.19481168332052268,0.22468101460415069,0.25529592621060737,0.28667947732513444]
[null,null,null,null,null,null,null,null,null,null,null,null,null,null,null,null,null,null,".",".",".",".",".",".",".",null,".",".",".",".",".",".",".",null,{"$f":"IF(S31=\".\",\".\",SUM($S31:S31))","v":"."},{"$f":"IF(T31=\".\",\".\",SUM($S31:T31))","v":"."},{"$f":"IF(U31=\".\",\".\",SUM($S31:U31))","v":"."},{"$f":"IF(V31=\".\",\".\",SUM($S31:V31))","v":"."},{"$f":"IF(W31=\".\",\".\",SUM($S31:W31))","v":"."},{"$f":"IF(X31=\".\",\".\",SUM($S31:X31))","v":"."},{"$f":"IF(Y31=\".\",\".\",SUM($S31:Y31))","v":"."},null,".",".",".",".",".",".","."]
[null,null,null,null,null,null,null,null,null,null,null,null,null,null,null,null,null,null,".",".",".",".",".",".",".",null,".",".",".",".",".",".",".",null,{"$f":"IF(S32=\".\",\".\",SUM($S32:S32))","v":"."},{"$f":"IF(T32=\".\",\".\",SUM($S32:T32))","v":"."},{"$f":"IF(U32=\".\",\".\",SUM($S32:U32))","v":"."},{"$f":"IF(V32=\".\",\".\",SUM($S32:V32))","v":"."},{"$f":"IF(W32=\".\",\".\",SUM($S32:W32))","v":"."},{"$f":"IF(X32=\".\",\".\",SUM($S32:X32))","v":"."},{"$f":"IF(Y32=\".\",\".\",SUM($S32:Y32))","v":"."},null,".",".",".",".",".",".","."]
[null,null,null,null,null,null,null,null,null,null,null,null,null,null,null,null,null,null,".",".",".",".",".",".",".",null,".",".",".",".",".",".",".",null,{"$f":"IF(S33=\".\",\".\",SUM($S33:S33))","v":"."},{"$f":"IF(T33=\".\",\".\",SUM($S33:T33))","v":"."},{"$f":"IF(U33=\".\",\".\",SUM($S33:U33))","v":"."},{"$f":"IF(V33=\".\",\".\",SUM($S33:V33))","v":"."},{"$f":"IF(W33=\".\",\".\",SUM($S33:W33))","v":"."},{"$f":"IF(X33=\".\",\".\",SUM($S33:X33))","v":"."},{"$f":"IF(Y33=\".\",\".\",SUM($S33:Y33))","v":"."},null,".",".",".",".",".",".","."]
[null,null,null,null,null,null,null,null,null,null,null,null,null,null,null,null,null,null,".",".",".",".",".",".",".",null,".",".",".",".",".",".",".",null,{"$f":"IF(S34=\".\",\".\",SUM($S34:S34))","v":"."},{"$f":"IF(T34=\".\",\".\",SUM($S34:T34))","v":"."},{"$f":"IF(U34=\".\",\".\",SUM($S34:U34))","v":"."},{"$f":"IF(V34=\".\",\".\",SUM($S34:V34))","v":"."},{"$f":"IF(W34=\".\",\".\",SUM($S34:W34))","v":"."},{"$f":"IF(X34=\".\",\".\",SUM($S34:X34))","v":"."},{"$f":"IF(Y34=\".\",\".\",SUM($S34:Y34))","v":"."},null,".",".",".",".",".",".","."]
[null,null,null,null,null,null,null,null,null,null,null,null,null,null,null,null,null,null,".",".",".",".",".",".",".",null,".",".",".",".",".",".",".",null,{"$f":"IF(S35=\".\",\".\",SUM($S35:S35))","v":"."},{"$f":"IF(T35=\".\",\".\",SUM($S35:T35))","v":"."},{"$f":"IF(U35=\".\",\".\",SUM($S35:U35))","v":"."},{"$f":"IF(V35=\".\",\".\",SUM($S35:V35))","v":"."},{"$f":"IF(W35=\".\",\".\",SUM($S35:W35))","v":"."},{"$f":"IF(X35=\".\",\".\",SUM($S35:X35))","v":"."},{"$f":"IF(Y35=\".\",\".\",SUM($S35:Y35))","v":"."},null,".",".",".",".",".",".","."]
[null,null,null,null,null,null,null,null,null,null,null,null,null,null,null,null,null,null,".",".",".",".",".",".",".",null,".",".",".",".",".",".",".",null,{"$f":"IF(S36=\".\",\".\",SUM($S36:S36))","v":"."},{"$f":"IF(T36=\".\",\".\",SUM($S36:T36))","v":"."},{"$f":"IF(U36=\".\",\".\",SUM($S36:U36))","v":"."},{"$f":"IF(V36=\".\",\".\",SUM($S36:V36))","v":"."},{"$f":"IF(W36=\".\",\".\",SUM($S36:W36))","v":"."},{"$f":"IF(X36=\".\",\".\",SUM($S36:X36))","v":"."},{"$f":"IF(Y36=\".\",\".\",SUM($S36:Y36))","v":"."},null,".",".",".",".",".",".","."]
[null,null,null,null,null,null,null,null,null,null,null,null,null,null,null,null,null,null,".",".",".",".",".",".",".",null,".",".",".",".",".",".",".",null,{"$f":"IF(S37=\".\",\".\",SUM($S37:S37))","v":"."},{"$f":"IF(T37=\".\",\".\",SUM($S37:T37))","v":"."},{"$f":"IF(U37=\".\",\".\",SUM($S37:U37))","v":"."},{"$f":"IF(V37=\".\",\".\",SUM($S37:V37))","v":"."},{"$f":"IF(W37=\".\",\".\",SUM($S37:W37))","v":"."},{"$f":"IF(X37=\".\",\".\",SUM($S37:X37))","v":"."},{"$f":"IF(Y37=\".\",\".\",SUM($S37:Y37))","v":"."},null,".",".",".",".",".",".","."]
[null,null,null,null,null,null,null,null,null,null,null,null,null,null,null,null,null,null,".",".",".",".",".",".",".",null,".",".",".",".",".",".",".",null,{"$f":"IF(S38=\".\",\".\",SUM($S38:S38))","v":"."},{"$f":"IF(T38=\".\",\".\",SUM($S38:T38))","v":"."},{"$f":"IF(U38=\".\",\".\",SUM($S38:U38))","v":"."},{"$f":"IF(V38=\".\",\".\",SUM($S38:V38))","v":"."},{"$f":"IF(W38=\".\",\".\",SUM($S38:W38))","v":"."},{"$f":"IF(X38=\".\",\".\",SUM($S38:X38))","v":"."},{"$f":"IF(Y38=\".\",\".\",SUM($S38:Y38))","v":"."},null,".",".",".",".",".",".","."]
[null,null,null,null,null,null,null,null,null,null,null,null,null,null,null,null,null,null,".",".",".",".",".",".",".",null,".",".",".",".",".",".",".",null,{"$f":"IF(S39=\".\",\".\",SUM($S39:S39))","v":"."},{"$f":"IF(T39=\".\",\".\",SUM($S39:T39))","v":"."},{"$f":"IF(U39=\".\",\".\",SUM($S39:U39))","v":"."},{"$f":"IF(V39=\".\",\".\",SUM($S39:V39))","v":"."},{"$f":"IF(W39=\".\",\".\",SUM($S39:W39))","v":"."},{"$f":"IF(X39=\".\",\".\",SUM($S39:X39))","v":"."},{"$f":"IF(Y39=\".\",\".\",SUM($S39:Y39))","v":"."},null,".",".",".",".",".",".","."]
[null,null,null,null,null,null,null,null,null,null,null,null,null,null,null,null,null,null,".",".",".",".",".",".",".",null,".",".",".",".",".",".",".",null,{"$f":"IF(S40=\".\",\".\",SUM($S40:S40))","v":"."},{"$f":"IF(T40=\".\",\".\",SUM($S40:T40))","v":"."},{"$f":"IF(U40=\".\",\".\",SUM($S40:U40))","v":"."},{"$f":"IF(V40=\".\",\".\",SUM($S40:V40))","v":"."},{"$f":"IF(W40=\".\",\".\",SUM($S40:W40))","v":"."},{"$f":"IF(X40=\".\",\".\",SUM($S40:X40))","v":"."},{"$f":"IF(Y40=\".\",\".\",SUM($S40:Y40))","v":"."},null,".",".",".",".",".",".","."]
[null,null,null,null,null,null,null,null,null,null,null,null,null,null,null,null,null,null,".",".",".",".",".",".",".",null,".",".",".",".",".",".",".",null,{"$f":"IF(S41=\".\",\".\",SUM($S41:S41))","v":"."},{"$f":"IF(T41=\".\",\".\",SUM($S41:T41))","v":"."},{"$f":"IF(U41=\".\",\".\",SUM($S41:U41))","v":"."},{"$f":"IF(V41=\".\",\".\",SUM($S41:V41))","v":"."},{"$f":"IF(W41=\".\",\".\",SUM($S41:W41))","v":"."},{"$f":"IF(X41=\".\",\".\",SUM($S41:X41))","v":"."},{"$f":"IF(Y41=\".\",\".\",SUM($S41:Y41))","v":"."},null,".",".",".",".",".",".","."]
[null,null,null,null,null,null,null,null,null,null,null,null,null,null,null,null,null,null,".",".",".",".",".",".",".",null,".",".",".",".",".",".",".",null,{"$f":"IF(S42=\".\",\".\",SUM($S42:S42))","v":"."},{"$f":"IF(T42=\".\",\".\",SUM($S42:T42))","v":"."},{"$f":"IF(U42=\".\",\".\",SUM($S42:U42))","v":"."},{"$f":"IF(V42=\".\",\".\",SUM($S42:V42))","v":"."},{"$f":"IF(W42=\".\",\".\",SUM($S42:W42))","v":"."},{"$f":"IF(X42=\".\",\".\",SUM($S42:X42))","v":"."},{"$f":"IF(Y42=\".\",\".\",SUM($S42:Y42))","v":"."},null,".",".",".",".",".",".","."]
[null,null,null,null,null,null,null,null,null,null,null,null,null,null,null,null,null,null,".",".",".",".",".",".",".",null,".",".",".",".",".",".",".",null,{"$f":"IF(S43=\".\",\".\",SUM($S43:S43))","v":"."},{"$f":"IF(T43=\".\",\".\",SUM($S43:T43))","v":"."},{"$f":"IF(U43=\".\",\".\",SUM($S43:U43))","v":"."},{"$f":"IF(V43=\".\",\".\",SUM($S43:V43))","v":"."},{"$f":"IF(W43=\".\",\".\",SUM($S43:W43))","v":"."},{"$f":"IF(X43=\".\",\".\",SUM($S43:X43))","v":"."},{"$f":"IF(Y43=\".\",\".\",SUM($S43:Y43))","v":"."},null,".",".",".",".",".",".","."]
[null,null,null,null,null,null,null,null,null,null,null,null,null,null,null,null,null,null,".",".",".",".",".",".",".",null,".",".",".",".",".",".",".",null,{"$f":"IF(S44=\".\",\".\",SUM($S44:S44))","v":"."},{"$f":"IF(T44=\".\",\".\",SUM($S44:T44))","v":"."},{"$f":"IF(U44=\".\",\".\",SUM($S44:U44))","v":"."},{"$f":"IF(V44=\".\",\".\",SUM($S44:V44))","v":"."},{"$f":"IF(W44=\".\",\".\",SUM($S44:W44))","v":"."},{"$f":"IF(X44=\".\",\".\",SUM($S44:X44))","v":"."},{"$f":"IF(Y44=\".\",\".\",SUM($S44:Y44))","v":"."},null,".",".",".",".",".",".","."]
[null,null,null,null,null,null,null,null,null,null,null,null,null,null,null,null,null,null,".",".",".",".",".",".",".",null,".",".",".",".",".",".",".",null,{"$f":"IF(S45=\".\",\".\",SUM($S45:S45))","v":"."},{"$f":"IF(T45=\".\",\".\",SUM($S45:T45))","v":"."},{"$f":"IF(U45=\".\",\".\",SUM($S45:U45))","v":"."},{"$f":"IF(V45=\".\",\".\",SUM($S45:V45))","v":"."},{"$f":"IF(W45=\".\",\".\",SUM($S45:W45))","v":"."},{"$f":"IF(X45=\".\",\".\",SUM($S45:X45))","v":"."},{"$f":"IF(Y45=\".\",\".\",SUM($S45:Y45))","v":"."},null,".",".",".",".",".",".","."]
[null,null,null,null,null,null,null,null,null,null,null,null,null,null,null,null,null,null,".",".",".",".",".",".",".",null,".",".",".",".",".",".",".",null,{"$f":"IF(S46=\".\",\".\",SUM($S46:S46))","v":"."},{"$f":"IF(T46=\".\",\".\",SUM($S46:T46))","v":"."},{"$f":"IF(U46=\".\",\".\",SUM($S46:U46))","v":"."},{"$f":"IF(V46=\".\",\".\",SUM($S46:V46))","v":"."},{"$f":"IF(W46=\".\",\".\",SUM($S46:W46))","v":"."},{"$f":"IF(X46=\".\",\".\",SUM($S46:X46))","v":"."},{"$f":"IF(Y46=\".\",\".\",SUM($S46:Y46))","v":"."},null,".",".",".",".",".",".","."]
[null,null,null,null,null,null,null,null,null,null,null,null,null,null,null,null,null,null,".",".",".",".",".",".",".",null,".",".",".",".",".",".",".",null,{"$f":"IF(S47=\".\",\".\",SUM($S47:S47))","v":"."},{"$f":"IF(T47=\".\",\".\",SUM($S47:T47))","v":"."},{"$f":"IF(U47=\".\",\".\",SUM($S47:U47))","v":"."},{"$f":"IF(V47=\".\",\".\",SUM($S47:V47))","v":"."},{"$f":"IF(W47=\".\",\".\",SUM($S47:W47))","v":"."},{"$f":"IF(X47=\".\",\".\",SUM($S47:X47))","v":"."},{"$f":"IF(Y47=\".\",\".\",SUM($S47:Y47))","v":"."},null,".",".",".",".",".",".","."]
[null,null,null,null,null,null,null,null,null,null,null,null,null,null,null,null,null,null,".",".",".",".",".",".",".",null,".",".",".",".",".",".",".",null,{"$f":"IF(S48=\".\",\".\",SUM($S48:S48))","v":"."},{"$f":"IF(T48=\".\",\".\",SUM($S48:T48))","v":"."},{"$f":"IF(U48=\".\",\".\",SUM($S48:U48))","v":"."},{"$f":"IF(V48=\".\",\".\",SUM($S48:V48))","v":"."},{"$f":"IF(W48=\".\",\".\",SUM($S48:W48))","v":"."},{"$f":"IF(X48=\".\",\".\",SUM($S48:X48))","v":"."},{"$f":"IF(Y48=\".\",\".\",SUM($S48:Y48))","v":"."},null,".",".",".",".",".",".","."]
[null,null,null,null,null,null,null,null,null,null,null,null,null,null,null,null,null,null,".",".",".",".",".",".",".",null,".",".",".",".",".",".",".",null,{"$f":"IF(S49=\".\",\".\",SUM($S49:S49))","v":"."},{"$f":"IF(T49=\".\",\".\",SUM($S49:T49))","v":"."},{"$f":"IF(U49=\".\",\".\",SUM($S49:U49))","v":"."},{"$f":"IF(V49=\".\",\".\",SUM($S49:V49))","v":"."},{"$f":"IF(W49=\".\",\".\",SUM($S49:W49))","v":"."},{"$f":"IF(X49=\".\",\".\",SUM($S49:X49))","v":"."},{"$f":"IF(Y49=\".\",\".\",SUM($S49:Y49))","v":"."},null,".",".",".",".",".",".","."]
[null,null,null,null,null,null,null,null,null,null,null,null,null,null,null,null,null,null,".",".",".",".",".",".",".",null,".",".",".",".",".",".",".",null,{"$f":"IF(S50=\".\",\".\",SUM($S50:S50))","v":"."},{"$f":"IF(T50=\".\",\".\",SUM($S50:T50))","v":"."},{"$f":"IF(U50=\".\",\".\",SUM($S50:U50))","v":"."},{"$f":"IF(V50=\".\",\".\",SUM($S50:V50))","v":"."},{"$f":"IF(W50=\".\",\".\",SUM($S50:W50))","v":"."},{"$f":"IF(X50=\".\",\".\",SUM($S50:X50))","v":"."},{"$f":"IF(Y50=\".\",\".\",SUM($S50:Y50))","v":"."},null,".",".",".",".",".",".","."]
[null,null,null,null,null,null,null,null,null,null,null,null,null,null,null,null,null,null,".",".",".",".",".",".",".",null,".",".",".",".",".",".",".",null,{"$f":"IF(S51=\".\",\".\",SUM($S51:S51))","v":"."},{"$f":"IF(T51=\".\",\".\",SUM($S51:T51))","v":"."},{"$f":"IF(U51=\".\",\".\",SUM($S51:U51))","v":"."},{"$f":"IF(V51=\".\",\".\",SUM($S51:V51))","v":"."},{"$f":"IF(W51=\".\",\".\",SUM($S51:W51))","v":"."},{"$f":"IF(X51=\".\",\".\",SUM($S51:X51))","v":"."},{"$f":"IF(Y51=\".\",\".\",SUM($S51:Y51))","v":"."},null,".",".",".",".",".",".","."]
[null,null,null,null,null,null,null,null,null,null,null,null,null,null,null,null,null,null,".",".",".",".",".",".",".",null,".",".",".",".",".",".",".",null,{"$f":"IF(S52=\".\",\".\",SUM($S52:S52))","v":"."},{"$f":"IF(T52=\".\",\".\",SUM($S52:T52))","v":"."},{"$f":"IF(U52=\".\",\".\",SUM($S52:U52))","v":"."},{"$f":"IF(V52=\".\",\".\",SUM($S52:V52))","v":"."},{"$f":"IF(W52=\".\",\".\",SUM($S52:W52))","v":"."},{"$f":"IF(X52=\".\",\".\",SUM($S52:X52))","v":"."},{"$f":"IF(Y52=\".\",\".\",SUM($S52:Y52))","v":"."},null,".",".",".",".",".",".","."]
[null,null,null,null,null,null,null,null,null,null,null,null,null,null,null,null,null,null,".",".",".",".",".",".",".",null,".",".",".",".",".",".",".",null,{"$f":"IF(S53=\".\",\".\",SUM($S53:S53))","v":"."},{"$f":"IF(T53=\".\",\".\",SUM($S53:T53))","v":"."},{"$f":"IF(U53=\".\",\".\",SUM($S53:U53))","v":"."},{"$f":"IF(V53=\".\",\".\",SUM($S53:V53))","v":"."},{"$f":"IF(W53=\".\",\".\",SUM($S53:W53))","v":"."},{"$f":"IF(X53=\".\",\".\",SUM($S53:X53))","v":"."},{"$f":"IF(Y53=\".\",\".\",SUM($S53:Y53))","v":"."},null,".",".",".",".",".",".","."]
[]
[]
[]
[null,null,"Average Ordinary and Special Rates - with proposed special variation",null,null,null,null,null,{"$f":"$H$21","v":"$ per year"},null,null,null,null,null,null,null,null,null,{"$f":"S$21","v":"Annual increases (nominal $ per year)"},null,null,null,null,null,null,null,{"$f":"AA$21","v":"Annual increases (%)"},null,null,null,null,null,null,null,{"$f":"AI$21","v":"Cumulative increases (nominal $ per year)"},null,null,null,null,null,null,null,{"$f":"AQ$21","v":"Cumulative increases (%)"}]
[null,null,"Category","Sub-category or Special Rate name","Current Average Rate","Average\nRate\nYear 1","Average\nRate\nYear 2","Average\nRate\nYear 3","Average\nRate\nYear 4","Average\nRate\nYear 5","Average\nRate\nYear 6","Average\nRate\nYear 7",null,null,{"$f":"'WK2 - Notional General Income'!$E18","v":"Number of Assessments"},null,null,null,"Average Rates - with proposed special variation",null,null,null,null,null,null,null,{"$f":"$S58","v":"Average Rates - with proposed special variation"},null,null,null,null,null,null,null,{"$f":"$S58","v":"Average Rates - with proposed special variation"},null,null,null,null,null,null,null,{"$f":"$S58","v":"Average Rates - with proposed special variation"}]
[null,null,null,null,{"$f":"E23","v":"2018-19"},{"$f":"F23","v":"2019-20"},"2020-21","2021-22","2022-23","2023-24","2024-25","2025-26",null,null,{"$f":"E59","v":"2018-19"},{"$f":"F59","v":"2019-20"},null,null,{"$f":"S$23","v":"Year 1"},{"$f":"T$23","v":"Year 2"},"Year 3","Year 4","Year 5","Year 6","Year 7",null,{"$f":"AA$23","v":"Year 1"},"Year 2","Year 3","Year 4","Year 5","Year 6","Year 7",null,{"$f":"AI$23","v":"Year 1"},{"$f":"AJ$23","v":"Year 2"},"Year 3","Year 4","Year 5","Year 6","Year 7",null,{"$f":"AQ$23","v":"Year 1"},{"$f":"AR$23","v":"Year 2"},"Year 3","Year 4","Year 5","Year 6","Year 7"]
[null,null,"Residential",{"$f":"IF('WK2 - Notional General Income'!D19=\"\",\"\",'WK2 - Notional General Income'!D19)","v":"Residential"},{"$f":"IF('WK2 - Notional General Income'!M19=\".\",\".\",'WK2 - Notional General Income'!M19/'WK2 - Notional General Income'!E19)","v":1345.7780447712341},{"$f":"IF('WK3 - Notional GI Yr1 YIELD'!M19=\".\",\".\",'WK3 - Notional GI Yr1 YIELD'!M19/'WK3 - Notional GI Yr1 YIELD'!E19)","v":1404.8389131783449},1468.06,1534.12,1603.16,1643.24,1684.32,1726.43,null,null,{"$f":"'WK2 - Notional General Income'!$E19","v":10015.92},{"$f":"'WK3 - Notional GI Yr1 YIELD'!$E19","v":10015.92},null,null,{"$f":"IF(F60=\".\",\".\",F60-E60)","v":59.060868407110775},{"$f":"IF(G60=\"\",\".\",G60-F60)","v":63.221086821655035},{"$f":"IF(H60=\"\",\".\",H60-G60)","v":66.059999999999945},{"$f":"IF(I60=\"\",\".\",I60-H60)","v":69.040000000000191},{"$f":"IF(J60=\"\",\".\",J60-I60)","v":40.079999999999927},{"$f":"IF(K60=\"\",\".\",K60-J60)","v":41.079999999999927},{"$f":"IF(L60=\"\",\".\",L60-K60)","v":42.110000000000127},null,{"$f":"IF(ISNUMBER(E60),F60/E60-1,\".\")","v":4.3886039482201822E-2},{"$f":"IF(ISNUMBER(F60),G60/F60-1,\".\")","v":4.5002374456315497E-2},{"$f":"IF(ISNUMBER(G60),H60/G60-1,\".\")","v":4.4998160838112922E-2},{"$f":"IF(ISNUMBER(H60),I60/H60-1,\".\")","v":4.5002998461658894E-2},{"$f":"IF(ISNUMBER(I60),J60/I60-1,\".\")","v":2.5000623768058006E-2},{"$f":"IF(ISNUMBER(J60),K60/J60-1,\".\")","v":2.4999391446167252E-2},{"$f":"IF(ISNUMBER(K60),L60/K60-1,\".\")","v":2.5001187422817539E-2},null,{"$f":"IF(S60=\".\",\".\",SUM($S60:S60))","v":59.060868407110775},{"$f":"IF(T60=\".\",\".\",SUM($S60:T60))","v":122.28195522876581},{"$f":"IF(U60=\".\",\".\",SUM($S60:U60))","v":188.34195522876576},{"$f":"IF(V60=\".\",\".\",SUM($S60:V60))","v":257.38195522876595},{"$f":"IF(W60=\".\",\".\",SUM($S60:W60))","v":297.46195522876587},{"$f":"IF(X60=\".\",\".\",SUM($S60:X60))","v":338.5419552287658},{"$f":"IF(Y60=\".\",\".\",SUM($S60:Y60))","v":380.65195522876593},null,{"$f":"IF(ISNUMBER($E60),F60/$E60-1,\".\")","v":4.3886039482201822E-2},{"$f":"IF(ISNUMBER($E60),G60/$E60-1,\".\")","v":9.0863389920699866E-2},{"$f":"IF(ISNUMBER($E60),H60/$E60-1,\".\")","v":0.1399502361927607},{"$f":"IF(ISNUMBER($E60),I60/$E60-1,\".\")","v":0.19125141491851116},{"$f":"IF(ISNUMBER($E60),J60/$E60-1,\".\")","v":0.22103344335605568},{"$f":"IF(ISNUMBER($E60),K60/$E60-1,\".\")","v":0.25155853637537517},{"$f":"IF(ISNUMBER($E60),L60/$E60-1,\".\")","v":0.28284898591392316}]
[null,null,"Residential",{"$f":"IF('WK2 - Notional General Income'!D20=\"\",\"\",'WK2 - Notional General Income'!D20)","v":"Town Centre"},{"$f":"IF('WK2 - Notional General Income'!M20=\".\",\".\",'WK2 - Notional General Income'!M20/'WK2 - Notional General Income'!E20)","v":1257.2544383537024},{"$f":"IF('WK3 - Notional GI Yr1 YIELD'!M20=\".\",\".\",'WK3 - Notional GI Yr1 YIELD'!M20/'WK3 - Notional GI Yr1 YIELD'!E20)","v":1313.7389448238678},1372.85,1434.63,1499.19,1536.67,1575.09,1614.46,null,null,{"$f":"'WK2 - Notional General Income'!$E20","v":2782},{"$f":"'WK3 - Notional GI Yr1 YIELD'!$E20","v":2782},null,null,{"$f":"IF(F61=\".\",\".\",F61-E61)","v":56.484506470165343},59.11105517613214,61.7800000000002,64.559999999999945,37.480000000000018,38.419999999999845,39.370000000000118,null,4.492686981016214E-2,4.4994521483152861E-2,4.5001274720472217E-2,4.5001150122331079E-2,2.5000166756715236E-2,2.5002114962874078E-2,2.4995397088420468E-2,null,{"$f":"IF(S61=\".\",\".\",SUM($S61:S61))","v":56.484506470165343},{"$f":"IF(T61=\".\",\".\",SUM($S61:T61))","v":115.59556164629748},{"$f":"IF(U61=\".\",\".\",SUM($S61:U61))","v":177.37556164629768},{"$f":"IF(V61=\".\",\".\",SUM($S61:V61))","v":241.93556164629763},{"$f":"IF(W61=\".\",\".\",SUM($S61:W61))","v":279.41556164629765},{"$f":"IF(X61=\".\",\".\",SUM($S61:X61))","v":317.83556164629749},{"$f":"IF(Y61=\".\",\".\",SUM($S61:Y61))","v":357.20556164629761},null,4.492686981016214E-2,9.1942854302159205E-2,0.1410816746676673,0.19243166241122789,0.22224265281749589,0.25280130413576729,0.28411557020553158]
[null,null,"Residential",{"$f":"IF('WK2 - Notional General Income'!D21=\"\",\"\",'WK2 - Notional General Income'!D21)","v":""},{"$f":"IF('WK2 - Notional General Income'!M21=\".\",\".\",'WK2 - Notional General Income'!M21/'WK2 - Notional General Income'!E21)","v":"."},{"$f":"IF('WK3 - Notional GI Yr1 YIELD'!M21=\".\",\".\",'WK3 - Notional GI Yr1 YIELD'!M21/'WK3 - Notional GI Yr1 YIELD'!E21)","v":"."},null,null,null,null,null,null,null,null,{"$f":"'WK2 - Notional General Income'!$E21","v":0},{"$f":"'WK3 - Notional GI Yr1 YIELD'!$E21","v":0},null,null,".",".",".",".",".",".",".",null,".",".",".",".",".",".",".",null,{"$f":"IF(S62=\".\",\".\",SUM($S62:S62))","v":"."},{"$f":"IF(T62=\".\",\".\",SUM($S62:T62))","v":"."},{"$f":"IF(U62=\".\",\".\",SUM($S62:U62))","v":"."},{"$f":"IF(V62=\".\",\".\",SUM($S62:V62))","v":"."},{"$f":"IF(W62=\".\",\".\",SUM($S62:W62))","v":"."},{"$f":"IF(X62=\".\",\".\",SUM($S62:X62))","v":"."},{"$f":"IF(Y62=\".\",\".\",SUM($S62:Y62))","v":"."},null,".",".",".",".",".",".","."]
[null,null,"Residential",{"$f":"IF('WK2 - Notional General Income'!D22=\"\",\"\",'WK2 - Notional General Income'!D22)","v":""},{"$f":"IF('WK2 - Notional General Income'!M22=\".\",\".\",'WK2 - Notional General Income'!M22/'WK2 - Notional General Income'!E22)","v":"."},{"$f":"IF('WK3 - Notional GI Yr1 YIELD'!M22=\".\",\".\",'WK3 - Notional GI Yr1 YIELD'!M22/'WK3 - Notional GI Yr1 YIELD'!E22)","v":"."},null,null,null,null,null,null,null,null,{"$f":"'WK2 - Notional General Income'!$E22","v":0},{"$f":"'WK3 - Notional GI Yr1 YIELD'!$E22","v":0},null,null,".",".",".",".",".",".",".",null,".",".",".",".",".",".",".",null,{"$f":"IF(S63=\".\",\".\",SUM($S63:S63))","v":"."},{"$f":"IF(T63=\".\",\".\",SUM($S63:T63))","v":"."},{"$f":"IF(U63=\".\",\".\",SUM($S63:U63))","v":"."},{"$f":"IF(V63=\".\",\".\",SUM($S63:V63))","v":"."},{"$f":"IF(W63=\".\",\".\",SUM($S63:W63))","v":"."},{"$f":"IF(X63=\".\",\".\",SUM($S63:X63))","v":"."},{"$f":"IF(Y63=\".\",\".\",SUM($S63:Y63))","v":"."},null,".",".",".",".",".",".","."]
[null,null,"Residential",{"$f":"IF('WK2 - Notional General Income'!D23=\"\",\"\",'WK2 - Notional General Income'!D23)","v":""},{"$f":"IF('WK2 - Notional General Income'!M23=\".\",\".\",'WK2 - Notional General Income'!M23/'WK2 - Notional General Income'!E23)","v":"."},{"$f":"IF('WK3 - Notional GI Yr1 YIELD'!M23=\".\",\".\",'WK3 - Notional GI Yr1 YIELD'!M23/'WK3 - Notional GI Yr1 YIELD'!E23)","v":"."},null,null,null,null,null,null,null,null,{"$f":"'WK2 - Notional General Income'!$E23","v":0},{"$f":"'WK3 - Notional GI Yr1 YIELD'!$E23","v":0},null,null,".",".",".",".",".",".",".",null,".",".",".",".",".",".",".",null,{"$f":"IF(S64=\".\",\".\",SUM($S64:S64))","v":"."},{"$f":"IF(T64=\".\",\".\",SUM($S64:T64))","v":"."},{"$f":"IF(U64=\".\",\".\",SUM($S64:U64))","v":"."},{"$f":"IF(V64=\".\",\".\",SUM($S64:V64))","v":"."},{"$f":"IF(W64=\".\",\".\",SUM($S64:W64))","v":"."},{"$f":"IF(X64=\".\",\".\",SUM($S64:X64))","v":"."},{"$f":"IF(Y64=\".\",\".\",SUM($S64:Y64))","v":"."},null,".",".",".",".",".",".","."]
[null,null,"Residential",{"$f":"IF('WK2 - Notional General Income'!D24=\"\",\"\",'WK2 - Notional General Income'!D24)","v":""},{"$f":"IF('WK2 - Notional General Income'!M24=\".\",\".\",'WK2 - Notional General Income'!M24/'WK2 - Notional General Income'!E24)","v":"."},{"$f":"IF('WK3 - Notional GI Yr1 YIELD'!M24=\".\",\".\",'WK3 - Notional GI Yr1 YIELD'!M24/'WK3 - Notional GI Yr1 YIELD'!E24)","v":"."},null,null,null,null,null,null,null,null,{"$f":"'WK2 - Notional General Income'!$E24","v":0},{"$f":"'WK3 - Notional GI Yr1 YIELD'!$E24","v":0},null,null,".",".",".",".",".",".",".",null,".",".",".",".",".",".",".",null,{"$f":"IF(S65=\".\",\".\",SUM($S65:S65))","v":"."},{"$f":"IF(T65=\".\",\".\",SUM($S65:T65))","v":"."},{"$f":"IF(U65=\".\",\".\",SUM($S65:U65))","v":"."},{"$f":"IF(V65=\".\",\".\",SUM($S65:V65))","v":"."},{"$f":"IF(W65=\".\",\".\",SUM($S65:W65))","v":"."},{"$f":"IF(X65=\".\",\".\",SUM($S65:X65))","v":"."},{"$f":"IF(Y65=\".\",\".\",SUM($S65:Y65))","v":"."},null,".",".",".",".",".",".","."]
[null,null,"Residential",{"$f":"IF('WK2 - Notional General Income'!D25=\"\",\"\",'WK2 - Notional General Income'!D25)","v":""},{"$f":"IF('WK2 - Notional General Income'!M25=\".\",\".\",'WK2 - Notional General Income'!M25/'WK2 - Notional General Income'!E25)","v":"."},{"$f":"IF('WK3 - Notional GI Yr1 YIELD'!M25=\".\",\".\",'WK3 - Notional GI Yr1 YIELD'!M25/'WK3 - Notional GI Yr1 YIELD'!E25)","v":"."},null,null,null,null,null,null,null,null,{"$f":"'WK2 - Notional General Income'!$E25","v":0},{"$f":"'WK3 - Notional GI Yr1 YIELD'!$E25","v":0},null,null,".",".",".",".",".",".",".",null,".",".",".",".",".",".",".",null,{"$f":"IF(S66=\".\",\".\",SUM($S66:S66))","v":"."},{"$f":"IF(T66=\".\",\".\",SUM($S66:T66))","v":"."},{"$f":"IF(U66=\".\",\".\",SUM($S66:U66))","v":"."},{"$f":"IF(V66=\".\",\".\",SUM($S66:V66))","v":"."},{"$f":"IF(W66=\".\",\".\",SUM($S66:W66))","v":"."},{"$f":"IF(X66=\".\",\".\",SUM($S66:X66))","v":"."},{"$f":"IF(Y66=\".\",\".\",SUM($S66:Y66))","v":"."},null,".",".",".",".",".",".","."]
[null,null,"Residential",{"$f":"IF('WK2 - Notional General Income'!D26=\"\",\"\",'WK2 - Notional General Income'!D26)","v":""},{"$f":"IF('WK2 - Notional General Income'!M26=\".\",\".\",'WK2 - Notional General Income'!M26/'WK2 - Notional General Income'!E26)","v":"."},{"$f":"IF('WK3 - Notional GI Yr1 YIELD'!M26=\".\",\".\",'WK3 - Notional GI Yr1 YIELD'!M26/'WK3 - Notional GI Yr1 YIELD'!E26)","v":"."},null,null,null,null,null,null,null,null,{"$f":"'WK2 - Notional General Income'!$E26","v":0},{"$f":"'WK3 - Notional GI Yr1 YIELD'!$E26","v":0},null,null,".",".",".",".",".",".",".",null,".",".",".",".",".",".",".",null,{"$f":"IF(S67=\".\",\".\",SUM($S67:S67))","v":"."},{"$f":"IF(T67=\".\",\".\",SUM($S67:T67))","v":"."},{"$f":"IF(U67=\".\",\".\",SUM($S67:U67))","v":"."},{"$f":"IF(V67=\".\",\".\",SUM($S67:V67))","v":"."},{"$f":"IF(W67=\".\",\".\",SUM($S67:W67))","v":"."},{"$f":"IF(X67=\".\",\".\",SUM($S67:X67))","v":"."},{"$f":"IF(Y67=\".\",\".\",SUM($S67:Y67))","v":"."},null,".",".",".",".",".",".","."]
[null,null,"Residential",{"$f":"IF('WK2 - Notional General Income'!D27=\"\",\"\",'WK2 - Notional General Income'!D27)","v":""},{"$f":"IF('WK2 - Notional General Income'!M27=\".\",\".\",'WK2 - Notional General Income'!M27/'WK2 - Notional General Income'!E27)","v":"."},{"$f":"IF('WK3 - Notional GI Yr1 YIELD'!M27=\".\",\".\",'WK3 - Notional GI Yr1 YIELD'!M27/'WK3 - Notional GI Yr1 YIELD'!E27)","v":"."},null,null,null,null,null,null,null,null,{"$f":"'WK2 - Notional General Income'!$E27","v":0},{"$f":"'WK3 - Notional GI Yr1 YIELD'!$E27","v":0},null,null,".",".",".",".",".",".",".",null,".",".",".",".",".",".",".",null,{"$f":"IF(S68=\".\",\".\",SUM($S68:S68))","v":"."},{"$f":"IF(T68=\".\",\".\",SUM($S68:T68))","v":"."},{"$f":"IF(U68=\".\",\".\",SUM($S68:U68))","v":"."},{"$f":"IF(V68=\".\",\".\",SUM($S68:V68))","v":"."},{"$f":"IF(W68=\".\",\".\",SUM($S68:W68))","v":"."},{"$f":"IF(X68=\".\",\".\",SUM($S68:X68))","v":"."},{"$f":"IF(Y68=\".\",\".\",SUM($S68:Y68))","v":"."},null,".",".",".",".",".",".","."]
[null,null,"Residential",{"$f":"IF('WK2 - Notional General Income'!D28=\"\",\"\",'WK2 - Notional General Income'!D28)","v":""},{"$f":"IF('WK2 - Notional General Income'!M28=\".\",\".\",'WK2 - Notional General Income'!M28/'WK2 - Notional General Income'!E28)","v":"."},{"$f":"IF('WK3 - Notional GI Yr1 YIELD'!M28=\".\",\".\",'WK3 - Notional GI Yr1 YIELD'!M28/'WK3 - Notional GI Yr1 YIELD'!E28)","v":"."},null,null,null,null,null,null,null,null,{"$f":"'WK2 - Notional General Income'!$E28","v":0},{"$f":"'WK3 - Notional GI Yr1 YIELD'!$E28","v":0},null,null,".",".",".",".",".",".",".",null,".",".",".",".",".",".",".",null,{"$f":"IF(S69=\".\",\".\",SUM($S69:S69))","v":"."},{"$f":"IF(T69=\".\",\".\",SUM($S69:T69))","v":"."},{"$f":"IF(U69=\".\",\".\",SUM($S69:U69))","v":"."},{"$f":"IF(V69=\".\",\".\",SUM($S69:V69))","v":"."},{"$f":"IF(W69=\".\",\".\",SUM($S69:W69))","v":"."},{"$f":"IF(X69=\".\",\".\",SUM($S69:X69))","v":"."},{"$f":"IF(Y69=\".\",\".\",SUM($S69:Y69))","v":"."},null,".",".",".",".",".",".","."]
[null,null,"Residential",{"$f":"IF('WK2 - Notional General Income'!D29=\"\",\"\",'WK2 - Notional General Income'!D29)","v":""},{"$f":"IF('WK2 - Notional General Income'!M29=\".\",\".\",'WK2 - Notional General Income'!M29/'WK2 - Notional General Income'!E29)","v":"."},{"$f":"IF('WK3 - Notional GI Yr1 YIELD'!M29=\".\",\".\",'WK3 - Notional GI Yr1 YIELD'!M29/'WK3 - Notional GI Yr1 YIELD'!E29)","v":"."},null,null,null,null,null,null,null,null,{"$f":"'WK2 - Notional General Income'!$E29","v":0},{"$f":"'WK3 - Notional GI Yr1 YIELD'!$E29","v":0},null,null,".",".",".",".",".",".",".",null,".",".",".",".",".",".",".",null,{"$f":"IF(S70=\".\",\".\",SUM($S70:S70))","v":"."},{"$f":"IF(T70=\".\",\".\",SUM($S70:T70))","v":"."},{"$f":"IF(U70=\".\",\".\",SUM($S70:U70))","v":"."},{"$f":"IF(V70=\".\",\".\",SUM($S70:V70))","v":"."},{"$f":"IF(W70=\".\",\".\",SUM($S70:W70))","v":"."},{"$f":"IF(X70=\".\",\".\",SUM($S70:X70))","v":"."},{"$f":"IF(Y70=\".\",\".\",SUM($S70:Y70))","v":"."},null,".",".",".",".",".",".","."]
[null,null,"Residential",{"$f":"IF('WK2 - Notional General Income'!D30=\"\",\"\",'WK2 - Notional General Income'!D30)","v":""},{"$f":"IF('WK2 - Notional General Income'!M30=\".\",\".\",'WK2 - Notional General Income'!M30/'WK2 - Notional General Income'!E30)","v":"."},{"$f":"IF('WK3 - Notional GI Yr1 YIELD'!M30=\".\",\".\",'WK3 - Notional GI Yr1 YIELD'!M30/'WK3 - Notional GI Yr1 YIELD'!E30)","v":"."},null,null,null,null,null,null,null,null,{"$f":"'WK2 - Notional General Income'!$E30","v":0},{"$f":"'WK3 - Notional GI Yr1 YIELD'!$E30","v":0},null,null,".",".",".",".",".",".",".",null,".",".",".",".",".",".",".",null,{"$f":"IF(S71=\".\",\".\",SUM($S71:S71))","v":"."},{"$f":"IF(T71=\".\",\".\",SUM($S71:T71))","v":"."},{"$f":"IF(U71=\".\",\".\",SUM($S71:U71))","v":"."},{"$f":"IF(V71=\".\",\".\",SUM($S71:V71))","v":"."},{"$f":"IF(W71=\".\",\".\",SUM($S71:W71))","v":"."},{"$f":"IF(X71=\".\",\".\",SUM($S71:X71))","v":"."},{"$f":"IF(Y71=\".\",\".\",SUM($S71:Y71))","v":"."},null,".",".",".",".",".",".","."]
[null,null,"Residential",{"$f":"IF('WK2 - Notional General Income'!D31=\"\",\"\",'WK2 - Notional General Income'!D31)","v":""},{"$f":"IF('WK2 - Notional General Income'!M31=\".\",\".\",'WK2 - Notional General Income'!M31/'WK2 - Notional General Income'!E31)","v":"."},{"$f":"IF('WK3 - Notional GI Yr1 YIELD'!M31=\".\",\".\",'WK3 - Notional GI Yr1 YIELD'!M31/'WK3 - Notional GI Yr1 YIELD'!E31)","v":"."},null,null,null,null,null,null,null,null,{"$f":"'WK2 - Notional General Income'!$E31","v":0},{"$f":"'WK3 - Notional GI Yr1 YIELD'!$E31","v":0},null,null,".",".",".",".",".",".",".",null,".",".",".",".",".",".",".",null,{"$f":"IF(S72=\".\",\".\",SUM($S72:S72))","v":"."},{"$f":"IF(T72=\".\",\".\",SUM($S72:T72))","v":"."},{"$f":"IF(U72=\".\",\".\",SUM($S72:U72))","v":"."},{"$f":"IF(V72=\".\",\".\",SUM($S72:V72))","v":"."},{"$f":"IF(W72=\".\",\".\",SUM($S72:W72))","v":"."},{"$f":"IF(X72=\".\",\".\",SUM($S72:X72))","v":"."},{"$f":"IF(Y72=\".\",\".\",SUM($S72:Y72))","v":"."},null,".",".",".",".",".",".","."]
[null,null,"Residential",{"$f":"IF('WK2 - Notional General Income'!D32=\"\",\"\",'WK2 - Notional General Income'!D32)","v":""},{"$f":"IF('WK2 - Notional General Income'!M32=\".\",\".\",'WK2 - Notional General Income'!M32/'WK2 - Notional General Income'!E32)","v":"."},{"$f":"IF('WK3 - Notional GI Yr1 YIELD'!M32=\".\",\".\",'WK3 - Notional GI Yr1 YIELD'!M32/'WK3 - Notional GI Yr1 YIELD'!E32)","v":"."},null,null,null,null,null,null,null,null,{"$f":"'WK2 - Notional General Income'!$E32","v":0},{"$f":"'WK3 - Notional GI Yr1 YIELD'!$E32","v":0},null,null,".",".",".",".",".",".",".",null,".",".",".",".",".",".",".",null,{"$f":"IF(S73=\".\",\".\",SUM($S73:S73))","v":"."},{"$f":"IF(T73=\".\",\".\",SUM($S73:T73))","v":"."},{"$f":"IF(U73=\".\",\".\",SUM($S73:U73))","v":"."},{"$f":"IF(V73=\".\",\".\",SUM($S73:V73))","v":"."},{"$f":"IF(W73=\".\",\".\",SUM($S73:W73))","v":"."},{"$f":"IF(X73=\".\",\".\",SUM($S73:X73))","v":"."},{"$f":"IF(Y73=\".\",\".\",SUM($S73:Y73))","v":"."},null,".",".",".",".",".",".","."]
[null,null,"Residential",{"$f":"IF('WK2 - Notional General Income'!D33=\"\",\"\",'WK2 - Notional General Income'!D33)","v":""},{"$f":"IF('WK2 - Notional General Income'!M33=\".\",\".\",'WK2 - Notional General Income'!M33/'WK2 - Notional General Income'!E33)","v":"."},{"$f":"IF('WK3 - Notional GI Yr1 YIELD'!M33=\".\",\".\",'WK3 - Notional GI Yr1 YIELD'!M33/'WK3 - Notional GI Yr1 YIELD'!E33)","v":"."},null,null,null,null,null,null,null,null,{"$f":"'WK2 - Notional General Income'!$E33","v":0},{"$f":"'WK3 - Notional GI Yr1 YIELD'!$E33","v":0},null,null,".",".",".",".",".",".",".",null,".",".",".",".",".",".",".",null,{"$f":"IF(S74=\".\",\".\",SUM($S74:S74))","v":"."},{"$f":"IF(T74=\".\",\".\",SUM($S74:T74))","v":"."},{"$f":"IF(U74=\".\",\".\",SUM($S74:U74))","v":"."},{"$f":"IF(V74=\".\",\".\",SUM($S74:V74))","v":"."},{"$f":"IF(W74=\".\",\".\",SUM($S74:W74))","v":"."},{"$f":"IF(X74=\".\",\".\",SUM($S74:X74))","v":"."},{"$f":"IF(Y74=\".\",\".\",SUM($S74:Y74))","v":"."},null,".",".",".",".",".",".","."]
[null,null,"Residential",{"$f":"IF('WK2 - Notional General Income'!D34=\"\",\"\",'WK2 - Notional General Income'!D34)","v":""},{"$f":"IF('WK2 - Notional General Income'!M34=\".\",\".\",'WK2 - Notional General Income'!M34/'WK2 - Notional General Income'!E34)","v":"."},{"$f":"IF('WK3 - Notional GI Yr1 YIELD'!M34=\".\",\".\",'WK3 - Notional GI Yr1 YIELD'!M34/'WK3 - Notional GI Yr1 YIELD'!E34)","v":"."},null,null,null,null,null,null,null,null,{"$f":"'WK2 - Notional General Income'!$E34","v":0},{"$f":"'WK3 - Notional GI Yr1 YIELD'!$E34","v":0},null,null,".",".",".",".",".",".",".",null,".",".",".",".",".",".",".",null,{"$f":"IF(S75=\".\",\".\",SUM($S75:S75))","v":"."},{"$f":"IF(T75=\".\",\".\",SUM($S75:T75))","v":"."},{"$f":"IF(U75=\".\",\".\",SUM($S75:U75))","v":"."},{"$f":"IF(V75=\".\",\".\",SUM($S75:V75))","v":"."},{"$f":"IF(W75=\".\",\".\",SUM($S75:W75))","v":"."},{"$f":"IF(X75=\".\",\".\",SUM($S75:X75))","v":"."},{"$f":"IF(Y75=\".\",\".\",SUM($S75:Y75))","v":"."},null,".",".",".",".",".",".","."]
[null,null,"Residential",{"$f":"IF('WK2 - Notional General Income'!D35=\"\",\"\",'WK2 - Notional General Income'!D35)","v":""},{"$f":"IF('WK2 - Notional General Income'!M35=\".\",\".\",'WK2 - Notional General Income'!M35/'WK2 - Notional General Income'!E35)","v":"."},{"$f":"IF('WK3 - Notional GI Yr1 YIELD'!M35=\".\",\".\",'WK3 - Notional GI Yr1 YIELD'!M35/'WK3 - Notional GI Yr1 YIELD'!E35)","v":"."},null,null,null,null,null,null,null,null,{"$f":"'WK2 - Notional General Income'!$E35","v":0},{"$f":"'WK3 - Notional GI Yr1 YIELD'!$E35","v":0},null,null,".",".",".",".",".",".",".",null,".",".",".",".",".",".",".",null,{"$f":"IF(S76=\".\",\".\",SUM($S76:S76))","v":"."},{"$f":"IF(T76=\".\",\".\",SUM($S76:T76))","v":"."},{"$f":"IF(U76=\".\",\".\",SUM($S76:U76))","v":"."},{"$f":"IF(V76=\".\",\".\",SUM($S76:V76))","v":"."},{"$f":"IF(W76=\".\",\".\",SUM($S76:W76))","v":"."},{"$f":"IF(X76=\".\",\".\",SUM($S76:X76))","v":"."},{"$f":"IF(Y76=\".\",\".\",SUM($S76:Y76))","v":"."},null,".",".",".",".",".",".","."]
[null,null,"Residential",{"$f":"IF('WK2 - Notional General Income'!D36=\"\",\"\",'WK2 - Notional General Income'!D36)","v":""},{"$f":"IF('WK2 - Notional General Income'!M36=\".\",\".\",'WK2 - Notional General Income'!M36/'WK2 - Notional General Income'!E36)","v":"."},{"$f":"IF('WK3 - Notional GI Yr1 YIELD'!M36=\".\",\".\",'WK3 - Notional GI Yr1 YIELD'!M36/'WK3 - Notional GI Yr1 YIELD'!E36)","v":"."},null,null,null,null,null,null,null,null,{"$f":"'WK2 - Notional General Income'!$E36","v":0},{"$f":"'WK3 - Notional GI Yr1 YIELD'!$E36","v":0},null,null,".",".",".",".",".",".",".",null,".",".",".",".",".",".",".",null,{"$f":"IF(S77=\".\",\".\",SUM($S77:S77))","v":"."},{"$f":"IF(T77=\".\",\".\",SUM($S77:T77))","v":"."},{"$f":"IF(U77=\".\",\".\",SUM($S77:U77))","v":"."},{"$f":"IF(V77=\".\",\".\",SUM($S77:V77))","v":"."},{"$f":"IF(W77=\".\",\".\",SUM($S77:W77))","v":"."},{"$f":"IF(X77=\".\",\".\",SUM($S77:X77))","v":"."},{"$f":"IF(Y77=\".\",\".\",SUM($S77:Y77))","v":"."},null,".",".",".",".",".",".","."]
[null,null,"Residential",{"$f":"IF('WK2 - Notional General Income'!D37=\"\",\"\",'WK2 - Notional General Income'!D37)","v":""},{"$f":"IF('WK2 - Notional General Income'!M37=\".\",\".\",'WK2 - Notional General Income'!M37/'WK2 - Notional General Income'!E37)","v":"."},{"$f":"IF('WK3 - Notional GI Yr1 YIELD'!M37=\".\",\".\",'WK3 - Notional GI Yr1 YIELD'!M37/'WK3 - Notional GI Yr1 YIELD'!E37)","v":"."},null,null,null,null,null,null,null,null,{"$f":"'WK2 - Notional General Income'!$E37","v":0},{"$f":"'WK3 - Notional GI Yr1 YIELD'!$E37","v":0},null,null,".",".",".",".",".",".",".",null,".",".",".",".",".",".",".",null,{"$f":"IF(S78=\".\",\".\",SUM($S78:S78))","v":"."},{"$f":"IF(T78=\".\",\".\",SUM($S78:T78))","v":"."},{"$f":"IF(U78=\".\",\".\",SUM($S78:U78))","v":"."},{"$f":"IF(V78=\".\",\".\",SUM($S78:V78))","v":"."},{"$f":"IF(W78=\".\",\".\",SUM($S78:W78))","v":"."},{"$f":"IF(X78=\".\",\".\",SUM($S78:X78))","v":"."},{"$f":"IF(Y78=\".\",\".\",SUM($S78:Y78))","v":"."},null,".",".",".",".",".",".","."]
[null,null,"Residential",{"$f":"IF('WK2 - Notional General Income'!D38=\"\",\"\",'WK2 - Notional General Income'!D38)","v":""},{"$f":"IF('WK2 - Notional General Income'!M38=\".\",\".\",'WK2 - Notional General Income'!M38/'WK2 - Notional General Income'!E38)","v":"."},{"$f":"IF('WK3 - Notional GI Yr1 YIELD'!M38=\".\",\".\",'WK3 - Notional GI Yr1 YIELD'!M38/'WK3 - Notional GI Yr1 YIELD'!E38)","v":"."},null,null,null,null,null,null,null,null,{"$f":"'WK2 - Notional General Income'!$E38","v":0},{"$f":"'WK3 - Notional GI Yr1 YIELD'!$E38","v":0},null,null,".",".",".",".",".",".",".",null,".",".",".",".",".",".",".",null,{"$f":"IF(S79=\".\",\".\",SUM($S79:S79))","v":"."},{"$f":"IF(T79=\".\",\".\",SUM($S79:T79))","v":"."},{"$f":"IF(U79=\".\",\".\",SUM($S79:U79))","v":"."},{"$f":"IF(V79=\".\",\".\",SUM($S79:V79))","v":"."},{"$f":"IF(W79=\".\",\".\",SUM($S79:W79))","v":"."},{"$f":"IF(X79=\".\",\".\",SUM($S79:X79))","v":"."},{"$f":"IF(Y79=\".\",\".\",SUM($S79:Y79))","v":"."},null,".",".",".",".",".",".","."]
[null,null,"Special rate",{"$f":"IF('WK2 - Notional General Income'!D94=\"\",\"\",'WK2 - Notional General Income'!D94)","v":"Not Applicable"},{"$f":"IF('WK2 - Notional General Income'!M94=\".\",\".\",'WK2 - Notional General Income'!M94/'WK2 - Notional General Income'!E94)","v":"."},{"$f":"IF('WK3 - Notional GI Yr1 YIELD'!M94=\".\",\".\",'WK3 - Notional GI Yr1 YIELD'!M94/'WK3 - Notional GI Yr1 YIELD'!E94)","v":"."},null,null,null,null,null,null,null,null,{"$f":"'WK2 - Notional General Income'!$E94","v":0},{"$f":"'WK3 - Notional GI Yr1 YIELD'!$E94","v":0},null,null,".",".",".",".",".",".",".",null,".",".",".",".",".",".",".",null,{"$f":"IF(S80=\".\",\".\",SUM($S80:S80))","v":"."},{"$f":"IF(T80=\".\",\".\",SUM($S80:T80))","v":"."},{"$f":"IF(U80=\".\",\".\",SUM($S80:U80))","v":"."},{"$f":"IF(V80=\".\",\".\",SUM($S80:V80))","v":"."},{"$f":"IF(W80=\".\",\".\",SUM($S80:W80))","v":"."},{"$f":"IF(X80=\".\",\".\",SUM($S80:X80))","v":"."},{"$f":"IF(Y80=\".\",\".\",SUM($S80:Y80))","v":"."},null,".",".",".",".",".",".","."]
[null,null,"Special rate",{"$f":"IF('WK2 - Notional General Income'!D95=\"\",\"\",'WK2 - Notional General Income'!D95)","v":""},{"$f":"IF('WK2 - Notional General Income'!M95=\".\",\".\",'WK2 - Notional General Income'!M95/'WK2 - Notional General Income'!E95)","v":"."},{"$f":"IF('WK3 - Notional GI Yr1 YIELD'!M95=\".\",\".\",'WK3 - Notional GI Yr1 YIELD'!M95/'WK3 - Notional GI Yr1 YIELD'!E95)","v":"."},null,null,null,null,null,null,null,null,{"$f":"'WK2 - Notional General Income'!$E95","v":0},{"$f":"'WK3 - Notional GI Yr1 YIELD'!$E95","v":0},null,null,".",".",".",".",".",".",".",null,".",".",".",".",".",".",".",null,{"$f":"IF(S81=\".\",\".\",SUM($S81:S81))","v":"."},{"$f":"IF(T81=\".\",\".\",SUM($S81:T81))","v":"."},{"$f":"IF(U81=\".\",\".\",SUM($S81:U81))","v":"."},{"$f":"IF(V81=\".\",\".\",SUM($S81:V81))","v":"."},{"$f":"IF(W81=\".\",\".\",SUM($S81:W81))","v":"."},{"$f":"IF(X81=\".\",\".\",SUM($S81:X81))","v":"."},{"$f":"IF(Y81=\".\",\".\",SUM($S81:Y81))","v":"."},null,".",".",".",".",".",".","."]
[null,null,"Special rate",{"$f":"IF('WK2 - Notional General Income'!D96=\"\",\"\",'WK2 - Notional General Income'!D96)","v":""},{"$f":"IF('WK2 - Notional General Income'!M96=\".\",\".\",'WK2 - Notional General Income'!M96/'WK2 - Notional General Income'!E96)","v":"."},{"$f":"IF('WK3 - Notional GI Yr1 YIELD'!M96=\".\",\".\",'WK3 - Notional GI Yr1 YIELD'!M96/'WK3 - Notional GI Yr1 YIELD'!E96)","v":"."},null,null,null,null,null,null,null,null,{"$f":"'WK2 - Notional General Income'!$E96","v":0},{"$f":"'WK3 - Notional GI Yr1 YIELD'!$E96","v":0},null,null,".",".",".",".",".",".",".",null,".",".",".",".",".",".",".",null,{"$f":"IF(S82=\".\",\".\",SUM($S82:S82))","v":"."},{"$f":"IF(T82=\".\",\".\",SUM($S82:T82))","v":"."},{"$f":"IF(U82=\".\",\".\",SUM($S82:U82))","v":"."},{"$f":"IF(V82=\".\",\".\",SUM($S82:V82))","v":"."},{"$f":"IF(W82=\".\",\".\",SUM($S82:W82))","v":"."},{"$f":"IF(X82=\".\",\".\",SUM($S82:X82))","v":"."},{"$f":"IF(Y82=\".\",\".\",SUM($S82:Y82))","v":"."},null,".",".",".",".",".",".","."]
[null,null,"Special rate",{"$f":"IF('WK2 - Notional General Income'!D97=\"\",\"\",'WK2 - Notional General Income'!D97)","v":""},{"$f":"IF('WK2 - Notional General Income'!M97=\".\",\".\",'WK2 - Notional General Income'!M97/'WK2 - Notional General Income'!E97)","v":"."},{"$f":"IF('WK3 - Notional GI Yr1 YIELD'!M97=\".\",\".\",'WK3 - Notional GI Yr1 YIELD'!M97/'WK3 - Notional GI Yr1 YIELD'!E97)","v":"."},null,null,null,null,null,null,null,null,{"$f":"'WK2 - Notional General Income'!$E97","v":0},{"$f":"'WK3 - Notional GI Yr1 YIELD'!$E97","v":0},null,null,".",".",".",".",".",".",".",null,".",".",".",".",".",".",".",null,{"$f":"IF(S83=\".\",\".\",SUM($S83:S83))","v":"."},{"$f":"IF(T83=\".\",\".\",SUM($S83:T83))","v":"."},{"$f":"IF(U83=\".\",\".\",SUM($S83:U83))","v":"."},{"$f":"IF(V83=\".\",\".\",SUM($S83:V83))","v":"."},{"$f":"IF(W83=\".\",\".\",SUM($S83:W83))","v":"."},{"$f":"IF(X83=\".\",\".\",SUM($S83:X83))","v":"."},{"$f":"IF(Y83=\".\",\".\",SUM($S83:Y83))","v":"."},null,".",".",".",".",".",".","."]
[null,null,"Special rate",{"$f":"IF('WK2 - Notional General Income'!D98=\"\",\"\",'WK2 - Notional General Income'!D98)","v":""},{"$f":"IF('WK2 - Notional General Income'!M98=\".\",\".\",'WK2 - Notional General Income'!M98/'WK2 - Notional General Income'!E98)","v":"."},{"$f":"IF('WK3 - Notional GI Yr1 YIELD'!M98=\".\",\".\",'WK3 - Notional GI Yr1 YIELD'!M98/'WK3 - Notional GI Yr1 YIELD'!E98)","v":"."},null,null,null,null,null,null,null,null,{"$f":"'WK2 - Notional General Income'!$E98","v":0},{"$f":"'WK3 - Notional GI Yr1 YIELD'!$E98","v":0},null,null,".",".",".",".",".",".",".",null,".",".",".",".",".",".",".",null,{"$f":"IF(S84=\".\",\".\",SUM($S84:S84))","v":"."},{"$f":"IF(T84=\".\",\".\",SUM($S84:T84))","v":"."},{"$f":"IF(U84=\".\",\".\",SUM($S84:U84))","v":"."},{"$f":"IF(V84=\".\",\".\",SUM($S84:V84))","v":"."},{"$f":"IF(W84=\".\",\".\",SUM($S84:W84))","v":"."},{"$f":"IF(X84=\".\",\".\",SUM($S84:X84))","v":"."},{"$f":"IF(Y84=\".\",\".\",SUM($S84:Y84))","v":"."},null,".",".",".",".",".",".","."]
[null,null,"Special rate",{"$f":"IF('WK2 - Notional General Income'!D99=\"\",\"\",'WK2 - Notional General Income'!D99)","v":""},{"$f":"IF('WK2 - Notional General Income'!M99=\".\",\".\",'WK2 - Notional General Income'!M99/'WK2 - Notional General Income'!E99)","v":"."},{"$f":"IF('WK3 - Notional GI Yr1 YIELD'!M99=\".\",\".\",'WK3 - Notional GI Yr1 YIELD'!M99/'WK3 - Notional GI Yr1 YIELD'!E99)","v":"."},null,null,null,null,null,null,null,null,{"$f":"'WK2 - Notional General Income'!$E99","v":0},{"$f":"'WK3 - Notional GI Yr1 YIELD'!$E99","v":0},null,null,".",".",".",".",".",".",".",null,".",".",".",".",".",".",".",null,{"$f":"IF(S85=\".\",\".\",SUM($S85:S85))","v":"."},{"$f":"IF(T85=\".\",\".\",SUM($S85:T85))","v":"."},{"$f":"IF(U85=\".\",\".\",SUM($S85:U85))","v":"."},{"$f":"IF(V85=\".\",\".\",SUM($S85:V85))","v":"."},{"$f":"IF(W85=\".\",\".\",SUM($S85:W85))","v":"."},{"$f":"IF(X85=\".\",\".\",SUM($S85:X85))","v":"."},{"$f":"IF(Y85=\".\",\".\",SUM($S85:Y85))","v":"."},null,".",".",".",".",".",".","."]
[null,null,"Special rate",{"$f":"IF('WK2 - Notional General Income'!D100=\"\",\"\",'WK2 - Notional General Income'!D100)","v":""},{"$f":"IF('WK2 - Notional General Income'!M100=\".\",\".\",'WK2 - Notional General Income'!M100/'WK2 - Notional General Income'!E100)","v":"."},{"$f":"IF('WK3 - Notional GI Yr1 YIELD'!M100=\".\",\".\",'WK3 - Notional GI Yr1 YIELD'!M100/'WK3 - Notional GI Yr1 YIELD'!E100)","v":"."},null,null,null,null,null,null,null,null,{"$f":"'WK2 - Notional General Income'!$E100","v":0},{"$f":"'WK3 - Notional GI Yr1 YIELD'!$E100","v":0},null,null,".",".",".",".",".",".",".",null,".",".",".",".",".",".",".",null,{"$f":"IF(S86=\".\",\".\",SUM($S86:S86))","v":"."},{"$f":"IF(T86=\".\",\".\",SUM($S86:T86))","v":"."},{"$f":"IF(U86=\".\",\".\",SUM($S86:U86))","v":"."},{"$f":"IF(V86=\".\",\".\",SUM($S86:V86))","v":"."},{"$f":"IF(W86=\".\",\".\",SUM($S86:W86))","v":"."},{"$f":"IF(X86=\".\",\".\",SUM($S86:X86))","v":"."},{"$f":"IF(Y86=\".\",\".\",SUM($S86:Y86))","v":"."},null,".",".",".",".",".",".","."]
[null,null,"Special rate",{"$f":"IF('WK2 - Notional General Income'!D101=\"\",\"\",'WK2 - Notional General Income'!D101)","v":""},{"$f":"IF('WK2 - Notional General Income'!M101=\".\",\".\",'WK2 - Notional General Income'!M101/'WK2 - Notional General Income'!E101)","v":"."},{"$f":"IF('WK3 - Notional GI Yr1 YIELD'!M101=\".\",\".\",'WK3 - Notional GI Yr1 YIELD'!M101/'WK3 - Notional GI Yr1 YIELD'!E101)","v":"."},null,null,null,null,null,null,null,null,{"$f":"'WK2 - Notional General Income'!$E101","v":0},{"$f":"'WK3 - Notional GI Yr1 YIELD'!$E101","v":0},null,null,".",".",".",".",".",".",".",null,".",".",".",".",".",".",".",null,{"$f":"IF(S87=\".\",\".\",SUM($S87:S87))","v":"."},{"$f":"IF(T87=\".\",\".\",SUM($S87:T87))","v":"."},{"$f":"IF(U87=\".\",\".\",SUM($S87:U87))","v":"."},{"$f":"IF(V87=\".\",\".\",SUM($S87:V87))","v":"."},{"$f":"IF(W87=\".\",\".\",SUM($S87:W87))","v":"."},{"$f":"IF(X87=\".\",\".\",SUM($S87:X87))","v":"."},{"$f":"IF(Y87=\".\",\".\",SUM($S87:Y87))","v":"."},null,".",".",".",".",".",".","."]
[null,null,"Special rate",{"$f":"IF('WK2 - Notional General Income'!D102=\"\",\"\",'WK2 - Notional General Income'!D102)","v":""},{"$f":"IF('WK2 - Notional General Income'!M102=\".\",\".\",'WK2 - Notional General Income'!M102/'WK2 - Notional General Income'!E102)","v":"."},{"$f":"IF('WK3 - Notional GI Yr1 YIELD'!M102=\".\",\".\",'WK3 - Notional GI Yr1 YIELD'!M102/'WK3 - Notional GI Yr1 YIELD'!E102)","v":"."},null,null,null,null,null,null,null,null,{"$f":"'WK2 - Notional General Income'!$E102","v":0},{"$f":"'WK3 - Notional GI Yr1 YIELD'!$E102","v":0},null,null,".",".",".",".",".",".",".",null,".",".",".",".",".",".",".",null,{"$f":"IF(S88=\".\",\".\",SUM($S88:S88))","v":"."},{"$f":"IF(T88=\".\",\".\",SUM($S88:T88))","v":"."},{"$f":"IF(U88=\".\",\".\",SUM($S88:U88))","v":"."},{"$f":"IF(V88=\".\",\".\",SUM($S88:V88))","v":"."},{"$f":"IF(W88=\".\",\".\",SUM($S88:W88))","v":"."},{"$f":"IF(X88=\".\",\".\",SUM($S88:X88))","v":"."},{"$f":"IF(Y88=\".\",\".\",SUM($S88:Y88))","v":"."},null,".",".",".",".",".",".","."]
[null,null,"Special rate",{"$f":"IF('WK2 - Notional General Income'!D103=\"\",\"\",'WK2 - Notional General Income'!D103)","v":""},{"$f":"IF('WK2 - Notional General Income'!M103=\".\",\".\",'WK2 - Notional General Income'!M103/'WK2 - Notional General Income'!E103)","v":"."},{"$f":"IF('WK3 - Notional GI Yr1 YIELD'!M103=\".\",\".\",'WK3 - Notional GI Yr1 YIELD'!M103/'WK3 - Notional GI Yr1 YIELD'!E103)","v":"."},null,null,null,null,null,null,null,null,{"$f":"'WK2 - Notional General Income'!$E103","v":0},{"$f":"'WK3 - Notional GI Yr1 YIELD'!$E103","v":0},null,null,".",".",".",".",".",".",".",null,".",".",".",".",".",".",".",null,{"$f":"IF(S89=\".\",\".\",SUM($S89:S89))","v":"."},{"$f":"IF(T89=\".\",\".\",SUM($S89:T89))","v":"."},{"$f":"IF(U89=\".\",\".\",SUM($S89:U89))","v":"."},{"$f":"IF(V89=\".\",\".\",SUM($S89:V89))","v":"."},{"$f":"IF(W89=\".\",\".\",SUM($S89:W89))","v":"."},{"$f":"IF(X89=\".\",\".\",SUM($S89:X89))","v":"."},{"$f":"IF(Y89=\".\",\".\",SUM($S89:Y89))","v":"."},null,".",".",".",".",".",".","."]
[null,null,null,"TOTAL AVERAGE",{"$f":"IF(SUM(E60:E89)=0,\".\",(('WK2 - Notional General Income'!M39+SUM('WK2 - Notional General Income'!M94:M103))/('WK2 - Notional General Income'!E39)))","v":1326.5348651722388},{"$f":"IF(SUM(F60:F89)=0,\".\",('WK3 - Notional GI Yr1 YIELD'!M39+SUM('WK3 - Notional GI Yr1 YIELD'!M94:M103))/'WK3 - Notional GI Yr1 YIELD'!E39)","v":1385.0356864069513},{"$f":"IF($P90=0,\".\",SUMPRODUCT(G60:G89,$P60:$P89)/$P90)","v":1447.3633383549827},1512.4929559178368,1580.5590976658709,1620.0739120732119,1660.5756837361071,1702.0900650730741,null,null,{"$f":"SUM(O60:O79)","v":12797.92},{"$f":"SUM(P60:P79)","v":12797.92},null,null,58.500821234712475,{"$f":"IF(G90=\".\",\".\",G90-F90)","v":62.327651948031416},65.129617562854037,68.06614174803417,39.514814407340964,40.50177166289518,41.514381336967062,null,4.4100477696164209E-2,4.5000755258314928E-2,4.499880288309499E-2,4.5002617355483165E-2,2.5000529537741123E-2,2.4999953002801556E-2,2.4999993522465846E-2,null,{"$f":"IF(S90=\".\",\".\",SUM($S90:S90))","v":58.500821234712475},{"$f":"IF(T90=\".\",\".\",SUM($S90:T90))","v":120.82847318274389},{"$f":"IF(U90=\".\",\".\",SUM($S90:U90))","v":185.95809074559793},{"$f":"IF(V90=\".\",\".\",SUM($S90:V90))","v":254.0242324936321},{"$f":"IF(W90=\".\",\".\",SUM($S90:W90))","v":293.53904690097306},{"$f":"IF(X90=\".\",\".\",SUM($S90:X90))","v":334.04081856386824},{"$f":"IF(Y90=\".\",\".\",SUM($S90:Y90))","v":375.55519990083531},null,4.4100477696164209E-2,9.1085787758058867E-2,0.1401833420499301,0.1914945767072993,0.22128257206632829,0.25181457897112725,0.28310993533673368]
[null,null,"Business",{"$f":"IF('WK2 - Notional General Income'!D40=\"\",\"\",'WK2 - Notional General Income'!D40)","v":"Business A"},{"$f":"IF('WK2 - Notional General Income'!M40=\".\",\".\",'WK2 - Notional General Income'!M40/'WK2 - Notional General Income'!E40)","v":3111.9799123743137},{"$f":"IF('WK3 - Notional GI Yr1 YIELD'!M40=\".\",\".\",'WK3 - Notional GI Yr1 YIELD'!M40/'WK3 - Notional GI Yr1 YIELD'!E40)","v":3254.1754164865379},3400.61,3553.64,3713.55,3806.39,3901.55,3999.09,null,null,{"$f":"'WK2 - Notional General Income'!$E40","v":459.08},{"$f":"'WK3 - Notional GI Yr1 YIELD'!$E40","v":459.08},null,null,142.19550411222417,146.43458351346226,153.02999999999975,159.91000000000031,92.839999999999691,95.160000000000309,97.539999999999964,null,4.5692937652587418E-2,4.499898277504788E-2,4.5000749865465206E-2,4.4998930673900706E-2,2.5000336605135232E-2,2.5000065679029237E-2,2.5000320385487829E-2,null,{"$f":"IF(S91=\".\",\".\",SUM($S91:S91))","v":142.19550411222417},{"$f":"IF(T91=\".\",\".\",SUM($S91:T91))","v":288.63008762568643},{"$f":"IF(U91=\".\",\".\",SUM($S91:U91))","v":441.66008762568617},{"$f":"IF(V91=\".\",\".\",SUM($S91:V91))","v":601.57008762568648},{"$f":"IF(W91=\".\",\".\",SUM($S91:W91))","v":694.41008762568617},{"$f":"IF(X91=\".\",\".\",SUM($S91:X91))","v":789.57008762568648},{"$f":"IF(Y91=\".\",\".\",SUM($S91:Y91))","v":887.11008762568645},null,4.5692937652587418E-2,9.2748056142005542E-2,0.14192253808242539,0.19330783120856099,0.22314092866231894,0.25371953221358567,0.2850629221924692]
[null,null,"Business",{"$f":"IF('WK2 - Notional General Income'!D41=\"\",\"\",'WK2 - Notional General Income'!D41)","v":"Business B"},{"$f":"IF('WK2 - Notional General Income'!M41=\".\",\".\",'WK2 - Notional General Income'!M41/'WK2 - Notional General Income'!E41)","v":13396.522249413954},{"$f":"IF('WK3 - Notional GI Yr1 YIELD'!M41=\".\",\".\",'WK3 - Notional GI Yr1 YIELD'!M41/'WK3 - Notional GI Yr1 YIELD'!E41)","v":14007.67731380465},14638.02,15296.73,15985.08,16384.71,16794.32,17214.18,null,null,{"$f":"'WK2 - Notional General Income'!$E41","v":43},{"$f":"'WK3 - Notional GI Yr1 YIELD'!$E41","v":43},null,null,611.15506439069577,{"$f":"IF(G92=\"\",\".\",G92-F92)","v":630.34268619535032},{"$f":"IF(H92=\"\",\".\",H92-G92)","v":658.70999999999913},{"$f":"IF(I92=\"\",\".\",I92-H92)","v":688.35000000000036},{"$f":"IF(J92=\"\",\".\",J92-I92)","v":399.6299999999992},{"$f":"IF(K92=\"\",\".\",K92-J92)","v":409.61000000000058},{"$f":"IF(L92=\"\",\".\",L92-K92)","v":419.86000000000058},null,{"$f":"IF(ISNUMBER(E92),F92/E92-1,\".\")","v":4.5620426929640745E-2},{"$f":"IF(ISNUMBER(F92),G92/F92-1,\".\")","v":4.49998006146346E-2},{"$f":"IF(ISNUMBER(G92),H92/G92-1,\".\")","v":4.4999938516274707E-2},{"$f":"IF(ISNUMBER(H92),I92/H92-1,\".\")","v":4.4999813685670187E-2},{"$f":"IF(ISNUMBER(I92),J92/I92-1,\".\")","v":2.5000187675007002E-2},{"$f":"IF(ISNUMBER(J92),K92/J92-1,\".\")","v":2.4999526998036536E-2},{"$f":"IF(ISNUMBER(K92),L92/K92-1,\".\")","v":2.5000119087882133E-2},null,{"$f":"IF(S92=\".\",\".\",SUM($S92:S92))","v":611.15506439069577},{"$f":"IF(T92=\".\",\".\",SUM($S92:T92))","v":1241.4977505860461},{"$f":"IF(U92=\".\",\".\",SUM($S92:U92))","v":1900.2077505860452},{"$f":"IF(V92=\".\",\".\",SUM($S92:V92))","v":2588.5577505860456},{"$f":"IF(W92=\".\",\".\",SUM($S92:W92))","v":2988.1877505860448},{"$f":"IF(X92=\".\",\".\",SUM($S92:X92))","v":3397.7977505860454},{"$f":"IF(Y92=\".\",\".\",SUM($S92:Y92))","v":3817.6577505860459},null,{"$f":"IF(ISNUMBER($E92),F92/$E92-1,\".\")","v":4.5620426929640745E-2},{"$f":"IF(ISNUMBER($E92),G92/$E92-1,\".\")","v":9.2673137660063798E-2},{"$f":"IF(ISNUMBER($E92),H92/$E92-1,\".\")","v":0.14184336167315159},{"$f":"IF(ISNUMBER($E92),I92/$E92-1,\".\")","v":0.19322610020666264},{"$f":"IF(ISNUMBER($E92),J92/$E92-1,\".\")","v":0.22305697665054569},{"$f":"IF(ISNUMBER($E92),K92/$E92-1,\".\")","v":0.25363282255845809},{"$f":"IF(ISNUMBER($E92),L92/$E92-1,\".\")","v":0.2849737924148974}]
[null,null,"Business",{"$f":"IF('WK2 - Notional General Income'!D42=\"\",\"\",'WK2 - Notional General Income'!D42)","v":"Business C"},{"$f":"IF('WK2 - Notional General Income'!M42=\".\",\".\",'WK2 - Notional General Income'!M42/'WK2 - Notional General Income'!E42)","v":12880.859077780642},{"$f":"IF('WK3 - Notional GI Yr1 YIELD'!M42=\".\",\".\",'WK3 - Notional GI Yr1 YIELD'!M42/'WK3 - Notional GI Yr1 YIELD'!E42)","v":13465.410632258063},14071.35,14704.56,15366.26,15750.42,16144.18,16547.78,null,null,{"$f":"'WK2 - Notional General Income'!$E42","v":31},{"$f":"'WK3 - Notional GI Yr1 YIELD'!$E42","v":31},null,null,584.55155447742072,605.93936774193753,633.20999999999913,661.70000000000073,384.15999999999985,393.76000000000022,403.59999999999854,null,4.5381410583535287E-2,4.4999694720808225E-2,4.4999946700210014E-2,4.4999646368201418E-2,2.500022777175448E-2,2.4999968254814764E-2,2.4999721261779628E-2,null,{"$f":"IF(S93=\".\",\".\",SUM($S93:S93))","v":584.55155447742072},{"$f":"IF(T93=\".\",\".\",SUM($S93:T93))","v":1190.4909222193583},{"$f":"IF(U93=\".\",\".\",SUM($S93:U93))","v":1823.7009222193574},{"$f":"IF(V93=\".\",\".\",SUM($S93:V93))","v":2485.4009222193581},{"$f":"IF(W93=\".\",\".\",SUM($S93:W93))","v":2869.560922219358},{"$f":"IF(X93=\".\",\".\",SUM($S93:X93))","v":3263.3209222193582},{"$f":"IF(Y93=\".\",\".\",SUM($S93:Y93))","v":3666.9209222193567},null,4.5381410583535287E-2,9.2423254926602194E-2,0.14158224317236923,0.19295304041534389,0.2227771381467345,0.25334652778311617,0.28467984162211346]
[null,null,"Business",{"$f":"IF('WK2 - Notional General Income'!D43=\"\",\"\",'WK2 - Notional General Income'!D43)","v":"Business D"},{"$f":"IF('WK2 - Notional General Income'!M43=\".\",\".\",'WK2 - Notional General Income'!M43/'WK2 - Notional General Income'!E43)","v":45880.975400238094},{"$f":"IF('WK3 - Notional GI Yr1 YIELD'!M43=\".\",\".\",'WK3 - Notional GI Yr1 YIELD'!M43/'WK3 - Notional GI Yr1 YIELD'!E43)","v":47687.100303928572},49833.01,52075.5,54418.9,55779.37,57173.86,58603.199999999997,null,null,{"$f":"'WK2 - Notional General Income'!$E43","v":42},{"$f":"'WK3 - Notional GI Yr1 YIELD'!$E43","v":42},null,null,1806.1249036904774,2145.9096960714305,2242.489999999998,2343.4000000000015,1360.4700000000012,1394.489999999998,1429.3399999999965,null,3.9365442603059853E-2,4.4999794124505499E-2,4.5000091304940204E-2,4.500004800722035E-2,2.4999954060078489E-2,2.5000103084706682E-2,2.4999886311681596E-2,null,{"$f":"IF(S94=\".\",\".\",SUM($S94:S94))","v":1806.1249036904774},{"$f":"IF(T94=\".\",\".\",SUM($S94:T94))","v":3952.0345997619079},{"$f":"IF(U94=\".\",\".\",SUM($S94:U94))","v":6194.5245997619058},{"$f":"IF(V94=\".\",\".\",SUM($S94:V94))","v":8537.9245997619073},{"$f":"IF(W94=\".\",\".\",SUM($S94:W94))","v":9898.3945997619085},{"$f":"IF(X94=\".\",\".\",SUM($S94:X94))","v":11292.884599761906},{"$f":"IF(Y94=\".\",\".\",SUM($S94:Y94))","v":12722.224599761903},null,3.9365442603059853E-2,8.6136673540323283E-2,0.13501292301928181,0.18608855904396493,0.21574071853124854,0.24613436181880521,0.27728757919335512]
[null,null,"Business",{"$f":"IF('WK2 - Notional General Income'!D44=\"\",\"\",'WK2 - Notional General Income'!D44)","v":"Town Centre Minor"},{"$f":"IF('WK2 - Notional General Income'!M44=\".\",\".\",'WK2 - Notional General Income'!M44/'WK2 - Notional General Income'!E44)","v":3469.6560489289404},{"$f":"IF('WK3 - Notional GI Yr1 YIELD'!M44=\".\",\".\",'WK3 - Notional GI Yr1 YIELD'!M44/'WK3 - Notional GI Yr1 YIELD'!E44)","v":3628.1522509702841},3791.41,3962.03,4140.32,4243.83,4349.92,4458.67,null,null,{"$f":"'WK2 - Notional General Income'!$E44","v":387},{"$f":"'WK3 - Notional GI Yr1 YIELD'!$E44","v":387},null,null,158.49620204134362,163.2577490297158,170.62000000000035,178.28999999999951,103.51000000000022,106.09000000000015,108.75,null,4.568066684600347E-2,4.4997491212243279E-2,4.5001727589472074E-2,4.4999659265578362E-2,2.5000483054449907E-2,2.4998645091815597E-2,2.5000459778570683E-2,null,{"$f":"IF(S95=\".\",\".\",SUM($S95:S95))","v":158.49620204134362},{"$f":"IF(T95=\".\",\".\",SUM($S95:T95))","v":321.75395107105942},{"$f":"IF(U95=\".\",\".\",SUM($S95:U95))","v":492.37395107105976},{"$f":"IF(V95=\".\",\".\",SUM($S95:V95))","v":670.66395107105927},{"$f":"IF(W95=\".\",\".\",SUM($S95:W95))","v":774.17395107105949},{"$f":"IF(X95=\".\",\".\",SUM($S95:X95))","v":880.26395107105964},{"$f":"IF(Y95=\".\",\".\",SUM($S95:Y95))","v":989.01395107105964},null,4.568066684600347E-2,9.2733673463219146E-2,0.14190857656425404,0.19329407342208715,0.22312700168365152,0.25370351950095782,0.28504668391449406]
[null,null,"Business",{"$f":"IF('WK2 - Notional General Income'!D45=\"\",\"\",'WK2 - Notional General Income'!D45)","v":""},{"$f":"IF('WK2 - Notional General Income'!M45=\".\",\".\",'WK2 - Notional General Income'!M45/'WK2 - Notional General Income'!E45)","v":"."},{"$f":"IF('WK3 - Notional GI Yr1 YIELD'!M45=\".\",\".\",'WK3 - Notional GI Yr1 YIELD'!M45/'WK3 - Notional GI Yr1 YIELD'!E45)","v":"."},null,null,null,null,null,null,null,null,{"$f":"'WK2 - Notional General Income'!$E45","v":0},{"$f":"'WK3 - Notional GI Yr1 YIELD'!$E45","v":0},null,null,".",".",".",".",".",".",".",null,".",".",".",".",".",".",".",null,{"$f":"IF(S96=\".\",\".\",SUM($S96:S96))","v":"."},{"$f":"IF(T96=\".\",\".\",SUM($S96:T96))","v":"."},{"$f":"IF(U96=\".\",\".\",SUM($S96:U96))","v":"."},{"$f":"IF(V96=\".\",\".\",SUM($S96:V96))","v":"."},{"$f":"IF(W96=\".\",\".\",SUM($S96:W96))","v":"."},{"$f":"IF(X96=\".\",\".\",SUM($S96:X96))","v":"."},{"$f":"IF(Y96=\".\",\".\",SUM($S96:Y96))","v":"."},null,".",".",".",".",".",".","."]
[null,null,"Business",{"$f":"IF('WK2 - Notional General Income'!D46=\"\",\"\",'WK2 - Notional General Income'!D46)","v":""},{"$f":"IF('WK2 - Notional General Income'!M46=\".\",\".\",'WK2 - Notional General Income'!M46/'WK2 - Notional General Income'!E46)","v":"."},{"$f":"IF('WK3 - Notional GI Yr1 YIELD'!M46=\".\",\".\",'WK3 - Notional GI Yr1 YIELD'!M46/'WK3 - Notional GI Yr1 YIELD'!E46)","v":"."},null,null,null,null,null,null,null,null,{"$f":"'WK2 - Notional General Income'!$E46","v":0},{"$f":"'WK3 - Notional GI Yr1 YIELD'!$E46","v":0},null,null,".",".",".",".",".",".",".",null,".",".",".",".",".",".",".",null,{"$f":"IF(S97=\".\",\".\",SUM($S97:S97))","v":"."},{"$f":"IF(T97=\".\",\".\",SUM($S97:T97))","v":"."},{"$f":"IF(U97=\".\",\".\",SUM($S97:U97))","v":"."},{"$f":"IF(V97=\".\",\".\",SUM($S97:V97))","v":"."},{"$f":"IF(W97=\".\",\".\",SUM($S97:W97))","v":"."},{"$f":"IF(X97=\".\",\".\",SUM($S97:X97))","v":"."},{"$f":"IF(Y97=\".\",\".\",SUM($S97:Y97))","v":"."},null,".",".",".",".",".",".","."]
[null,null,"Business",{"$f":"IF('WK2 - Notional General Income'!D47=\"\",\"\",'WK2 - Notional General Income'!D47)","v":""},{"$f":"IF('WK2 - Notional General Income'!M47=\".\",\".\",'WK2 - Notional General Income'!M47/'WK2 - Notional General Income'!E47)","v":"."},{"$f":"IF('WK3 - Notional GI Yr1 YIELD'!M47=\".\",\".\",'WK3 - Notional GI Yr1 YIELD'!M47/'WK3 - Notional GI Yr1 YIELD'!E47)","v":"."},null,null,null,null,null,null,null,null,{"$f":"'WK2 - Notional General Income'!$E47","v":0},{"$f":"'WK3 - Notional GI Yr1 YIELD'!$E47","v":0},null,null,".",".",".",".",".",".",".",null,".",".",".",".",".",".",".",null,{"$f":"IF(S98=\".\",\".\",SUM($S98:S98))","v":"."},{"$f":"IF(T98=\".\",\".\",SUM($S98:T98))","v":"."},{"$f":"IF(U98=\".\",\".\",SUM($S98:U98))","v":"."},{"$f":"IF(V98=\".\",\".\",SUM($S98:V98))","v":"."},{"$f":"IF(W98=\".\",\".\",SUM($S98:W98))","v":"."},{"$f":"IF(X98=\".\",\".\",SUM($S98:X98))","v":"."},{"$f":"IF(Y98=\".\",\".\",SUM($S98:Y98))","v":"."},null,".",".",".",".",".",".","."]
[null,null,"Business",{"$f":"IF('WK2 - Notional General Income'!D48=\"\",\"\",'WK2 - Notional General Income'!D48)","v":""},{"$f":"IF('WK2 - Notional General Income'!M48=\".\",\".\",'WK2 - Notional General Income'!M48/'WK2 - Notional General Income'!E48)","v":"."},{"$f":"IF('WK3 - Notional GI Yr1 YIELD'!M48=\".\",\".\",'WK3 - Notional GI Yr1 YIELD'!M48/'WK3 - Notional GI Yr1 YIELD'!E48)","v":"."},null,null,null,null,null,null,null,null,{"$f":"'WK2 - Notional General Income'!$E48","v":0},{"$f":"'WK3 - Notional GI Yr1 YIELD'!$E48","v":0},null,null,".",".",".",".",".",".",".",null,".",".",".",".",".",".",".",null,{"$f":"IF(S99=\".\",\".\",SUM($S99:S99))","v":"."},{"$f":"IF(T99=\".\",\".\",SUM($S99:T99))","v":"."},{"$f":"IF(U99=\".\",\".\",SUM($S99:U99))","v":"."},{"$f":"IF(V99=\".\",\".\",SUM($S99:V99))","v":"."},{"$f":"IF(W99=\".\",\".\",SUM($S99:W99))","v":"."},{"$f":"IF(X99=\".\",\".\",SUM($S99:X99))","v":"."},{"$f":"IF(Y99=\".\",\".\",SUM($S99:Y99))","v":"."},null,".",".",".",".",".",".","."]
[null,null,"Business",{"$f":"IF('WK2 - Notional General Income'!D49=\"\",\"\",'WK2 - Notional General Income'!D49)","v":""},{"$f":"IF('WK2 - Notional General Income'!M49=\".\",\".\",'WK2 - Notional General Income'!M49/'WK2 - Notional General Income'!E49)","v":"."},{"$f":"IF('WK3 - Notional GI Yr1 YIELD'!M49=\".\",\".\",'WK3 - Notional GI Yr1 YIELD'!M49/'WK3 - Notional GI Yr1 YIELD'!E49)","v":"."},null,null,null,null,null,null,null,null,{"$f":"'WK2 - Notional General Income'!$E49","v":0},{"$f":"'WK3 - Notional GI Yr1 YIELD'!$E49","v":0},null,null,".",".",".",".",".",".",".",null,".",".",".",".",".",".",".",null,{"$f":"IF(S100=\".\",\".\",SUM($S100:S100))","v":"."},{"$f":"IF(T100=\".\",\".\",SUM($S100:T100))","v":"."},{"$f":"IF(U100=\".\",\".\",SUM($S100:U100))","v":"."},{"$f":"IF(V100=\".\",\".\",SUM($S100:V100))","v":"."},{"$f":"IF(W100=\".\",\".\",SUM($S100:W100))","v":"."},{"$f":"IF(X100=\".\",\".\",SUM($S100:X100))","v":"."},{"$f":"IF(Y100=\".\",\".\",SUM($S100:Y100))","v":"."},null,".",".",".",".",".",".","."]
[null,null,"Business",{"$f":"IF('WK2 - Notional General Income'!D50=\"\",\"\",'WK2 - Notional General Income'!D50)","v":""},{"$f":"IF('WK2 - Notional General Income'!M50=\".\",\".\",'WK2 - Notional General Income'!M50/'WK2 - Notional General Income'!E50)","v":"."},{"$f":"IF('WK3 - Notional GI Yr1 YIELD'!M50=\".\",\".\",'WK3 - Notional GI Yr1 YIELD'!M50/'WK3 - Notional GI Yr1 YIELD'!E50)","v":"."},null,null,null,null,null,null,null,null,{"$f":"'WK2 - Notional General Income'!$E50","v":0},{"$f":"'WK3 - Notional GI Yr1 YIELD'!$E50","v":0},null,null,".",".",".",".",".",".",".",null,".",".",".",".",".",".",".",null,{"$f":"IF(S101=\".\",\".\",SUM($S101:S101))","v":"."},{"$f":"IF(T101=\".\",\".\",SUM($S101:T101))","v":"."},{"$f":"IF(U101=\".\",\".\",SUM($S101:U101))","v":"."},{"$f":"IF(V101=\".\",\".\",SUM($S101:V101))","v":"."},{"$f":"IF(W101=\".\",\".\",SUM($S101:W101))","v":"."},{"$f":"IF(X101=\".\",\".\",SUM($S101:X101))","v":"."},{"$f":"IF(Y101=\".\",\".\",SUM($S101:Y101))","v":"."},null,".",".",".",".",".",".","."]
[null,null,"Business",{"$f":"IF('WK2 - Notional General Income'!D51=\"\",\"\",'WK2 - Notional General Income'!D51)","v":""},{"$f":"IF('WK2 - Notional General Income'!M51=\".\",\".\",'WK2 - Notional General Income'!M51/'WK2 - Notional General Income'!E51)","v":"."},{"$f":"IF('WK3 - Notional GI Yr1 YIELD'!M51=\".\",\".\",'WK3 - Notional GI Yr1 YIELD'!M51/'WK3 - Notional GI Yr1 YIELD'!E51)","v":"."},null,null,null,null,null,null,null,null,{"$f":"'WK2 - Notional General Income'!$E51","v":0},{"$f":"'WK3 - Notional GI Yr1 YIELD'!$E51","v":0},null,null,".",".",".",".",".",".",".",null,".",".",".",".",".",".",".",null,{"$f":"IF(S102=\".\",\".\",SUM($S102:S102))","v":"."},{"$f":"IF(T102=\".\",\".\",SUM($S102:T102))","v":"."},{"$f":"IF(U102=\".\",\".\",SUM($S102:U102))","v":"."},{"$f":"IF(V102=\".\",\".\",SUM($S102:V102))","v":"."},{"$f":"IF(W102=\".\",\".\",SUM($S102:W102))","v":"."},{"$f":"IF(X102=\".\",\".\",SUM($S102:X102))","v":"."},{"$f":"IF(Y102=\".\",\".\",SUM($S102:Y102))","v":"."},null,".",".",".",".",".",".","."]
[null,null,"Business",{"$f":"IF('WK2 - Notional General Income'!D52=\"\",\"\",'WK2 - Notional General Income'!D52)","v":""},{"$f":"IF('WK2 - Notional General Income'!M52=\".\",\".\",'WK2 - Notional General Income'!M52/'WK2 - Notional General Income'!E52)","v":"."},{"$f":"IF('WK3 - Notional GI Yr1 YIELD'!M52=\".\",\".\",'WK3 - Notional GI Yr1 YIELD'!M52/'WK3 - Notional GI Yr1 YIELD'!E52)","v":"."},null,null,null,null,null,null,null,null,{"$f":"'WK2 - Notional General Income'!$E52","v":0},{"$f":"'WK3 - Notional GI Yr1 YIELD'!$E52","v":0},null,null,".",".",".",".",".",".",".",null,".",".",".",".",".",".",".",null,{"$f":"IF(S103=\".\",\".\",SUM($S103:S103))","v":"."},{"$f":"IF(T103=\".\",\".\",SUM($S103:T103))","v":"."},{"$f":"IF(U103=\".\",\".\",SUM($S103:U103))","v":"."},{"$f":"IF(V103=\".\",\".\",SUM($S103:V103))","v":"."},{"$f":"IF(W103=\".\",\".\",SUM($S103:W103))","v":"."},{"$f":"IF(X103=\".\",\".\",SUM($S103:X103))","v":"."},{"$f":"IF(Y103=\".\",\".\",SUM($S103:Y103))","v":"."},null,".",".",".",".",".",".","."]
[null,null,"Business",{"$f":"IF('WK2 - Notional General Income'!D53=\"\",\"\",'WK2 - Notional General Income'!D53)","v":""},{"$f":"IF('WK2 - Notional General Income'!M53=\".\",\".\",'WK2 - Notional General Income'!M53/'WK2 - Notional General Income'!E53)","v":"."},{"$f":"IF('WK3 - Notional GI Yr1 YIELD'!M53=\".\",\".\",'WK3 - Notional GI Yr1 YIELD'!M53/'WK3 - Notional GI Yr1 YIELD'!E53)","v":"."},null,null,null,null,null,null,null,null,{"$f":"'WK2 - Notional General Income'!$E53","v":0},{"$f":"'WK3 - Notional GI Yr1 YIELD'!$E53","v":0},null,null,".",".",".",".",".",".",".",null,".",".",".",".",".",".",".",null,{"$f":"IF(S104=\".\",\".\",SUM($S104:S104))","v":"."},{"$f":"IF(T104=\".\",\".\",SUM($S104:T104))","v":"."},{"$f":"IF(U104=\".\",\".\",SUM($S104:U104))","v":"."},{"$f":"IF(V104=\".\",\".\",SUM($S104:V104))","v":"."},{"$f":"IF(W104=\".\",\".\",SUM($S104:W104))","v":"."},{"$f":"IF(X104=\".\",\".\",SUM($S104:X104))","v":"."},{"$f":"IF(Y104=\".\",\".\",SUM($S104:Y104))","v":"."},null,".",".",".",".",".",".","."]
[null,null,"Business",{"$f":"IF('WK2 - Notional General Income'!D54=\"\",\"\",'WK2 - Notional General Income'!D54)","v":""},{"$f":"IF('WK2 - Notional General Income'!M54=\".\",\".\",'WK2 - Notional General Income'!M54/'WK2 - Notional General Income'!E54)","v":"."},{"$f":"IF('WK3 - Notional GI Yr1 YIELD'!M54=\".\",\".\",'WK3 - Notional GI Yr1 YIELD'!M54/'WK3 - Notional GI Yr1 YIELD'!E54)","v":"."},null,null,null,null,null,null,null,null,{"$f":"'WK2 - Notional General Income'!$E54","v":0},{"$f":"'WK3 - Notional GI Yr1 YIELD'!$E54","v":0},null,null,".",".",".",".",".",".",".",null,".",".",".",".",".",".",".",null,{"$f":"IF(S105=\".\",\".\",SUM($S105:S105))","v":"."},{"$f":"IF(T105=\".\",\".\",SUM($S105:T105))","v":"."},{"$f":"IF(U105=\".\",\".\",SUM($S105:U105))","v":"."},{"$f":"IF(V105=\".\",\".\",SUM($S105:V105))","v":"."},{"$f":"IF(W105=\".\",\".\",SUM($S105:W105))","v":"."},{"$f":"IF(X105=\".\",\".\",SUM($S105:X105))","v":"."},{"$f":"IF(Y105=\".\",\".\",SUM($S105:Y105))","v":"."},null,".",".",".",".",".",".","."]
[null,null,"Business",{"$f":"IF('WK2 - Notional General Income'!D55=\"\",\"\",'WK2 - Notional General Income'!D55)","v":""},{"$f":"IF('WK2 - Notional General Income'!M55=\".\",\".\",'WK2 - Notional General Income'!M55/'WK2 - Notional General Income'!E55)","v":"."},{"$f":"IF('WK3 - Notional GI Yr1 YIELD'!M55=\".\",\".\",'WK3 - Notional GI Yr1 YIELD'!M55/'WK3 - Notional GI Yr1 YIELD'!E55)","v":"."},null,null,null,null,null,null,null,null,{"$f":"'WK2 - Notional General Income'!$E55","v":0},{"$f":"'WK3 - Notional GI Yr1 YIELD'!$E55","v":0},null,null,".",".",".",".",".",".",".",null,".",".",".",".",".",".",".",null,{"$f":"IF(S106=\".\",\".\",SUM($S106:S106))","v":"."},{"$f":"IF(T106=\".\",\".\",SUM($S106:T106))","v":"."},{"$f":"IF(U106=\".\",\".\",SUM($S106:U106))","v":"."},{"$f":"IF(V106=\".\",\".\",SUM($S106:V106))","v":"."},{"$f":"IF(W106=\".\",\".\",SUM($S106:W106))","v":"."},{"$f":"IF(X106=\".\",\".\",SUM($S106:X106))","v":"."},{"$f":"IF(Y106=\".\",\".\",SUM($S106:Y106))","v":"."},null,".",".",".",".",".",".","."]
[null,null,"Business",{"$f":"IF('WK2 - Notional General Income'!D56=\"\",\"\",'WK2 - Notional General Income'!D56)","v":""},{"$f":"IF('WK2 - Notional General Income'!M56=\".\",\".\",'WK2 - Notional General Income'!M56/'WK2 - Notional General Income'!E56)","v":"."},{"$f":"IF('WK3 - Notional GI Yr1 YIELD'!M56=\".\",\".\",'WK3 - Notional GI Yr1 YIELD'!M56/'WK3 - Notional GI Yr1 YIELD'!E56)","v":"."},null,null,null,null,null,null,null,null,{"$f":"'WK2 - Notional General Income'!$E56","v":0},{"$f":"'WK3 - Notional GI Yr1 YIELD'!$E56","v":0},null,null,".",".",".",".",".",".",".",null,".",".",".",".",".",".",".",null,{"$f":"IF(S107=\".\",\".\",SUM($S107:S107))","v":"."},{"$f":"IF(T107=\".\",\".\",SUM($S107:T107))","v":"."},{"$f":"IF(U107=\".\",\".\",SUM($S107:U107))","v":"."},{"$f":"IF(V107=\".\",\".\",SUM($S107:V107))","v":"."},{"$f":"IF(W107=\".\",\".\",SUM($S107:W107))","v":"."},{"$f":"IF(X107=\".\",\".\",SUM($S107:X107))","v":"."},{"$f":"IF(Y107=\".\",\".\",SUM($S107:Y107))","v":"."},null,".",".",".",".",".",".","."]
[null,null,"Business",{"$f":"IF('WK2 - Notional General Income'!D57=\"\",\"\",'WK2 - Notional General Income'!D57)","v":""},{"$f":"IF('WK2 - Notional General Income'!M57=\".\",\".\",'WK2 - Notional General Income'!M57/'WK2 - Notional General Income'!E57)","v":"."},{"$f":"IF('WK3 - Notional GI Yr1 YIELD'!M57=\".\",\".\",'WK3 - Notional GI Yr1 YIELD'!M57/'WK3 - Notional GI Yr1 YIELD'!E57)","v":"."},null,null,null,null,null,null,null,null,{"$f":"'WK2 - Notional General Income'!$E57","v":0},{"$f":"'WK3 - Notional GI Yr1 YIELD'!$E57","v":0},null,null,".",".",".",".",".",".",".",null,".",".",".",".",".",".",".",null,{"$f":"IF(S108=\".\",\".\",SUM($S108:S108))","v":"."},{"$f":"IF(T108=\".\",\".\",SUM($S108:T108))","v":"."},{"$f":"IF(U108=\".\",\".\",SUM($S108:U108))","v":"."},{"$f":"IF(V108=\".\",\".\",SUM($S108:V108))","v":"."},{"$f":"IF(W108=\".\",\".\",SUM($S108:W108))","v":"."},{"$f":"IF(X108=\".\",\".\",SUM($S108:X108))","v":"."},{"$f":"IF(Y108=\".\",\".\",SUM($S108:Y108))","v":"."},null,".",".",".",".",".",".","."]
[null,null,"Business",{"$f":"IF('WK2 - Notional General Income'!D58=\"\",\"\",'WK2 - Notional General Income'!D58)","v":""},{"$f":"IF('WK2 - Notional General Income'!M58=\".\",\".\",'WK2 - Notional General Income'!M58/'WK2 - Notional General Income'!E58)","v":"."},{"$f":"IF('WK3 - Notional GI Yr1 YIELD'!M58=\".\",\".\",'WK3 - Notional GI Yr1 YIELD'!M58/'WK3 - Notional GI Yr1 YIELD'!E58)","v":"."},null,null,null,null,null,null,null,null,{"$f":"'WK2 - Notional General Income'!$E58","v":0},{"$f":"'WK3 - Notional GI Yr1 YIELD'!$E58","v":0},null,null,".",".",".",".",".",".",".",null,".",".",".",".",".",".",".",null,{"$f":"IF(S109=\".\",\".\",SUM($S109:S109))","v":"."},{"$f":"IF(T109=\".\",\".\",SUM($S109:T109))","v":"."},{"$f":"IF(U109=\".\",\".\",SUM($S109:U109))","v":"."},{"$f":"IF(V109=\".\",\".\",SUM($S109:V109))","v":"."},{"$f":"IF(W109=\".\",\".\",SUM($S109:W109))","v":"."},{"$f":"IF(X109=\".\",\".\",SUM($S109:X109))","v":"."},{"$f":"IF(Y109=\".\",\".\",SUM($S109:Y109))","v":"."},null,".",".",".",".",".",".","."]
[null,null,"Business",{"$f":"IF('WK2 - Notional General Income'!D59=\"\",\"\",'WK2 - Notional General Income'!D59)","v":""},{"$f":"IF('WK2 - Notional General Income'!M59=\".\",\".\",'WK2 - Notional General Income'!M59/'WK2 - Notional General Income'!E59)","v":"."},{"$f":"IF('WK3 - Notional GI Yr1 YIELD'!M59=\".\",\".\",'WK3 - Notional GI Yr1 YIELD'!M59/'WK3 - Notional GI Yr1 YIELD'!E59)","v":"."},null,null,null,null,null,null,null,null,{"$f":"'WK2 - Notional General Income'!$E59","v":0},{"$f":"'WK3 - Notional GI Yr1 YIELD'!$E59","v":0},null,null,".",".",".",".",".",".",".",null,".",".",".",".",".",".",".",null,{"$f":"IF(S110=\".\",\".\",SUM($S110:S110))","v":"."},{"$f":"IF(T110=\".\",\".\",SUM($S110:T110))","v":"."},{"$f":"IF(U110=\".\",\".\",SUM($S110:U110))","v":"."},{"$f":"IF(V110=\".\",\".\",SUM($S110:V110))","v":"."},{"$f":"IF(W110=\".\",\".\",SUM($S110:W110))","v":"."},{"$f":"IF(X110=\".\",\".\",SUM($S110:X110))","v":"."},{"$f":"IF(Y110=\".\",\".\",SUM($S110:Y110))","v":"."},null,".",".",".",".",".",".","."]
[null,null,"Business",{"$f":"IF('WK2 - Notional General Income'!D60=\"\",\"\",'WK2 - Notional General Income'!D60)","v":""},{"$f":"IF('WK2 - Notional General Income'!M60=\".\",\".\",'WK2 - Notional General Income'!M60/'WK2 - Notional General Income'!E60)","v":"."},{"$f":"IF('WK3 - Notional GI Yr1 YIELD'!M60=\".\",\".\",'WK3 - Notional GI Yr1 YIELD'!M60/'WK3 - Notional GI Yr1 YIELD'!E60)","v":"."},null,null,null,null,null,null,null,null,{"$f":"'WK2 - Notional General Income'!$E60","v":0},{"$f":"'WK3 - Notional GI Yr1 YIELD'!$E60","v":0},null,null,".",".",".",".",".",".",".",null,".",".",".",".",".",".",".",null,{"$f":"IF(S111=\".\",\".\",SUM($S111:S111))","v":"."},{"$f":"IF(T111=\".\",\".\",SUM($S111:T111))","v":"."},{"$f":"IF(U111=\".\",\".\",SUM($S111:U111))","v":"."},{"$f":"IF(V111=\".\",\".\",SUM($S111:V111))","v":"."},{"$f":"IF(W111=\".\",\".\",SUM($S111:W111))","v":"."},{"$f":"IF(X111=\".\",\".\",SUM($S111:X111))","v":"."},{"$f":"IF(Y111=\".\",\".\",SUM($S111:Y111))","v":"."},null,".",".",".",".",".",".","."]
[null,null,"Business",{"$f":"IF('WK2 - Notional General Income'!D61=\"\",\"\",'WK2 - Notional General Income'!D61)","v":""},{"$f":"IF('WK2 - Notional General Income'!M61=\".\",\".\",'WK2 - Notional General Income'!M61/'WK2 - Notional General Income'!E61)","v":"."},{"$f":"IF('WK3 - Notional GI Yr1 YIELD'!M61=\".\",\".\",'WK3 - Notional GI Yr1 YIELD'!M61/'WK3 - Notional GI Yr1 YIELD'!E61)","v":"."},null,null,null,null,null,null,null,null,{"$f":"'WK2 - Notional General Income'!$E61","v":0},{"$f":"'WK3 - Notional GI Yr1 YIELD'!$E61","v":0},null,null,".",".",".",".",".",".",".",null,".",".",".",".",".",".",".",null,{"$f":"IF(S112=\".\",\".\",SUM($S112:S112))","v":"."},{"$f":"IF(T112=\".\",\".\",SUM($S112:T112))","v":"."},{"$f":"IF(U112=\".\",\".\",SUM($S112:U112))","v":"."},{"$f":"IF(V112=\".\",\".\",SUM($S112:V112))","v":"."},{"$f":"IF(W112=\".\",\".\",SUM($S112:W112))","v":"."},{"$f":"IF(X112=\".\",\".\",SUM($S112:X112))","v":"."},{"$f":"IF(Y112=\".\",\".\",SUM($S112:Y112))","v":"."},null,".",".",".",".",".",".","."]
[null,null,"Business",{"$f":"IF('WK2 - Notional General Income'!D62=\"\",\"\",'WK2 - Notional General Income'!D62)","v":""},{"$f":"IF('WK2 - Notional General Income'!M62=\".\",\".\",'WK2 - Notional General Income'!M62/'WK2 - Notional General Income'!E62)","v":"."},{"$f":"IF('WK3 - Notional GI Yr1 YIELD'!M62=\".\",\".\",'WK3 - Notional GI Yr1 YIELD'!M62/'WK3 - Notional GI Yr1 YIELD'!E62)","v":"."},null,null,null,null,null,null,null,null,{"$f":"'WK2 - Notional General Income'!$E62","v":0},{"$f":"'WK3 - Notional GI Yr1 YIELD'!$E62","v":0},null,null,".",".",".",".",".",".",".",null,".",".",".",".",".",".",".",null,{"$f":"IF(S113=\".\",\".\",SUM($S113:S113))","v":"."},{"$f":"IF(T113=\".\",\".\",SUM($S113:T113))","v":"."},{"$f":"IF(U113=\".\",\".\",SUM($S113:U113))","v":"."},{"$f":"IF(V113=\".\",\".\",SUM($S113:V113))","v":"."},{"$f":"IF(W113=\".\",\".\",SUM($S113:W113))","v":"."},{"$f":"IF(X113=\".\",\".\",SUM($S113:X113))","v":"."},{"$f":"IF(Y113=\".\",\".\",SUM($S113:Y113))","v":"."},null,".",".",".",".",".",".","."]
[null,null,"Business",{"$f":"IF('WK2 - Notional General Income'!D63=\"\",\"\",'WK2 - Notional General Income'!D63)","v":""},{"$f":"IF('WK2 - Notional General Income'!M63=\".\",\".\",'WK2 - Notional General Income'!M63/'WK2 - Notional General Income'!E63)","v":"."},{"$f":"IF('WK3 - Notional GI Yr1 YIELD'!M63=\".\",\".\",'WK3 - Notional GI Yr1 YIELD'!M63/'WK3 - Notional GI Yr1 YIELD'!E63)","v":"."},null,null,null,null,null,null,null,null,{"$f":"'WK2 - Notional General Income'!$E63","v":0},{"$f":"'WK3 - Notional GI Yr1 YIELD'!$E63","v":0},null,null,".",".",".",".",".",".",".",null,".",".",".",".",".",".",".",null,{"$f":"IF(S114=\".\",\".\",SUM($S114:S114))","v":"."},{"$f":"IF(T114=\".\",\".\",SUM($S114:T114))","v":"."},{"$f":"IF(U114=\".\",\".\",SUM($S114:U114))","v":"."},{"$f":"IF(V114=\".\",\".\",SUM($S114:V114))","v":"."},{"$f":"IF(W114=\".\",\".\",SUM($S114:W114))","v":"."},{"$f":"IF(X114=\".\",\".\",SUM($S114:X114))","v":"."},{"$f":"IF(Y114=\".\",\".\",SUM($S114:Y114))","v":"."},null,".",".",".",".",".",".","."]
[null,null,"Business",{"$f":"IF('WK2 - Notional General Income'!D64=\"\",\"\",'WK2 - Notional General Income'!D64)","v":""},{"$f":"IF('WK2 - Notional General Income'!M64=\".\",\".\",'WK2 - Notional General Income'!M64/'WK2 - Notional General Income'!E64)","v":"."},{"$f":"IF('WK3 - Notional GI Yr1 YIELD'!M64=\".\",\".\",'WK3 - Notional GI Yr1 YIELD'!M64/'WK3 - Notional GI Yr1 YIELD'!E64)","v":"."},null,null,null,null,null,null,null,null,{"$f":"'WK2 - Notional General Income'!$E64","v":0},{"$f":"'WK3 - Notional GI Yr1 YIELD'!$E64","v":0},null,null,".",".",".",".",".",".",".",null,".",".",".",".",".",".",".",null,{"$f":"IF(S115=\".\",\".\",SUM($S115:S115))","v":"."},{"$f":"IF(T115=\".\",\".\",SUM($S115:T115))","v":"."},{"$f":"IF(U115=\".\",\".\",SUM($S115:U115))","v":"."},{"$f":"IF(V115=\".\",\".\",SUM($S115:V115))","v":"."},{"$f":"IF(W115=\".\",\".\",SUM($S115:W115))","v":"."},{"$f":"IF(X115=\".\",\".\",SUM($S115:X115))","v":"."},{"$f":"IF(Y115=\".\",\".\",SUM($S115:Y115))","v":"."},null,".",".",".",".",".",".","."]
[null,null,"Special rate",{"$f":"IF('WK2 - Notional General Income'!D104=\"\",\"\",'WK2 - Notional General Income'!D104)","v":"Not Applicable"},{"$f":"IF('WK2 - Notional General Income'!M104=\".\",\".\",'WK2 - Notional General Income'!M104/'WK2 - Notional General Income'!E104)","v":"."},{"$f":"IF('WK3 - Notional GI Yr1 YIELD'!M104=\".\",\".\",'WK3 - Notional GI Yr1 YIELD'!M104/'WK3 - Notional GI Yr1 YIELD'!E104)","v":"."},null,null,null,null,null,null,null,null,{"$f":"'WK2 - Notional General Income'!$E104","v":0},{"$f":"'WK3 - Notional GI Yr1 YIELD'!$E104","v":0},null,null,".",".",".",".",".",".",".",null,".",".",".",".",".",".",".",null,{"$f":"IF(S116=\".\",\".\",SUM($S116:S116))","v":"."},{"$f":"IF(T116=\".\",\".\",SUM($S116:T116))","v":"."},{"$f":"IF(U116=\".\",\".\",SUM($S116:U116))","v":"."},{"$f":"IF(V116=\".\",\".\",SUM($S116:V116))","v":"."},{"$f":"IF(W116=\".\",\".\",SUM($S116:W116))","v":"."},{"$f":"IF(X116=\".\",\".\",SUM($S116:X116))","v":"."},{"$f":"IF(Y116=\".\",\".\",SUM($S116:Y116))","v":"."},null,".",".",".",".",".",".","."]
[null,null,"Special rate",{"$f":"IF('WK2 - Notional General Income'!D105=\"\",\"\",'WK2 - Notional General Income'!D105)","v":""},{"$f":"IF('WK2 - Notional General Income'!M105=\".\",\".\",'WK2 - Notional General Income'!M105/'WK2 - Notional General Income'!E105)","v":"."},{"$f":"IF('WK3 - Notional GI Yr1 YIELD'!M105=\".\",\".\",'WK3 - Notional GI Yr1 YIELD'!M105/'WK3 - Notional GI Yr1 YIELD'!E105)","v":"."},null,null,null,null,null,null,null,null,{"$f":"'WK2 - Notional General Income'!$E105","v":0},{"$f":"'WK3 - Notional GI Yr1 YIELD'!$E105","v":0},null,null,".",".",".",".",".",".",".",null,".",".",".",".",".",".",".",null,{"$f":"IF(S117=\".\",\".\",SUM($S117:S117))","v":"."},{"$f":"IF(T117=\".\",\".\",SUM($S117:T117))","v":"."},{"$f":"IF(U117=\".\",\".\",SUM($S117:U117))","v":"."},{"$f":"IF(V117=\".\",\".\",SUM($S117:V117))","v":"."},{"$f":"IF(W117=\".\",\".\",SUM($S117:W117))","v":"."},{"$f":"IF(X117=\".\",\".\",SUM($S117:X117))","v":"."},{"$f":"IF(Y117=\".\",\".\",SUM($S117:Y117))","v":"."},null,".",".",".",".",".",".","."]
[null,null,"Special rate",{"$f":"IF('WK2 - Notional General Income'!D106=\"\",\"\",'WK2 - Notional General Income'!D106)","v":""},{"$f":"IF('WK2 - Notional General Income'!M106=\".\",\".\",'WK2 - Notional General Income'!M106/'WK2 - Notional General Income'!E106)","v":"."},{"$f":"IF('WK3 - Notional GI Yr1 YIELD'!M106=\".\",\".\",'WK3 - Notional GI Yr1 YIELD'!M106/'WK3 - Notional GI Yr1 YIELD'!E106)","v":"."},null,null,null,null,null,null,null,null,{"$f":"'WK2 - Notional General Income'!$E106","v":0},{"$f":"'WK3 - Notional GI Yr1 YIELD'!$E106","v":0},null,null,".",".",".",".",".",".",".",null,".",".",".",".",".",".",".",null,{"$f":"IF(S118=\".\",\".\",SUM($S118:S118))","v":"."},{"$f":"IF(T118=\".\",\".\",SUM($S118:T118))","v":"."},{"$f":"IF(U118=\".\",\".\",SUM($S118:U118))","v":"."},{"$f":"IF(V118=\".\",\".\",SUM($S118:V118))","v":"."},{"$f":"IF(W118=\".\",\".\",SUM($S118:W118))","v":"."},{"$f":"IF(X118=\".\",\".\",SUM($S118:X118))","v":"."},{"$f":"IF(Y118=\".\",\".\",SUM($S118:Y118))","v":"."},null,".",".",".",".",".",".","."]
[null,null,"Special rate",{"$f":"IF('WK2 - Notional General Income'!D107=\"\",\"\",'WK2 - Notional General Income'!D107)","v":""},{"$f":"IF('WK2 - Notional General Income'!M107=\".\",\".\",'WK2 - Notional General Income'!M107/'WK2 - Notional General Income'!E107)","v":"."},{"$f":"IF('WK3 - Notional GI Yr1 YIELD'!M107=\".\",\".\",'WK3 - Notional GI Yr1 YIELD'!M107/'WK3 - Notional GI Yr1 YIELD'!E107)","v":"."},null,null,null,null,null,null,null,null,{"$f":"'WK2 - Notional General Income'!$E107","v":0},{"$f":"'WK3 - Notional GI Yr1 YIELD'!$E107","v":0},null,null,".",".",".",".",".",".",".",null,".",".",".",".",".",".",".",null,{"$f":"IF(S119=\".\",\".\",SUM($S119:S119))","v":"."},{"$f":"IF(T119=\".\",\".\",SUM($S119:T119))","v":"."},{"$f":"IF(U119=\".\",\".\",SUM($S119:U119))","v":"."},{"$f":"IF(V119=\".\",\".\",SUM($S119:V119))","v":"."},{"$f":"IF(W119=\".\",\".\",SUM($S119:W119))","v":"."},{"$f":"IF(X119=\".\",\".\",SUM($S119:X119))","v":"."},{"$f":"IF(Y119=\".\",\".\",SUM($S119:Y119))","v":"."},null,".",".",".",".",".",".","."]
[null,null,"Special rate",{"$f":"IF('WK2 - Notional General Income'!D108=\"\",\"\",'WK2 - Notional General Income'!D108)","v":""},{"$f":"IF('WK2 - Notional General Income'!M108=\".\",\".\",'WK2 - Notional General Income'!M108/'WK2 - Notional General Income'!E108)","v":"."},{"$f":"IF('WK3 - Notional GI Yr1 YIELD'!M108=\".\",\".\",'WK3 - Notional GI Yr1 YIELD'!M108/'WK3 - Notional GI Yr1 YIELD'!E108)","v":"."},null,null,null,null,null,null,null,null,{"$f":"'WK2 - Notional General Income'!$E108","v":0},{"$f":"'WK3 - Notional GI Yr1 YIELD'!$E108","v":0},null,null,".",".",".",".",".",".",".",null,".",".",".",".",".",".",".",null,{"$f":"IF(S120=\".\",\".\",SUM($S120:S120))","v":"."},{"$f":"IF(T120=\".\",\".\",SUM($S120:T120))","v":"."},{"$f":"IF(U120=\".\",\".\",SUM($S120:U120))","v":"."},{"$f":"IF(V120=\".\",\".\",SUM($S120:V120))","v":"."},{"$f":"IF(W120=\".\",\".\",SUM($S120:W120))","v":"."},{"$f":"IF(X120=\".\",\".\",SUM($S120:X120))","v":"."},{"$f":"IF(Y120=\".\",\".\",SUM($S120:Y120))","v":"."},null,".",".",".",".",".",".","."]
[null,null,"Special rate",{"$f":"IF('WK2 - Notional General Income'!D109=\"\",\"\",'WK2 - Notional General Income'!D109)","v":""},{"$f":"IF('WK2 - Notional General Income'!M109=\".\",\".\",'WK2 - Notional General Income'!M109/'WK2 - Notional General Income'!E109)","v":"."},{"$f":"IF('WK3 - Notional GI Yr1 YIELD'!M109=\".\",\".\",'WK3 - Notional GI Yr1 YIELD'!M109/'WK3 - Notional GI Yr1 YIELD'!E109)","v":"."},null,null,null,null,null,null,null,null,{"$f":"'WK2 - Notional General Income'!$E109","v":0},{"$f":"'WK3 - Notional GI Yr1 YIELD'!$E109","v":0},null,null,".",".",".",".",".",".",".",null,".",".",".",".",".",".",".",null,{"$f":"IF(S121=\".\",\".\",SUM($S121:S121))","v":"."},{"$f":"IF(T121=\".\",\".\",SUM($S121:T121))","v":"."},{"$f":"IF(U121=\".\",\".\",SUM($S121:U121))","v":"."},{"$f":"IF(V121=\".\",\".\",SUM($S121:V121))","v":"."},{"$f":"IF(W121=\".\",\".\",SUM($S121:W121))","v":"."},{"$f":"IF(X121=\".\",\".\",SUM($S121:X121))","v":"."},{"$f":"IF(Y121=\".\",\".\",SUM($S121:Y121))","v":"."},null,".",".",".",".",".",".","."]
[null,null,"Special rate",{"$f":"IF('WK2 - Notional General Income'!D110=\"\",\"\",'WK2 - Notional General Income'!D110)","v":""},{"$f":"IF('WK2 - Notional General Income'!M110=\".\",\".\",'WK2 - Notional General Income'!M110/'WK2 - Notional General Income'!E110)","v":"."},{"$f":"IF('WK3 - Notional GI Yr1 YIELD'!M110=\".\",\".\",'WK3 - Notional GI Yr1 YIELD'!M110/'WK3 - Notional GI Yr1 YIELD'!E110)","v":"."},null,null,null,null,null,null,null,null,{"$f":"'WK2 - Notional General Income'!$E110","v":0},{"$f":"'WK3 - Notional GI Yr1 YIELD'!$E110","v":0},null,null,".",".",".",".",".",".",".",null,".",".",".",".",".",".",".",null,{"$f":"IF(S122=\".\",\".\",SUM($S122:S122))","v":"."},{"$f":"IF(T122=\".\",\".\",SUM($S122:T122))","v":"."},{"$f":"IF(U122=\".\",\".\",SUM($S122:U122))","v":"."},{"$f":"IF(V122=\".\",\".\",SUM($S122:V122))","v":"."},{"$f":"IF(W122=\".\",\".\",SUM($S122:W122))","v":"."},{"$f":"IF(X122=\".\",\".\",SUM($S122:X122))","v":"."},{"$f":"IF(Y122=\".\",\".\",SUM($S122:Y122))","v":"."},null,".",".",".",".",".",".","."]
[null,null,"Special rate",{"$f":"IF('WK2 - Notional General Income'!D111=\"\",\"\",'WK2 - Notional General Income'!D111)","v":""},{"$f":"IF('WK2 - Notional General Income'!M111=\".\",\".\",'WK2 - Notional General Income'!M111/'WK2 - Notional General Income'!E111)","v":"."},{"$f":"IF('WK3 - Notional GI Yr1 YIELD'!M111=\".\",\".\",'WK3 - Notional GI Yr1 YIELD'!M111/'WK3 - Notional GI Yr1 YIELD'!E111)","v":"."},null,null,null,null,null,null,null,null,{"$f":"'WK2 - Notional General Income'!$E111","v":0},{"$f":"'WK3 - Notional GI Yr1 YIELD'!$E111","v":0},null,null,".",".",".",".",".",".",".",null,".",".",".",".",".",".",".",null,{"$f":"IF(S123=\".\",\".\",SUM($S123:S123))","v":"."},{"$f":"IF(T123=\".\",\".\",SUM($S123:T123))","v":"."},{"$f":"IF(U123=\".\",\".\",SUM($S123:U123))","v":"."},{"$f":"IF(V123=\".\",\".\",SUM($S123:V123))","v":"."},{"$f":"IF(W123=\".\",\".\",SUM($S123:W123))","v":"."},{"$f":"IF(X123=\".\",\".\",SUM($S123:X123))","v":"."},{"$f":"IF(Y123=\".\",\".\",SUM($S123:Y123))","v":"."},null,".",".",".",".",".",".","."]
[null,null,"Special rate",{"$f":"IF('WK2 - Notional General Income'!D112=\"\",\"\",'WK2 - Notional General Income'!D112)","v":""},{"$f":"IF('WK2 - Notional General Income'!M112=\".\",\".\",'WK2 - Notional General Income'!M112/'WK2 - Notional General Income'!E112)","v":"."},{"$f":"IF('WK3 - Notional GI Yr1 YIELD'!M112=\".\",\".\",'WK3 - Notional GI Yr1 YIELD'!M112/'WK3 - Notional GI Yr1 YIELD'!E112)","v":"."},null,null,null,null,null,null,null,null,{"$f":"'WK2 - Notional General Income'!$E112","v":0},{"$f":"'WK3 - Notional GI Yr1 YIELD'!$E112","v":0},null,null,".",{"$f":"IF(G124=\"\",\".\",G124-F124)","v":"."},{"$f":"IF(H124=\"\",\".\",H124-G124)","v":"."},{"$f":"IF(I124=\"\",\".\",I124-H124)","v":"."},{"$f":"IF(J124=\"\",\".\",J124-I124)","v":"."},{"$f":"IF(K124=\"\",\".\",K124-J124)","v":"."},{"$f":"IF(L124=\"\",\".\",L124-K124)","v":"."},null,{"$f":"IF(ISNUMBER(E124),F124/E124-1,\".\")","v":"."},{"$f":"IF(ISNUMBER(F124),G124/F124-1,\".\")","v":"."},{"$f":"IF(ISNUMBER(G124),H124/G124-1,\".\")","v":"."},{"$f":"IF(ISNUMBER(H124),I124/H124-1,\".\")","v":"."},{"$f":"IF(ISNUMBER(I124),J124/I124-1,\".\")","v":"."},{"$f":"IF(ISNUMBER(J124),K124/J124-1,\".\")","v":"."},{"$f":"IF(ISNUMBER(K124),L124/K124-1,\".\")","v":"."},null,{"$f":"IF(S124=\".\",\".\",SUM($S124:S124))","v":"."},{"$f":"IF(T124=\".\",\".\",SUM($S124:T124))","v":"."},{"$f":"IF(U124=\".\",\".\",SUM($S124:U124))","v":"."},{"$f":"IF(V124=\".\",\".\",SUM($S124:V124))","v":"."},{"$f":"IF(W124=\".\",\".\",SUM($S124:W124))","v":"."},{"$f":"IF(X124=\".\",\".\",SUM($S124:X124))","v":"."},{"$f":"IF(Y124=\".\",\".\",SUM($S124:Y124))","v":"."},null,{"$f":"IF(ISNUMBER($E124),F124/$E124-1,\".\")","v":"."},{"$f":"IF(ISNUMBER($E124),G124/$E124-1,\".\")","v":"."},{"$f":"IF(ISNUMBER($E124),H124/$E124-1,\".\")","v":"."},{"$f":"IF(ISNUMBER($E124),I124/$E124-1,\".\")","v":"."},{"$f":"IF(ISNUMBER($E124),J124/$E124-1,\".\")","v":"."},{"$f":"IF(ISNUMBER($E124),K124/$E124-1,\".\")","v":"."},{"$f":"IF(ISNUMBER($E124),L124/$E124-1,\".\")","v":"."}]
[null,null,"Special rate",{"$f":"IF('WK2 - Notional General Income'!D113=\"\",\"\",'WK2 - Notional General Income'!D113)","v":""},{"$f":"IF('WK2 - Notional General Income'!M113=\".\",\".\",'WK2 - Notional General Income'!M113/'WK2 - Notional General Income'!E113)","v":"."},{"$f":"IF('WK3 - Notional GI Yr1 YIELD'!M113=\".\",\".\",'WK3 - Notional GI Yr1 YIELD'!M113/'WK3 - Notional GI Yr1 YIELD'!E113)","v":"."},null,null,null,null,null,null,null,null,{"$f":"'WK2 - Notional General Income'!$E113","v":0},{"$f":"'WK3 - Notional GI Yr1 YIELD'!$E113","v":0},null,null,{"$f":"IF(F125=\".\",\".\",F125-E125)","v":"."},".",".",".",".",".",".",null,".",".",".",".",".",".",".",null,{"$f":"IF(S125=\".\",\".\",SUM($S125:S125))","v":"."},{"$f":"IF(T125=\".\",\".\",SUM($S125:T125))","v":"."},{"$f":"IF(U125=\".\",\".\",SUM($S125:U125))","v":"."},{"$f":"IF(V125=\".\",\".\",SUM($S125:V125))","v":"."},{"$f":"IF(W125=\".\",\".\",SUM($S125:W125))","v":"."},{"$f":"IF(X125=\".\",\".\",SUM($S125:X125))","v":"."},{"$f":"IF(Y125=\".\",\".\",SUM($S125:Y125))","v":"."},null,".",".",".",".",".",".","."]
[null,null,"Special rate",{"$f":"IF('WK2 - Notional General Income'!D114=\"\",\"\",'WK2 - Notional General Income'!D114)","v":""},{"$f":"IF('WK2 - Notional General Income'!M114=\".\",\".\",'WK2 - Notional General Income'!M114/'WK2 - Notional General Income'!E114)","v":"."},{"$f":"IF('WK3 - Notional GI Yr1 YIELD'!M114=\".\",\".\",'WK3 - Notional GI Yr1 YIELD'!M114/'WK3 - Notional GI Yr1 YIELD'!E114)","v":"."},null,null,null,null,null,null,null,null,{"$f":"'WK2 - Notional General Income'!$E114","v":0},{"$f":"'WK3 - Notional GI Yr1 YIELD'!$E114","v":0},null,null,".",".",".",".",".",".",".",null,".",".",".",".",".",".",".",null,{"$f":"IF(S126=\".\",\".\",SUM($S126:S126))","v":"."},{"$f":"IF(T126=\".\",\".\",SUM($S126:T126))","v":"."},{"$f":"IF(U126=\".\",\".\",SUM($S126:U126))","v":"."},{"$f":"IF(V126=\".\",\".\",SUM($S126:V126))","v":"."},{"$f":"IF(W126=\".\",\".\",SUM($S126:W126))","v":"."},{"$f":"IF(X126=\".\",\".\",SUM($S126:X126))","v":"."},{"$f":"IF(Y126=\".\",\".\",SUM($S126:Y126))","v":"."},null,".",".",".",".",".",".","."]
[null,null,"Special rate",{"$f":"IF('WK2 - Notional General Income'!D115=\"\",\"\",'WK2 - Notional General Income'!D115)","v":""},{"$f":"IF('WK2 - Notional General Income'!M115=\".\",\".\",'WK2 - Notional General Income'!M115/'WK2 - Notional General Income'!E115)","v":"."},{"$f":"IF('WK3 - Notional GI Yr1 YIELD'!M115=\".\",\".\",'WK3 - Notional GI Yr1 YIELD'!M115/'WK3 - Notional GI Yr1 YIELD'!E115)","v":"."},null,null,null,null,null,null,null,null,{"$f":"'WK2 - Notional General Income'!$E115","v":0},{"$f":"'WK3 - Notional GI Yr1 YIELD'!$E115","v":0},null,null,".",".",".",".",".",".",".",null,".",".",".",".",".",".",".",null,{"$f":"IF(S127=\".\",\".\",SUM($S127:S127))","v":"."},{"$f":"IF(T127=\".\",\".\",SUM($S127:T127))","v":"."},{"$f":"IF(U127=\".\",\".\",SUM($S127:U127))","v":"."},{"$f":"IF(V127=\".\",\".\",SUM($S127:V127))","v":"."},{"$f":"IF(W127=\".\",\".\",SUM($S127:W127))","v":"."},{"$f":"IF(X127=\".\",\".\",SUM($S127:X127))","v":"."},{"$f":"IF(Y127=\".\",\".\",SUM($S127:Y127))","v":"."},null,".",".",".",".",".",".","."]
[null,null,"Special rate",{"$f":"IF('WK2 - Notional General Income'!D116=\"\",\"\",'WK2 - Notional General Income'!D116)","v":""},{"$f":"IF('WK2 - Notional General Income'!M116=\".\",\".\",'WK2 - Notional General Income'!M116/'WK2 - Notional General Income'!E116)","v":"."},{"$f":"IF('WK3 - Notional GI Yr1 YIELD'!M116=\".\",\".\",'WK3 - Notional GI Yr1 YIELD'!M116/'WK3 - Notional GI Yr1 YIELD'!E116)","v":"."},null,null,null,null,null,null,null,null,{"$f":"'WK2 - Notional General Income'!$E116","v":0},{"$f":"'WK3 - Notional GI Yr1 YIELD'!$E116","v":0},null,null,".",".",".",".",".",".",".",null,".",".",".",".",".",".",".",null,{"$f":"IF(S128=\".\",\".\",SUM($S128:S128))","v":"."},{"$f":"IF(T128=\".\",\".\",SUM($S128:T128))","v":"."},{"$f":"IF(U128=\".\",\".\",SUM($S128:U128))","v":"."},{"$f":"IF(V128=\".\",\".\",SUM($S128:V128))","v":"."},{"$f":"IF(W128=\".\",\".\",SUM($S128:W128))","v":"."},{"$f":"IF(X128=\".\",\".\",SUM($S128:X128))","v":"."},{"$f":"IF(Y128=\".\",\".\",SUM($S128:Y128))","v":"."},null,".",".",".",".",".",".","."]
[null,null,"Special rate",{"$f":"IF('WK2 - Notional General Income'!D117=\"\",\"\",'WK2 - Notional General Income'!D117)","v":""},{"$f":"IF('WK2 - Notional General Income'!M117=\".\",\".\",'WK2 - Notional General Income'!M117/'WK2 - Notional General Income'!E117)","v":"."},{"$f":"IF('WK3 - Notional GI Yr1 YIELD'!M117=\".\",\".\",'WK3 - Notional GI Yr1 YIELD'!M117/'WK3 - Notional GI Yr1 YIELD'!E117)","v":"."},null,null,null,null,null,null,null,null,{"$f":"'WK2 - Notional General Income'!$E117","v":0},{"$f":"'WK3 - Notional GI Yr1 YIELD'!$E117","v":0},null,null,".",".",".",".",".",".",".",null,".",".",".",".",".",".",".",null,{"$f":"IF(S129=\".\",\".\",SUM($S129:S129))","v":"."},{"$f":"IF(T129=\".\",\".\",SUM($S129:T129))","v":"."},{"$f":"IF(U129=\".\",\".\",SUM($S129:U129))","v":"."},{"$f":"IF(V129=\".\",\".\",SUM($S129:V129))","v":"."},{"$f":"IF(W129=\".\",\".\",SUM($S129:W129))","v":"."},{"$f":"IF(X129=\".\",\".\",SUM($S129:X129))","v":"."},{"$f":"IF(Y129=\".\",\".\",SUM($S129:Y129))","v":"."},null,".",".",".",".",".",".","."]
[null,null,"Special rate",{"$f":"IF('WK2 - Notional General Income'!D118=\"\",\"\",'WK2 - Notional General Income'!D118)","v":""},{"$f":"IF('WK2 - Notional General Income'!M118=\".\",\".\",'WK2 - Notional General Income'!M118/'WK2 - Notional General Income'!E118)","v":"."},{"$f":"IF('WK3 - Notional GI Yr1 YIELD'!M118=\".\",\".\",'WK3 - Notional GI Yr1 YIELD'!M118/'WK3 - Notional GI Yr1 YIELD'!E118)","v":"."},null,null,null,null,null,null,null,null,{"$f":"'WK2 - Notional General Income'!$E118","v":0},{"$f":"'WK3 - Notional GI Yr1 YIELD'!$E118","v":0},null,null,".",".",".",".",".",".",".",null,".",".",".",".",".",".",".",null,{"$f":"IF(S130=\".\",\".\",SUM($S130:S130))","v":"."},{"$f":"IF(T130=\".\",\".\",SUM($S130:T130))","v":"."},{"$f":"IF(U130=\".\",\".\",SUM($S130:U130))","v":"."},{"$f":"IF(V130=\".\",\".\",SUM($S130:V130))","v":"."},{"$f":"IF(W130=\".\",\".\",SUM($S130:W130))","v":"."},{"$f":"IF(X130=\".\",\".\",SUM($S130:X130))","v":"."},{"$f":"IF(Y130=\".\",\".\",SUM($S130:Y130))","v":"."},null,".",".",".",".",".",".","."]
[null,null,"Special rate",{"$f":"IF('WK2 - Notional General Income'!D119=\"\",\"\",'WK2 - Notional General Income'!D119)","v":""},{"$f":"IF('WK2 - Notional General Income'!M119=\".\",\".\",'WK2 - Notional General Income'!M119/'WK2 - Notional General Income'!E119)","v":"."},{"$f":"IF('WK3 - Notional GI Yr1 YIELD'!M119=\".\",\".\",'WK3 - Notional GI Yr1 YIELD'!M119/'WK3 - Notional GI Yr1 YIELD'!E119)","v":"."},null,null,null,null,null,null,null,null,{"$f":"'WK2 - Notional General Income'!$E119","v":0},{"$f":"'WK3 - Notional GI Yr1 YIELD'!$E119","v":0},null,null,".",".",".",".",".",".",".",null,".",".",".",".",".",".",".",null,{"$f":"IF(S131=\".\",\".\",SUM($S131:S131))","v":"."},{"$f":"IF(T131=\".\",\".\",SUM($S131:T131))","v":"."},{"$f":"IF(U131=\".\",\".\",SUM($S131:U131))","v":"."},{"$f":"IF(V131=\".\",\".\",SUM($S131:V131))","v":"."},{"$f":"IF(W131=\".\",\".\",SUM($S131:W131))","v":"."},{"$f":"IF(X131=\".\",\".\",SUM($S131:X131))","v":"."},{"$f":"IF(Y131=\".\",\".\",SUM($S131:Y131))","v":"."},null,".",".",".",".",".",".","."]
[null,null,"Special rate",{"$f":"IF('WK2 - Notional General Income'!D120=\"\",\"\",'WK2 - Notional General Income'!D120)","v":""},{"$f":"IF('WK2 - Notional General Income'!M120=\".\",\".\",'WK2 - Notional General Income'!M120/'WK2 - Notional General Income'!E120)","v":"."},{"$f":"IF('WK3 - Notional GI Yr1 YIELD'!M120=\".\",\".\",'WK3 - Notional GI Yr1 YIELD'!M120/'WK3 - Notional GI Yr1 YIELD'!E120)","v":"."},null,null,null,null,null,null,null,null,{"$f":"'WK2 - Notional General Income'!$E120","v":0},{"$f":"'WK3 - Notional GI Yr1 YIELD'!$E120","v":0},null,null,".",".",".",".",".",".",".",null,".",".",".",".",".",".",".",null,{"$f":"IF(S132=\".\",\".\",SUM($S132:S132))","v":"."},{"$f":"IF(T132=\".\",\".\",SUM($S132:T132))","v":"."},{"$f":"IF(U132=\".\",\".\",SUM($S132:U132))","v":"."},{"$f":"IF(V132=\".\",\".\",SUM($S132:V132))","v":"."},{"$f":"IF(W132=\".\",\".\",SUM($S132:W132))","v":"."},{"$f":"IF(X132=\".\",\".\",SUM($S132:X132))","v":"."},{"$f":"IF(Y132=\".\",\".\",SUM($S132:Y132))","v":"."},null,".",".",".",".",".",".","."]
[null,null,"Special rate",{"$f":"IF('WK2 - Notional General Income'!D121=\"\",\"\",'WK2 - Notional General Income'!D121)","v":""},{"$f":"IF('WK2 - Notional General Income'!M121=\".\",\".\",'WK2 - Notional General Income'!M121/'WK2 - Notional General Income'!E121)","v":"."},{"$f":"IF('WK3 - Notional GI Yr1 YIELD'!M121=\".\",\".\",'WK3 - Notional GI Yr1 YIELD'!M121/'WK3 - Notional GI Yr1 YIELD'!E121)","v":"."},null,null,null,null,null,null,null,null,{"$f":"'WK2 - Notional General Income'!$E121","v":0},{"$f":"'WK3 - Notional GI Yr1 YIELD'!$E121","v":0},null,null,".",".",".",".",".",".",".",null,".",".",".",".",".",".",".",null,{"$f":"IF(S133=\".\",\".\",SUM($S133:S133))","v":"."},{"$f":"IF(T133=\".\",\".\",SUM($S133:T133))","v":"."},{"$f":"IF(U133=\".\",\".\",SUM($S133:U133))","v":"."},{"$f":"IF(V133=\".\",\".\",SUM($S133:V133))","v":"."},{"$f":"IF(W133=\".\",\".\",SUM($S133:W133))","v":"."},{"$f":"IF(X133=\".\",\".\",SUM($S133:X133))","v":"."},{"$f":"IF(Y133=\".\",\".\",SUM($S133:Y133))","v":"."},null,".",".",".",".",".",".","."]
[null,null,"Special rate",{"$f":"IF('WK2 - Notional General Income'!D122=\"\",\"\",'WK2 - Notional General Income'!D122)","v":""},{"$f":"IF('WK2 - Notional General Income'!M122=\".\",\".\",'WK2 - Notional General Income'!M122/'WK2 - Notional General Income'!E122)","v":"."},{"$f":"IF('WK3 - Notional GI Yr1 YIELD'!M122=\".\",\".\",'WK3 - Notional GI Yr1 YIELD'!M122/'WK3 - Notional GI Yr1 YIELD'!E122)","v":"."},null,null,null,null,null,null,null,null,{"$f":"'WK2 - Notional General Income'!$E122","v":0},{"$f":"'WK3 - Notional GI Yr1 YIELD'!$E122","v":0},null,null,".",".",".",".",".",".",".",null,".",".",".",".",".",".",".",null,{"$f":"IF(S134=\".\",\".\",SUM($S134:S134))","v":"."},{"$f":"IF(T134=\".\",\".\",SUM($S134:T134))","v":"."},{"$f":"IF(U134=\".\",\".\",SUM($S134:U134))","v":"."},{"$f":"IF(V134=\".\",\".\",SUM($S134:V134))","v":"."},{"$f":"IF(W134=\".\",\".\",SUM($S134:W134))","v":"."},{"$f":"IF(X134=\".\",\".\",SUM($S134:X134))","v":"."},{"$f":"IF(Y134=\".\",\".\",SUM($S134:Y134))","v":"."},null,".",".",".",".",".",".","."]
[null,null,"Special rate",{"$f":"IF('WK2 - Notional General Income'!D123=\"\",\"\",'WK2 - Notional General Income'!D123)","v":""},{"$f":"IF('WK2 - Notional General Income'!M123=\".\",\".\",'WK2 - Notional General Income'!M123/'WK2 - Notional General Income'!E123)","v":"."},{"$f":"IF('WK3 - Notional GI Yr1 YIELD'!M123=\".\",\".\",'WK3 - Notional GI Yr1 YIELD'!M123/'WK3 - Notional GI Yr1 YIELD'!E123)","v":"."},null,null,null,null,null,null,null,null,{"$f":"'WK2 - Notional General Income'!$E123","v":0},{"$f":"'WK3 - Notional GI Yr1 YIELD'!$E123","v":0},null,null,".",".",".",".",".",".",".",null,".",".",".",".",".",".",".",null,{"$f":"IF(S135=\".\",\".\",SUM($S135:S135))","v":"."},{"$f":"IF(T135=\".\",\".\",SUM($S135:T135))","v":"."},{"$f":"IF(U135=\".\",\".\",SUM($S135:U135))","v":"."},{"$f":"IF(V135=\".\",\".\",SUM($S135:V135))","v":"."},{"$f":"IF(W135=\".\",\".\",SUM($S135:W135))","v":"."},{"$f":"IF(X135=\".\",\".\",SUM($S135:X135))","v":"."},{"$f":"IF(Y135=\".\",\".\",SUM($S135:Y135))","v":"."},null,".",".",".",".",".",".","."]
[null,null,null,"TOTAL AVERAGE",{"$f":"IF(SUM(E91:E135)=0,\".\",('WK2 - Notional General Income'!M65+SUM('WK2 - Notional General Income'!M104:M123))/'WK2 - Notional General Income'!E65)","v":5897.3917803657705},{"$f":"IF(SUM(F91:F135)=0,\".\",('WK3 - Notional GI Yr1 YIELD'!M65+SUM('WK3 - Notional GI Yr1 YIELD'!M104:M123))/'WK3 - Notional GI Yr1 YIELD'!E65)","v":6153.9974203649808},{"$f":"IF($P136=0,\".\",SUMPRODUCT(G91:G135,$P91:$P135)/$P136)","v":6430.9213774322307},6720.3168252120413,7022.7285402461348,7198.2982924496919,7378.2534446199907,7562.7108423415939,null,null,{"$f":"SUM(O91:O115)","v":962.07999999999993},{"$f":"SUM(P91:P115)","v":962.07999999999993},null,null,256.60563999921033,{"$f":"IF(G136=\".\",\".\",G136-F136)","v":276.92395706724983},289.39544777981064,302.4117150340935,175.56975220355707,179.95515217029879,184.45739772160323,null,4.3511716629295316E-2,4.4999036910682744E-2,4.5000619786050189E-2,4.49996217290769E-2,2.5000219102503385E-2,2.4999679765848937E-2,2.5000143883116888E-2,null,{"$f":"IF(S136=\".\",\".\",SUM($S136:S136))","v":256.60563999921033},{"$f":"IF(T136=\".\",\".\",SUM($S136:T136))","v":533.52959706646016},{"$f":"IF(U136=\".\",\".\",SUM($S136:U136))","v":822.92504484627079},{"$f":"IF(V136=\".\",\".\",SUM($S136:V136))","v":1125.3367598803643},{"$f":"IF(W136=\".\",\".\",SUM($S136:W136))","v":1300.9065120839214},{"$f":"IF(X136=\".\",\".\",SUM($S136:X136))","v":1480.8616642542202},{"$f":"IF(Y136=\".\",\".\",SUM($S136:Y136))","v":1665.3190619758234},null,4.3511716629295316E-2,9.0468738882626853E-2,0.13954050798965767,0.19081939979415252,0.22059014570051771,0.25110450846838162,0.28238230119290741]
[null,null,"Farmland",{"$f":"IF('WK2 - Notional General Income'!D66=\"\",\"\",'WK2 - Notional General Income'!D66)","v":"Not Applicable"},{"$f":"IF('WK2 - Notional General Income'!M66=\".\",\".\",'WK2 - Notional General Income'!M66/'WK2 - Notional General Income'!E66)","v":"."},{"$f":"IF('WK3 - Notional GI Yr1 YIELD'!M66=\".\",\".\",'WK3 - Notional GI Yr1 YIELD'!M66/'WK3 - Notional GI Yr1 YIELD'!E66)","v":"."},null,null,null,null,null,null,null,null,{"$f":"'WK2 - Notional General Income'!$E66","v":0},{"$f":"'WK3 - Notional GI Yr1 YIELD'!$E66","v":0},null,null,".",".",".",".",".",".",".",null,".",".",".",".",".",".",".",null,{"$f":"IF(S137=\".\",\".\",SUM($S137:S137))","v":"."},{"$f":"IF(T137=\".\",\".\",SUM($S137:T137))","v":"."},{"$f":"IF(U137=\".\",\".\",SUM($S137:U137))","v":"."},{"$f":"IF(V137=\".\",\".\",SUM($S137:V137))","v":"."},{"$f":"IF(W137=\".\",\".\",SUM($S137:W137))","v":"."},{"$f":"IF(X137=\".\",\".\",SUM($S137:X137))","v":"."},{"$f":"IF(Y137=\".\",\".\",SUM($S137:Y137))","v":"."},null,".",".",".",".",".",".","."]
[null,null,"Farmland",{"$f":"IF('WK2 - Notional General Income'!D67=\"\",\"\",'WK2 - Notional General Income'!D67)","v":""},{"$f":"IF('WK2 - Notional General Income'!M67=\".\",\".\",'WK2 - Notional General Income'!M67/'WK2 - Notional General Income'!E67)","v":"."},{"$f":"IF('WK3 - Notional GI Yr1 YIELD'!M67=\".\",\".\",'WK3 - Notional GI Yr1 YIELD'!M67/'WK3 - Notional GI Yr1 YIELD'!E67)","v":"."},null,null,null,null,null,null,null,null,{"$f":"'WK2 - Notional General Income'!$E67","v":0},{"$f":"'WK3 - Notional GI Yr1 YIELD'!$E67","v":0},null,null,".",".",".",".",".",".",".",null,".",".",".",".",".",".",".",null,{"$f":"IF(S138=\".\",\".\",SUM($S138:S138))","v":"."},{"$f":"IF(T138=\".\",\".\",SUM($S138:T138))","v":"."},{"$f":"IF(U138=\".\",\".\",SUM($S138:U138))","v":"."},{"$f":"IF(V138=\".\",\".\",SUM($S138:V138))","v":"."},{"$f":"IF(W138=\".\",\".\",SUM($S138:W138))","v":"."},{"$f":"IF(X138=\".\",\".\",SUM($S138:X138))","v":"."},{"$f":"IF(Y138=\".\",\".\",SUM($S138:Y138))","v":"."},null,".",".",".",".",".",".","."]
[null,null,"Farmland",{"$f":"IF('WK2 - Notional General Income'!D68=\"\",\"\",'WK2 - Notional General Income'!D68)","v":""},{"$f":"IF('WK2 - Notional General Income'!M68=\".\",\".\",'WK2 - Notional General Income'!M68/'WK2 - Notional General Income'!E68)","v":"."},{"$f":"IF('WK3 - Notional GI Yr1 YIELD'!M68=\".\",\".\",'WK3 - Notional GI Yr1 YIELD'!M68/'WK3 - Notional GI Yr1 YIELD'!E68)","v":"."},null,null,null,null,null,null,null,null,{"$f":"'WK2 - Notional General Income'!$E68","v":0},{"$f":"'WK3 - Notional GI Yr1 YIELD'!$E68","v":0},null,null,".",".",".",".",".",".",".",null,".",".",".",".",".",".",".",null,{"$f":"IF(S139=\".\",\".\",SUM($S139:S139))","v":"."},{"$f":"IF(T139=\".\",\".\",SUM($S139:T139))","v":"."},{"$f":"IF(U139=\".\",\".\",SUM($S139:U139))","v":"."},{"$f":"IF(V139=\".\",\".\",SUM($S139:V139))","v":"."},{"$f":"IF(W139=\".\",\".\",SUM($S139:W139))","v":"."},{"$f":"IF(X139=\".\",\".\",SUM($S139:X139))","v":"."},{"$f":"IF(Y139=\".\",\".\",SUM($S139:Y139))","v":"."},null,".",".",".",".",".",".","."]
[null,null,"Farmland",{"$f":"IF('WK2 - Notional General Income'!D69=\"\",\"\",'WK2 - Notional General Income'!D69)","v":""},{"$f":"IF('WK2 - Notional General Income'!M69=\".\",\".\",'WK2 - Notional General Income'!M69/'WK2 - Notional General Income'!E69)","v":"."},{"$f":"IF('WK3 - Notional GI Yr1 YIELD'!M69=\".\",\".\",'WK3 - Notional GI Yr1 YIELD'!M69/'WK3 - Notional GI Yr1 YIELD'!E69)","v":"."},null,null,null,null,null,null,null,null,{"$f":"'WK2 - Notional General Income'!$E69","v":0},{"$f":"'WK3 - Notional GI Yr1 YIELD'!$E69","v":0},null,null,".",".",".",".",".",".",".",null,".",".",".",".",".",".",".",null,{"$f":"IF(S140=\".\",\".\",SUM($S140:S140))","v":"."},{"$f":"IF(T140=\".\",\".\",SUM($S140:T140))","v":"."},{"$f":"IF(U140=\".\",\".\",SUM($S140:U140))","v":"."},{"$f":"IF(V140=\".\",\".\",SUM($S140:V140))","v":"."},{"$f":"IF(W140=\".\",\".\",SUM($S140:W140))","v":"."},{"$f":"IF(X140=\".\",\".\",SUM($S140:X140))","v":"."},{"$f":"IF(Y140=\".\",\".\",SUM($S140:Y140))","v":"."},null,".",".",".",".",".",".","."]
[null,null,"Farmland",{"$f":"IF('WK2 - Notional General Income'!D70=\"\",\"\",'WK2 - Notional General Income'!D70)","v":""},{"$f":"IF('WK2 - Notional General Income'!M70=\".\",\".\",'WK2 - Notional General Income'!M70/'WK2 - Notional General Income'!E70)","v":"."},{"$f":"IF('WK3 - Notional GI Yr1 YIELD'!M70=\".\",\".\",'WK3 - Notional GI Yr1 YIELD'!M70/'WK3 - Notional GI Yr1 YIELD'!E70)","v":"."},null,null,null,null,null,null,null,null,{"$f":"'WK2 - Notional General Income'!$E70","v":0},{"$f":"'WK3 - Notional GI Yr1 YIELD'!$E70","v":0},null,null,".",".",".",".",".",".",".",null,".",".",".",".",".",".",".",null,{"$f":"IF(S141=\".\",\".\",SUM($S141:S141))","v":"."},{"$f":"IF(T141=\".\",\".\",SUM($S141:T141))","v":"."},{"$f":"IF(U141=\".\",\".\",SUM($S141:U141))","v":"."},{"$f":"IF(V141=\".\",\".\",SUM($S141:V141))","v":"."},{"$f":"IF(W141=\".\",\".\",SUM($S141:W141))","v":"."},{"$f":"IF(X141=\".\",\".\",SUM($S141:X141))","v":"."},{"$f":"IF(Y141=\".\",\".\",SUM($S141:Y141))","v":"."},null,".",".",".",".",".",".","."]
[null,null,"Farmland",{"$f":"IF('WK2 - Notional General Income'!D71=\"\",\"\",'WK2 - Notional General Income'!D71)","v":""},{"$f":"IF('WK2 - Notional General Income'!M71=\".\",\".\",'WK2 - Notional General Income'!M71/'WK2 - Notional General Income'!E71)","v":"."},{"$f":"IF('WK3 - Notional GI Yr1 YIELD'!M71=\".\",\".\",'WK3 - Notional GI Yr1 YIELD'!M71/'WK3 - Notional GI Yr1 YIELD'!E71)","v":"."},null,null,null,null,null,null,null,null,{"$f":"'WK2 - Notional General Income'!$E71","v":0},{"$f":"'WK3 - Notional GI Yr1 YIELD'!$E71","v":0},null,null,".",".",".",".",".",".",".",null,".",".",".",".",".",".",".",null,{"$f":"IF(S142=\".\",\".\",SUM($S142:S142))","v":"."},{"$f":"IF(T142=\".\",\".\",SUM($S142:T142))","v":"."},{"$f":"IF(U142=\".\",\".\",SUM($S142:U142))","v":"."},{"$f":"IF(V142=\".\",\".\",SUM($S142:V142))","v":"."},{"$f":"IF(W142=\".\",\".\",SUM($S142:W142))","v":"."},{"$f":"IF(X142=\".\",\".\",SUM($S142:X142))","v":"."},{"$f":"IF(Y142=\".\",\".\",SUM($S142:Y142))","v":"."},null,".",".",".",".",".",".","."]
[null,null,"Farmland",{"$f":"IF('WK2 - Notional General Income'!D72=\"\",\"\",'WK2 - Notional General Income'!D72)","v":""},{"$f":"IF('WK2 - Notional General Income'!M72=\".\",\".\",'WK2 - Notional General Income'!M72/'WK2 - Notional General Income'!E72)","v":"."},{"$f":"IF('WK3 - Notional GI Yr1 YIELD'!M72=\".\",\".\",'WK3 - Notional GI Yr1 YIELD'!M72/'WK3 - Notional GI Yr1 YIELD'!E72)","v":"."},null,null,null,null,null,null,null,null,{"$f":"'WK2 - Notional General Income'!$E72","v":0},{"$f":"'WK3 - Notional GI Yr1 YIELD'!$E72","v":0},null,null,".",".",".",".",".",".",".",null,".",".",".",".",".",".",".",null,{"$f":"IF(S143=\".\",\".\",SUM($S143:S143))","v":"."},{"$f":"IF(T143=\".\",\".\",SUM($S143:T143))","v":"."},{"$f":"IF(U143=\".\",\".\",SUM($S143:U143))","v":"."},{"$f":"IF(V143=\".\",\".\",SUM($S143:V143))","v":"."},{"$f":"IF(W143=\".\",\".\",SUM($S143:W143))","v":"."},{"$f":"IF(X143=\".\",\".\",SUM($S143:X143))","v":"."},{"$f":"IF(Y143=\".\",\".\",SUM($S143:Y143))","v":"."},null,".",".",".",".",".",".","."]
[null,null,"Farmland",{"$f":"IF('WK2 - Notional General Income'!D73=\"\",\"\",'WK2 - Notional General Income'!D73)","v":""},{"$f":"IF('WK2 - Notional General Income'!M73=\".\",\".\",'WK2 - Notional General Income'!M73/'WK2 - Notional General Income'!E73)","v":"."},{"$f":"IF('WK3 - Notional GI Yr1 YIELD'!M73=\".\",\".\",'WK3 - Notional GI Yr1 YIELD'!M73/'WK3 - Notional GI Yr1 YIELD'!E73)","v":"."},null,null,null,null,null,null,null,null,{"$f":"'WK2 - Notional General Income'!$E73","v":0},{"$f":"'WK3 - Notional GI Yr1 YIELD'!$E73","v":0},null,null,".",".",".",".",".",".",".",null,".",".",".",".",".",".",".",null,{"$f":"IF(S144=\".\",\".\",SUM($S144:S144))","v":"."},{"$f":"IF(T144=\".\",\".\",SUM($S144:T144))","v":"."},{"$f":"IF(U144=\".\",\".\",SUM($S144:U144))","v":"."},{"$f":"IF(V144=\".\",\".\",SUM($S144:V144))","v":"."},{"$f":"IF(W144=\".\",\".\",SUM($S144:W144))","v":"."},{"$f":"IF(X144=\".\",\".\",SUM($S144:X144))","v":"."},{"$f":"IF(Y144=\".\",\".\",SUM($S144:Y144))","v":"."},null,".",".",".",".",".",".","."]
[null,null,"Farmland",{"$f":"IF('WK2 - Notional General Income'!D74=\"\",\"\",'WK2 - Notional General Income'!D74)","v":""},{"$f":"IF('WK2 - Notional General Income'!M74=\".\",\".\",'WK2 - Notional General Income'!M74/'WK2 - Notional General Income'!E74)","v":"."},{"$f":"IF('WK3 - Notional GI Yr1 YIELD'!M74=\".\",\".\",'WK3 - Notional GI Yr1 YIELD'!M74/'WK3 - Notional GI Yr1 YIELD'!E74)","v":"."},null,null,null,null,null,null,null,null,{"$f":"'WK2 - Notional General Income'!$E74","v":0},{"$f":"'WK3 - Notional GI Yr1 YIELD'!$E74","v":0},null,null,".",".",".",".",".",".",".",null,".",".",".",".",".",".",".",null,{"$f":"IF(S145=\".\",\".\",SUM($S145:S145))","v":"."},{"$f":"IF(T145=\".\",\".\",SUM($S145:T145))","v":"."},{"$f":"IF(U145=\".\",\".\",SUM($S145:U145))","v":"."},{"$f":"IF(V145=\".\",\".\",SUM($S145:V145))","v":"."},{"$f":"IF(W145=\".\",\".\",SUM($S145:W145))","v":"."},{"$f":"IF(X145=\".\",\".\",SUM($S145:X145))","v":"."},{"$f":"IF(Y145=\".\",\".\",SUM($S145:Y145))","v":"."},null,".",".",".",".",".",".","."]
[null,null,"Farmland",{"$f":"IF('WK2 - Notional General Income'!D75=\"\",\"\",'WK2 - Notional General Income'!D75)","v":""},{"$f":"IF('WK2 - Notional General Income'!M75=\".\",\".\",'WK2 - Notional General Income'!M75/'WK2 - Notional General Income'!E75)","v":"."},{"$f":"IF('WK3 - Notional GI Yr1 YIELD'!M75=\".\",\".\",'WK3 - Notional GI Yr1 YIELD'!M75/'WK3 - Notional GI Yr1 YIELD'!E75)","v":"."},null,null,null,null,null,null,null,null,{"$f":"'WK2 - Notional General Income'!$E75","v":0},{"$f":"'WK3 - Notional GI Yr1 YIELD'!$E75","v":0},null,null,".",".",".",".",".",".",".",null,".",".",".",".",".",".",".",null,{"$f":"IF(S146=\".\",\".\",SUM($S146:S146))","v":"."},{"$f":"IF(T146=\".\",\".\",SUM($S146:T146))","v":"."},{"$f":"IF(U146=\".\",\".\",SUM($S146:U146))","v":"."},{"$f":"IF(V146=\".\",\".\",SUM($S146:V146))","v":"."},{"$f":"IF(W146=\".\",\".\",SUM($S146:W146))","v":"."},{"$f":"IF(X146=\".\",\".\",SUM($S146:X146))","v":"."},{"$f":"IF(Y146=\".\",\".\",SUM($S146:Y146))","v":"."},null,".",".",".",".",".",".","."]
[null,null,"Special rate",{"$f":"IF('WK2 - Notional General Income'!D124=\"\",\"\",'WK2 - Notional General Income'!D124)","v":"Not Applicable"},{"$f":"IF('WK2 - Notional General Income'!M124=\".\",\".\",'WK2 - Notional General Income'!M124/'WK2 - Notional General Income'!E124)","v":"."},{"$f":"IF('WK3 - Notional GI Yr1 YIELD'!M124=\".\",\".\",'WK3 - Notional GI Yr1 YIELD'!M124/'WK3 - Notional GI Yr1 YIELD'!E124)","v":"."},null,null,null,null,null,null,null,null,{"$f":"'WK2 - Notional General Income'!$E124","v":0},{"$f":"'WK3 - Notional GI Yr1 YIELD'!$E124","v":0},null,null,".",".",".",".",".",".",".",null,".",".",".",".",".",".",".",null,{"$f":"IF(S147=\".\",\".\",SUM($S147:S147))","v":"."},{"$f":"IF(T147=\".\",\".\",SUM($S147:T147))","v":"."},{"$f":"IF(U147=\".\",\".\",SUM($S147:U147))","v":"."},{"$f":"IF(V147=\".\",\".\",SUM($S147:V147))","v":"."},{"$f":"IF(W147=\".\",\".\",SUM($S147:W147))","v":"."},{"$f":"IF(X147=\".\",\".\",SUM($S147:X147))","v":"."},{"$f":"IF(Y147=\".\",\".\",SUM($S147:Y147))","v":"."},null,".",".",".",".",".",".","."]
[null,null,"Special rate",{"$f":"IF('WK2 - Notional General Income'!D125=\"\",\"\",'WK2 - Notional General Income'!D125)","v":""},{"$f":"IF('WK2 - Notional General Income'!M125=\".\",\".\",'WK2 - Notional General Income'!M125/'WK2 - Notional General Income'!E125)","v":"."},{"$f":"IF('WK3 - Notional GI Yr1 YIELD'!M125=\".\",\".\",'WK3 - Notional GI Yr1 YIELD'!M125/'WK3 - Notional GI Yr1 YIELD'!E125)","v":"."},null,null,null,null,null,null,null,null,{"$f":"'WK2 - Notional General Income'!$E125","v":0},{"$f":"'WK3 - Notional GI Yr1 YIELD'!$E125","v":0},null,null,".",".",".",".",".",".",".",null,".",".",".",".",".",".",".",null,{"$f":"IF(S148=\".\",\".\",SUM($S148:S148))","v":"."},{"$f":"IF(T148=\".\",\".\",SUM($S148:T148))","v":"."},{"$f":"IF(U148=\".\",\".\",SUM($S148:U148))","v":"."},{"$f":"IF(V148=\".\",\".\",SUM($S148:V148))","v":"."},{"$f":"IF(W148=\".\",\".\",SUM($S148:W148))","v":"."},{"$f":"IF(X148=\".\",\".\",SUM($S148:X148))","v":"."},{"$f":"IF(Y148=\".\",\".\",SUM($S148:Y148))","v":"."},null,".",".",".",".",".",".","."]
[null,null,"Special rate",{"$f":"IF('WK2 - Notional General Income'!D126=\"\",\"\",'WK2 - Notional General Income'!D126)","v":""},{"$f":"IF('WK2 - Notional General Income'!M126=\".\",\".\",'WK2 - Notional General Income'!M126/'WK2 - Notional General Income'!E126)","v":"."},{"$f":"IF('WK3 - Notional GI Yr1 YIELD'!M126=\".\",\".\",'WK3 - Notional GI Yr1 YIELD'!M126/'WK3 - Notional GI Yr1 YIELD'!E126)","v":"."},null,null,null,null,null,null,null,null,{"$f":"'WK2 - Notional General Income'!$E126","v":0},{"$f":"'WK3 - Notional GI Yr1 YIELD'!$E126","v":0},null,null,".",".",".",".",".",".",".",null,".",".",".",".",".",".",".",null,{"$f":"IF(S149=\".\",\".\",SUM($S149:S149))","v":"."},{"$f":"IF(T149=\".\",\".\",SUM($S149:T149))","v":"."},{"$f":"IF(U149=\".\",\".\",SUM($S149:U149))","v":"."},{"$f":"IF(V149=\".\",\".\",SUM($S149:V149))","v":"."},{"$f":"IF(W149=\".\",\".\",SUM($S149:W149))","v":"."},{"$f":"IF(X149=\".\",\".\",SUM($S149:X149))","v":"."},{"$f":"IF(Y149=\".\",\".\",SUM($S149:Y149))","v":"."},null,".",".",".",".",".",".","."]
[null,null,"Special rate",{"$f":"IF('WK2 - Notional General Income'!D127=\"\",\"\",'WK2 - Notional General Income'!D127)","v":""},{"$f":"IF('WK2 - Notional General Income'!M127=\".\",\".\",'WK2 - Notional General Income'!M127/'WK2 - Notional General Income'!E127)","v":"."},{"$f":"IF('WK3 - Notional GI Yr1 YIELD'!M127=\".\",\".\",'WK3 - Notional GI Yr1 YIELD'!M127/'WK3 - Notional GI Yr1 YIELD'!E127)","v":"."},null,null,null,null,null,null,null,null,{"$f":"'WK2 - Notional General Income'!$E127","v":0},{"$f":"'WK3 - Notional GI Yr1 YIELD'!$E127","v":0},null,null,".",".",".",".",".",".",".",null,".",".",".",".",".",".",".",null,{"$f":"IF(S150=\".\",\".\",SUM($S150:S150))","v":"."},{"$f":"IF(T150=\".\",\".\",SUM($S150:T150))","v":"."},{"$f":"IF(U150=\".\",\".\",SUM($S150:U150))","v":"."},{"$f":"IF(V150=\".\",\".\",SUM($S150:V150))","v":"."},{"$f":"IF(W150=\".\",\".\",SUM($S150:W150))","v":"."},{"$f":"IF(X150=\".\",\".\",SUM($S150:X150))","v":"."},{"$f":"IF(Y150=\".\",\".\",SUM($S150:Y150))","v":"."},null,".",".",".",".",".",".","."]
[null,null,"Special rate",{"$f":"IF('WK2 - Notional General Income'!D128=\"\",\"\",'WK2 - Notional General Income'!D128)","v":""},{"$f":"IF('WK2 - Notional General Income'!M128=\".\",\".\",'WK2 - Notional General Income'!M128/'WK2 - Notional General Income'!E128)","v":"."},{"$f":"IF('WK3 - Notional GI Yr1 YIELD'!M128=\".\",\".\",'WK3 - Notional GI Yr1 YIELD'!M128/'WK3 - Notional GI Yr1 YIELD'!E128)","v":"."},null,null,null,null,null,null,null,null,{"$f":"'WK2 - Notional General Income'!$E128","v":0},{"$f":"'WK3 - Notional GI Yr1 YIELD'!$E128","v":0},null,null,".",".",".",".",".",".",".",null,".",".",".",".",".",".",".",null,{"$f":"IF(S151=\".\",\".\",SUM($S151:S151))","v":"."},{"$f":"IF(T151=\".\",\".\",SUM($S151:T151))","v":"."},{"$f":"IF(U151=\".\",\".\",SUM($S151:U151))","v":"."},{"$f":"IF(V151=\".\",\".\",SUM($S151:V151))","v":"."},{"$f":"IF(W151=\".\",\".\",SUM($S151:W151))","v":"."},{"$f":"IF(X151=\".\",\".\",SUM($S151:X151))","v":"."},{"$f":"IF(Y151=\".\",\".\",SUM($S151:Y151))","v":"."},null,".",".",".",".",".",".","."]
[null,null,"Special rate",{"$f":"IF('WK2 - Notional General Income'!D129=\"\",\"\",'WK2 - Notional General Income'!D129)","v":""},{"$f":"IF('WK2 - Notional General Income'!M129=\".\",\".\",'WK2 - Notional General Income'!M129/'WK2 - Notional General Income'!E129)","v":"."},{"$f":"IF('WK3 - Notional GI Yr1 YIELD'!M129=\".\",\".\",'WK3 - Notional GI Yr1 YIELD'!M129/'WK3 - Notional GI Yr1 YIELD'!E129)","v":"."},null,null,null,null,null,null,null,null,{"$f":"'WK2 - Notional General Income'!$E129","v":0},{"$f":"'WK3 - Notional GI Yr1 YIELD'!$E129","v":0},null,null,".",".",".",".",".",".",".",null,".",".",".",".",".",".",".",null,{"$f":"IF(S152=\".\",\".\",SUM($S152:S152))","v":"."},{"$f":"IF(T152=\".\",\".\",SUM($S152:T152))","v":"."},{"$f":"IF(U152=\".\",\".\",SUM($S152:U152))","v":"."},{"$f":"IF(V152=\".\",\".\",SUM($S152:V152))","v":"."},{"$f":"IF(W152=\".\",\".\",SUM($S152:W152))","v":"."},{"$f":"IF(X152=\".\",\".\",SUM($S152:X152))","v":"."},{"$f":"IF(Y152=\".\",\".\",SUM($S152:Y152))","v":"."},null,".",".",".",".",".",".","."]
[null,null,"Special rate",{"$f":"IF('WK2 - Notional General Income'!D130=\"\",\"\",'WK2 - Notional General Income'!D130)","v":""},{"$f":"IF('WK2 - Notional General Income'!M130=\".\",\".\",'WK2 - Notional General Income'!M130/'WK2 - Notional General Income'!E130)","v":"."},{"$f":"IF('WK3 - Notional GI Yr1 YIELD'!M130=\".\",\".\",'WK3 - Notional GI Yr1 YIELD'!M130/'WK3 - Notional GI Yr1 YIELD'!E130)","v":"."},null,null,null,null,null,null,null,null,{"$f":"'WK2 - Notional General Income'!$E130","v":0},{"$f":"'WK3 - Notional GI Yr1 YIELD'!$E130","v":0},null,null,".",".",".",".",".",".",".",null,".",".",".",".",".",".",".",null,{"$f":"IF(S153=\".\",\".\",SUM($S153:S153))","v":"."},{"$f":"IF(T153=\".\",\".\",SUM($S153:T153))","v":"."},{"$f":"IF(U153=\".\",\".\",SUM($S153:U153))","v":"."},{"$f":"IF(V153=\".\",\".\",SUM($S153:V153))","v":"."},{"$f":"IF(W153=\".\",\".\",SUM($S153:W153))","v":"."},{"$f":"IF(X153=\".\",\".\",SUM($S153:X153))","v":"."},{"$f":"IF(Y153=\".\",\".\",SUM($S153:Y153))","v":"."},null,".",".",".",".",".",".","."]
[null,null,"Special rate",{"$f":"IF('WK2 - Notional General Income'!D131=\"\",\"\",'WK2 - Notional General Income'!D131)","v":""},{"$f":"IF('WK2 - Notional General Income'!M131=\".\",\".\",'WK2 - Notional General Income'!M131/'WK2 - Notional General Income'!E131)","v":"."},{"$f":"IF('WK3 - Notional GI Yr1 YIELD'!M131=\".\",\".\",'WK3 - Notional GI Yr1 YIELD'!M131/'WK3 - Notional GI Yr1 YIELD'!E131)","v":"."},null,null,null,null,null,null,null,null,{"$f":"'WK2 - Notional General Income'!$E131","v":0},{"$f":"'WK3 - Notional GI Yr1 YIELD'!$E131","v":0},null,null,".",".",".",".",".",".",".",null,".",".",".",".",".",".",".",null,{"$f":"IF(S154=\".\",\".\",SUM($S154:S154))","v":"."},{"$f":"IF(T154=\".\",\".\",SUM($S154:T154))","v":"."},{"$f":"IF(U154=\".\",\".\",SUM($S154:U154))","v":"."},{"$f":"IF(V154=\".\",\".\",SUM($S154:V154))","v":"."},{"$f":"IF(W154=\".\",\".\",SUM($S154:W154))","v":"."},{"$f":"IF(X154=\".\",\".\",SUM($S154:X154))","v":"."},{"$f":"IF(Y154=\".\",\".\",SUM($S154:Y154))","v":"."},null,".",".",".",".",".",".","."]
[null,null,"Special rate",{"$f":"IF('WK2 - Notional General Income'!D132=\"\",\"\",'WK2 - Notional General Income'!D132)","v":""},{"$f":"IF('WK2 - Notional General Income'!M132=\".\",\".\",'WK2 - Notional General Income'!M132/'WK2 - Notional General Income'!E132)","v":"."},{"$f":"IF('WK3 - Notional GI Yr1 YIELD'!M132=\".\",\".\",'WK3 - Notional GI Yr1 YIELD'!M132/'WK3 - Notional GI Yr1 YIELD'!E132)","v":"."},null,null,null,null,null,null,null,null,{"$f":"'WK2 - Notional General Income'!$E132","v":0},{"$f":"'WK3 - Notional GI Yr1 YIELD'!$E132","v":0},null,null,".",".",".",".",".",".",".",null,".",".",".",".",".",".",".",null,{"$f":"IF(S155=\".\",\".\",SUM($S155:S155))","v":"."},{"$f":"IF(T155=\".\",\".\",SUM($S155:T155))","v":"."},{"$f":"IF(U155=\".\",\".\",SUM($S155:U155))","v":"."},{"$f":"IF(V155=\".\",\".\",SUM($S155:V155))","v":"."},{"$f":"IF(W155=\".\",\".\",SUM($S155:W155))","v":"."},{"$f":"IF(X155=\".\",\".\",SUM($S155:X155))","v":"."},{"$f":"IF(Y155=\".\",\".\",SUM($S155:Y155))","v":"."},null,".",".",".",".",".",".","."]
[null,null,"Special rate",{"$f":"IF('WK2 - Notional General Income'!D133=\"\",\"\",'WK2 - Notional General Income'!D133)","v":""},{"$f":"IF('WK2 - Notional General Income'!M133=\".\",\".\",'WK2 - Notional General Income'!M133/'WK2 - Notional General Income'!E133)","v":"."},{"$f":"IF('WK3 - Notional GI Yr1 YIELD'!M133=\".\",\".\",'WK3 - Notional GI Yr1 YIELD'!M133/'WK3 - Notional GI Yr1 YIELD'!E133)","v":"."},null,null,null,null,null,null,null,null,{"$f":"'WK2 - Notional General Income'!$E133","v":0},{"$f":"'WK3 - Notional GI Yr1 YIELD'!$E133","v":0},null,null,".",{"$f":"IF(G156=\"\",\".\",G156-F156)","v":"."},{"$f":"IF(H156=\"\",\".\",H156-G156)","v":"."},{"$f":"IF(I156=\"\",\".\",I156-H156)","v":"."},{"$f":"IF(J156=\"\",\".\",J156-I156)","v":"."},{"$f":"IF(K156=\"\",\".\",K156-J156)","v":"."},{"$f":"IF(L156=\"\",\".\",L156-K156)","v":"."},null,{"$f":"IF(ISNUMBER(E156),F156/E156-1,\".\")","v":"."},{"$f":"IF(ISNUMBER(F156),G156/F156-1,\".\")","v":"."},{"$f":"IF(ISNUMBER(G156),H156/G156-1,\".\")","v":"."},{"$f":"IF(ISNUMBER(H156),I156/H156-1,\".\")","v":"."},{"$f":"IF(ISNUMBER(I156),J156/I156-1,\".\")","v":"."},{"$f":"IF(ISNUMBER(J156),K156/J156-1,\".\")","v":"."},{"$f":"IF(ISNUMBER(K156),L156/K156-1,\".\")","v":"."},null,{"$f":"IF(S156=\".\",\".\",SUM($S156:S156))","v":"."},{"$f":"IF(T156=\".\",\".\",SUM($S156:T156))","v":"."},{"$f":"IF(U156=\".\",\".\",SUM($S156:U156))","v":"."},{"$f":"IF(V156=\".\",\".\",SUM($S156:V156))","v":"."},{"$f":"IF(W156=\".\",\".\",SUM($S156:W156))","v":"."},{"$f":"IF(X156=\".\",\".\",SUM($S156:X156))","v":"."},{"$f":"IF(Y156=\".\",\".\",SUM($S156:Y156))","v":"."},null,{"$f":"IF(ISNUMBER($E156),F156/$E156-1,\".\")","v":"."},{"$f":"IF(ISNUMBER($E156),G156/$E156-1,\".\")","v":"."},{"$f":"IF(ISNUMBER($E156),H156/$E156-1,\".\")","v":"."},{"$f":"IF(ISNUMBER($E156),I156/$E156-1,\".\")","v":"."},{"$f":"IF(ISNUMBER($E156),J156/$E156-1,\".\")","v":"."},{"$f":"IF(ISNUMBER($E156),K156/$E156-1,\".\")","v":"."},{"$f":"IF(ISNUMBER($E156),L156/$E156-1,\".\")","v":"."}]
[null,null,null,"TOTAL AVERAGE",{"$f":"IF(SUM(E137:E156)=0,\".\",('WK2 - Notional General Income'!M76+SUM('WK2 - Notional General Income'!M124:M127))/'WK2 - Notional General Income'!E76)","v":"."},{"$f":"IF(SUM(F137:F156)=0,\".\",('WK3 - Notional GI Yr1 YIELD'!M76+SUM('WK3 - Notional GI Yr1 YIELD'!M124:M133))/'WK3 - Notional GI Yr1 YIELD'!E76)","v":"."},{"$f":"IF($P157=0,\".\",SUMPRODUCT(G137:G156,$P137:$P156)/$P157)","v":"."},".",".",".",".",".",null,null,{"$f":"SUM(O137:O146)","v":0},{"$f":"SUM(P137:P146)","v":0},null,null,".",{"$f":"IF(G157=\".\",\".\",G157-F157)","v":"."},".",".",".",".",".",null,".",".",".",".",".",".",".",null,{"$f":"IF(S157=\".\",\".\",SUM($S157:S157))","v":"."},{"$f":"IF(T157=\".\",\".\",SUM($S157:T157))","v":"."},{"$f":"IF(U157=\".\",\".\",SUM($S157:U157))","v":"."},{"$f":"IF(V157=\".\",\".\",SUM($S157:V157))","v":"."},{"$f":"IF(W157=\".\",\".\",SUM($S157:W157))","v":"."},{"$f":"IF(X157=\".\",\".\",SUM($S157:X157))","v":"."},{"$f":"IF(Y157=\".\",\".\",SUM($S157:Y157))","v":"."},null,".",".",".",".",".",".","."]
[null,null,"Mining",{"$f":"IF('WK2 - Notional General Income'!D77=\"\",\"\",'WK2 - Notional General Income'!D77)","v":"Not Applicable"},{"$f":"IF('WK2 - Notional General Income'!M77=\".\",\".\",'WK2 - Notional General Income'!M77/'WK2 - Notional General Income'!E77)","v":"."},{"$f":"IF('WK3 - Notional GI Yr1 YIELD'!M77=\".\",\".\",'WK3 - Notional GI Yr1 YIELD'!M77/'WK3 - Notional GI Yr1 YIELD'!E77)","v":"."},null,null,null,null,null,null,null,null,{"$f":"'WK2 - Notional General Income'!$E77","v":0},{"$f":"'WK3 - Notional GI Yr1 YIELD'!$E77","v":0},null,null,".",".",".",".",".",".",".",null,".",".",".",".",".",".",".",null,{"$f":"IF(S158=\".\",\".\",SUM($S158:S158))","v":"."},{"$f":"IF(T158=\".\",\".\",SUM($S158:T158))","v":"."},{"$f":"IF(U158=\".\",\".\",SUM($S158:U158))","v":"."},{"$f":"IF(V158=\".\",\".\",SUM($S158:V158))","v":"."},{"$f":"IF(W158=\".\",\".\",SUM($S158:W158))","v":"."},{"$f":"IF(X158=\".\",\".\",SUM($S158:X158))","v":"."},{"$f":"IF(Y158=\".\",\".\",SUM($S158:Y158))","v":"."},null,".",".",".",".",".",".","."]
[null,null,"Mining",{"$f":"IF('WK2 - Notional General Income'!D78=\"\",\"\",'WK2 - Notional General Income'!D78)","v":""},{"$f":"IF('WK2 - Notional General Income'!M78=\".\",\".\",'WK2 - Notional General Income'!M78/'WK2 - Notional General Income'!E78)","v":"."},{"$f":"IF('WK3 - Notional GI Yr1 YIELD'!M78=\".\",\".\",'WK3 - Notional GI Yr1 YIELD'!M78/'WK3 - Notional GI Yr1 YIELD'!E78)","v":"."},null,null,null,null,null,null,null,null,{"$f":"'WK2 - Notional General Income'!$E78","v":0},{"$f":"'WK3 - Notional GI Yr1 YIELD'!$E78","v":0},null,null,".",".",".",".",".",".",".",null,".",".",".",".",".",".",".",null,{"$f":"IF(S159=\".\",\".\",SUM($S159:S159))","v":"."},{"$f":"IF(T159=\".\",\".\",SUM($S159:T159))","v":"."},{"$f":"IF(U159=\".\",\".\",SUM($S159:U159))","v":"."},{"$f":"IF(V159=\".\",\".\",SUM($S159:V159))","v":"."},{"$f":"IF(W159=\".\",\".\",SUM($S159:W159))","v":"."},{"$f":"IF(X159=\".\",\".\",SUM($S159:X159))","v":"."},{"$f":"IF(Y159=\".\",\".\",SUM($S159:Y159))","v":"."},null,".",".",".",".",".",".","."]
[null,null,"Mining",{"$f":"IF('WK2 - Notional General Income'!D79=\"\",\"\",'WK2 - Notional General Income'!D79)","v":""},{"$f":"IF('WK2 - Notional General Income'!M79=\".\",\".\",'WK2 - Notional General Income'!M79/'WK2 - Notional General Income'!E79)","v":"."},{"$f":"IF('WK3 - Notional GI Yr1 YIELD'!M79=\".\",\".\",'WK3 - Notional GI Yr1 YIELD'!M79/'WK3 - Notional GI Yr1 YIELD'!E79)","v":"."},null,null,null,null,null,null,null,null,{"$f":"'WK2 - Notional General Income'!$E79","v":0},{"$f":"'WK3 - Notional GI Yr1 YIELD'!$E79","v":0},null,null,".",".",".",".",".",".",".",null,".",".",".",".",".",".",".",null,{"$f":"IF(S160=\".\",\".\",SUM($S160:S160))","v":"."},{"$f":"IF(T160=\".\",\".\",SUM($S160:T160))","v":"."},{"$f":"IF(U160=\".\",\".\",SUM($S160:U160))","v":"."},{"$f":"IF(V160=\".\",\".\",SUM($S160:V160))","v":"."},{"$f":"IF(W160=\".\",\".\",SUM($S160:W160))","v":"."},{"$f":"IF(X160=\".\",\".\",SUM($S160:X160))","v":"."},{"$f":"IF(Y160=\".\",\".\",SUM($S160:Y160))","v":"."},null,".",".",".",".",".",".","."]
[null,null,"Mining",{"$f":"IF('WK2 - Notional General Income'!D80=\"\",\"\",'WK2 - Notional General Income'!D80)","v":""},{"$f":"IF('WK2 - Notional General Income'!M80=\".\",\".\",'WK2 - Notional General Income'!M80/'WK2 - Notional General Income'!E80)","v":"."},{"$f":"IF('WK3 - Notional GI Yr1 YIELD'!M80=\".\",\".\",'WK3 - Notional GI Yr1 YIELD'!M80/'WK3 - Notional GI Yr1 YIELD'!E80)","v":"."},null,null,null,null,null,null,null,null,{"$f":"'WK2 - Notional General Income'!$E80","v":0},{"$f":"'WK3 - Notional GI Yr1 YIELD'!$E80","v":0},null,null,".",".",".",".",".",".",".",null,".",".",".",".",".",".",".",null,{"$f":"IF(S161=\".\",\".\",SUM($S161:S161))","v":"."},{"$f":"IF(T161=\".\",\".\",SUM($S161:T161))","v":"."},{"$f":"IF(U161=\".\",\".\",SUM($S161:U161))","v":"."},{"$f":"IF(V161=\".\",\".\",SUM($S161:V161))","v":"."},{"$f":"IF(W161=\".\",\".\",SUM($S161:W161))","v":"."},{"$f":"IF(X161=\".\",\".\",SUM($S161:X161))","v":"."},{"$f":"IF(Y161=\".\",\".\",SUM($S161:Y161))","v":"."},null,".",".",".",".",".",".","."]
[null,null,"Mining",{"$f":"IF('WK2 - Notional General Income'!D81=\"\",\"\",'WK2 - Notional General Income'!D81)","v":""},{"$f":"IF('WK2 - Notional General Income'!M81=\".\",\".\",'WK2 - Notional General Income'!M81/'WK2 - Notional General Income'!E81)","v":"."},{"$f":"IF('WK3 - Notional GI Yr1 YIELD'!M81=\".\",\".\",'WK3 - Notional GI Yr1 YIELD'!M81/'WK3 - Notional GI Yr1 YIELD'!E81)","v":"."},null,null,null,null,null,null,null,null,{"$f":"'WK2 - Notional General Income'!$E81","v":0},{"$f":"'WK3 - Notional GI Yr1 YIELD'!$E81","v":0},null,null,".",".",".",".",".",".",".",null,".",".",".",".",".",".",".",null,{"$f":"IF(S162=\".\",\".\",SUM($S162:S162))","v":"."},{"$f":"IF(T162=\".\",\".\",SUM($S162:T162))","v":"."},{"$f":"IF(U162=\".\",\".\",SUM($S162:U162))","v":"."},{"$f":"IF(V162=\".\",\".\",SUM($S162:V162))","v":"."},{"$f":"IF(W162=\".\",\".\",SUM($S162:W162))","v":"."},{"$f":"IF(X162=\".\",\".\",SUM($S162:X162))","v":"."},{"$f":"IF(Y162=\".\",\".\",SUM($S162:Y162))","v":"."},null,".",".",".",".",".",".","."]
[null,null,"Mining",{"$f":"IF('WK2 - Notional General Income'!D82=\"\",\"\",'WK2 - Notional General Income'!D82)","v":""},{"$f":"IF('WK2 - Notional General Income'!M82=\".\",\".\",'WK2 - Notional General Income'!M82/'WK2 - Notional General Income'!E82)","v":"."},{"$f":"IF('WK3 - Notional GI Yr1 YIELD'!M82=\".\",\".\",'WK3 - Notional GI Yr1 YIELD'!M82/'WK3 - Notional GI Yr1 YIELD'!E82)","v":"."},null,null,null,null,null,null,null,null,{"$f":"'WK2 - Notional General Income'!$E82","v":0},{"$f":"'WK3 - Notional GI Yr1 YIELD'!$E82","v":0},null,null,".",".",".",".",".",".",".",null,".",".",".",".",".",".",".",null,{"$f":"IF(S163=\".\",\".\",SUM($S163:S163))","v":"."},{"$f":"IF(T163=\".\",\".\",SUM($S163:T163))","v":"."},{"$f":"IF(U163=\".\",\".\",SUM($S163:U163))","v":"."},{"$f":"IF(V163=\".\",\".\",SUM($S163:V163))","v":"."},{"$f":"IF(W163=\".\",\".\",SUM($S163:W163))","v":"."},{"$f":"IF(X163=\".\",\".\",SUM($S163:X163))","v":"."},{"$f":"IF(Y163=\".\",\".\",SUM($S163:Y163))","v":"."},null,".",".",".",".",".",".","."]
[null,null,"Mining",{"$f":"IF('WK2 - Notional General Income'!D83=\"\",\"\",'WK2 - Notional General Income'!D83)","v":""},{"$f":"IF('WK2 - Notional General Income'!M83=\".\",\".\",'WK2 - Notional General Income'!M83/'WK2 - Notional General Income'!E83)","v":"."},{"$f":"IF('WK3 - Notional GI Yr1 YIELD'!M83=\".\",\".\",'WK3 - Notional GI Yr1 YIELD'!M83/'WK3 - Notional GI Yr1 YIELD'!E83)","v":"."},null,null,null,null,null,null,null,null,{"$f":"'WK2 - Notional General Income'!$E83","v":0},{"$f":"'WK3 - Notional GI Yr1 YIELD'!$E83","v":0},null,null,".",".",".",".",".",".",".",null,".",".",".",".",".",".",".",null,{"$f":"IF(S164=\".\",\".\",SUM($S164:S164))","v":"."},{"$f":"IF(T164=\".\",\".\",SUM($S164:T164))","v":"."},{"$f":"IF(U164=\".\",\".\",SUM($S164:U164))","v":"."},{"$f":"IF(V164=\".\",\".\",SUM($S164:V164))","v":"."},{"$f":"IF(W164=\".\",\".\",SUM($S164:W164))","v":"."},{"$f":"IF(X164=\".\",\".\",SUM($S164:X164))","v":"."},{"$f":"IF(Y164=\".\",\".\",SUM($S164:Y164))","v":"."},null,".",".",".",".",".",".","."]
[null,null,"Mining",{"$f":"IF('WK2 - Notional General Income'!D84=\"\",\"\",'WK2 - Notional General Income'!D84)","v":""},{"$f":"IF('WK2 - Notional General Income'!M84=\".\",\".\",'WK2 - Notional General Income'!M84/'WK2 - Notional General Income'!E84)","v":"."},{"$f":"IF('WK3 - Notional GI Yr1 YIELD'!M84=\".\",\".\",'WK3 - Notional GI Yr1 YIELD'!M84/'WK3 - Notional GI Yr1 YIELD'!E84)","v":"."},null,null,null,null,null,null,null,null,{"$f":"'WK2 - Notional General Income'!$E84","v":0},{"$f":"'WK3 - Notional GI Yr1 YIELD'!$E84","v":0},null,null,".",".",".",".",".",".",".",null,".",".",".",".",".",".",".",null,{"$f":"IF(S165=\".\",\".\",SUM($S165:S165))","v":"."},{"$f":"IF(T165=\".\",\".\",SUM($S165:T165))","v":"."},{"$f":"IF(U165=\".\",\".\",SUM($S165:U165))","v":"."},{"$f":"IF(V165=\".\",\".\",SUM($S165:V165))","v":"."},{"$f":"IF(W165=\".\",\".\",SUM($S165:W165))","v":"."},{"$f":"IF(X165=\".\",\".\",SUM($S165:X165))","v":"."},{"$f":"IF(Y165=\".\",\".\",SUM($S165:Y165))","v":"."},null,".",".",".",".",".",".","."]
[null,null,"Mining",{"$f":"IF('WK2 - Notional General Income'!D85=\"\",\"\",'WK2 - Notional General Income'!D85)","v":""},{"$f":"IF('WK2 - Notional General Income'!M85=\".\",\".\",'WK2 - Notional General Income'!M85/'WK2 - Notional General Income'!E85)","v":"."},{"$f":"IF('WK3 - Notional GI Yr1 YIELD'!M85=\".\",\".\",'WK3 - Notional GI Yr1 YIELD'!M85/'WK3 - Notional GI Yr1 YIELD'!E85)","v":"."},null,null,null,null,null,null,null,null,{"$f":"'WK2 - Notional General Income'!$E85","v":0},{"$f":"'WK3 - Notional GI Yr1 YIELD'!$E85","v":0},null,null,".",".",".",".",".",".",".",null,".",".",".",".",".",".",".",null,{"$f":"IF(S166=\".\",\".\",SUM($S166:S166))","v":"."},{"$f":"IF(T166=\".\",\".\",SUM($S166:T166))","v":"."},{"$f":"IF(U166=\".\",\".\",SUM($S166:U166))","v":"."},{"$f":"IF(V166=\".\",\".\",SUM($S166:V166))","v":"."},{"$f":"IF(W166=\".\",\".\",SUM($S166:W166))","v":"."},{"$f":"IF(X166=\".\",\".\",SUM($S166:X166))","v":"."},{"$f":"IF(Y166=\".\",\".\",SUM($S166:Y166))","v":"."},null,".",".",".",".",".",".","."]
[null,null,"Mining",{"$f":"IF('WK2 - Notional General Income'!D86=\"\",\"\",'WK2 - Notional General Income'!D86)","v":""},{"$f":"IF('WK2 - Notional General Income'!M86=\".\",\".\",'WK2 - Notional General Income'!M86/'WK2 - Notional General Income'!E86)","v":"."},{"$f":"IF('WK3 - Notional GI Yr1 YIELD'!M86=\".\",\".\",'WK3 - Notional GI Yr1 YIELD'!M86/'WK3 - Notional GI Yr1 YIELD'!E86)","v":"."},null,null,null,null,null,null,null,null,{"$f":"'WK2 - Notional General Income'!$E86","v":0},{"$f":"'WK3 - Notional GI Yr1 YIELD'!$E86","v":0},null,null,".",".",".",".",".",".",".",null,".",".",".",".",".",".",".",null,{"$f":"IF(S167=\".\",\".\",SUM($S167:S167))","v":"."},{"$f":"IF(T167=\".\",\".\",SUM($S167:T167))","v":"."},{"$f":"IF(U167=\".\",\".\",SUM($S167:U167))","v":"."},{"$f":"IF(V167=\".\",\".\",SUM($S167:V167))","v":"."},{"$f":"IF(W167=\".\",\".\",SUM($S167:W167))","v":"."},{"$f":"IF(X167=\".\",\".\",SUM($S167:X167))","v":"."},{"$f":"IF(Y167=\".\",\".\",SUM($S167:Y167))","v":"."},null,".",".",".",".",".",".","."]
[null,null,"Special rate",{"$f":"IF('WK2 - Notional General Income'!D134=\"\",\"\",'WK2 - Notional General Income'!D134)","v":"Not Applicable"},{"$f":"IF('WK2 - Notional General Income'!M134=\".\",\".\",'WK2 - Notional General Income'!M134/'WK2 - Notional General Income'!E134)","v":"."},{"$f":"IF('WK3 - Notional GI Yr1 YIELD'!M134=\".\",\".\",'WK3 - Notional GI Yr1 YIELD'!M134/'WK3 - Notional GI Yr1 YIELD'!E134)","v":"."},null,null,null,null,null,null,null,null,{"$f":"'WK2 - Notional General Income'!$E134","v":0},{"$f":"'WK3 - Notional GI Yr1 YIELD'!$E134","v":0},null,null,".",".",".",".",".",".",".",null,".",".",".",".",".",".",".",null,{"$f":"IF(S168=\".\",\".\",SUM($S168:S168))","v":"."},{"$f":"IF(T168=\".\",\".\",SUM($S168:T168))","v":"."},{"$f":"IF(U168=\".\",\".\",SUM($S168:U168))","v":"."},{"$f":"IF(V168=\".\",\".\",SUM($S168:V168))","v":"."},{"$f":"IF(W168=\".\",\".\",SUM($S168:W168))","v":"."},{"$f":"IF(X168=\".\",\".\",SUM($S168:X168))","v":"."},{"$f":"IF(Y168=\".\",\".\",SUM($S168:Y168))","v":"."},null,".",".",".",".",".",".","."]
[null,null,"Special rate",{"$f":"IF('WK2 - Notional General Income'!D135=\"\",\"\",'WK2 - Notional General Income'!D135)","v":""},{"$f":"IF('WK2 - Notional General Income'!M135=\".\",\".\",'WK2 - Notional General Income'!M135/'WK2 - Notional General Income'!E135)","v":"."},{"$f":"IF('WK3 - Notional GI Yr1 YIELD'!M135=\".\",\".\",'WK3 - Notional GI Yr1 YIELD'!M135/'WK3 - Notional GI Yr1 YIELD'!E135)","v":"."},null,null,null,null,null,null,null,null,{"$f":"'WK2 - Notional General Income'!$E135","v":0},{"$f":"'WK3 - Notional GI Yr1 YIELD'!$E135","v":0},null,null,".",".",".",".",".",".",".",null,".",".",".",".",".",".",".",null,{"$f":"IF(S169=\".\",\".\",SUM($S169:S169))","v":"."},{"$f":"IF(T169=\".\",\".\",SUM($S169:T169))","v":"."},{"$f":"IF(U169=\".\",\".\",SUM($S169:U169))","v":"."},{"$f":"IF(V169=\".\",\".\",SUM($S169:V169))","v":"."},{"$f":"IF(W169=\".\",\".\",SUM($S169:W169))","v":"."},{"$f":"IF(X169=\".\",\".\",SUM($S169:X169))","v":"."},{"$f":"IF(Y169=\".\",\".\",SUM($S169:Y169))","v":"."},null,".",".",".",".",".",".","."]
[null,null,"Special rate",{"$f":"IF('WK2 - Notional General Income'!D136=\"\",\"\",'WK2 - Notional General Income'!D136)","v":""},{"$f":"IF('WK2 - Notional General Income'!M136=\".\",\".\",'WK2 - Notional General Income'!M136/'WK2 - Notional General Income'!E136)","v":"."},{"$f":"IF('WK3 - Notional GI Yr1 YIELD'!M136=\".\",\".\",'WK3 - Notional GI Yr1 YIELD'!M136/'WK3 - Notional GI Yr1 YIELD'!E136)","v":"."},null,null,null,null,null,null,null,null,{"$f":"'WK2 - Notional General Income'!$E136","v":0},{"$f":"'WK3 - Notional GI Yr1 YIELD'!$E136","v":0},null,null,".",".",".",".",".",".",".",null,".",".",".",".",".",".",".",null,{"$f":"IF(S170=\".\",\".\",SUM($S170:S170))","v":"."},{"$f":"IF(T170=\".\",\".\",SUM($S170:T170))","v":"."},{"$f":"IF(U170=\".\",\".\",SUM($S170:U170))","v":"."},{"$f":"IF(V170=\".\",\".\",SUM($S170:V170))","v":"."},{"$f":"IF(W170=\".\",\".\",SUM($S170:W170))","v":"."},{"$f":"IF(X170=\".\",\".\",SUM($S170:X170))","v":"."},{"$f":"IF(Y170=\".\",\".\",SUM($S170:Y170))","v":"."},null,".",".",".",".",".",".","."]
[null,null,"Special rate",{"$f":"IF('WK2 - Notional General Income'!D137=\"\",\"\",'WK2 - Notional General Income'!D137)","v":""},{"$f":"IF('WK2 - Notional General Income'!M137=\".\",\".\",'WK2 - Notional General Income'!M137/'WK2 - Notional General Income'!E137)","v":"."},{"$f":"IF('WK3 - Notional GI Yr1 YIELD'!M137=\".\",\".\",'WK3 - Notional GI Yr1 YIELD'!M137/'WK3 - Notional GI Yr1 YIELD'!E137)","v":"."},null,null,null,null,null,null,null,null,{"$f":"'WK2 - Notional General Income'!$E137","v":0},{"$f":"'WK3 - Notional GI Yr1 YIELD'!$E137","v":0},null,null,".",".",".",".",".",".",".",null,".",".",".",".",".",".",".",null,{"$f":"IF(S171=\".\",\".\",SUM($S171:S171))","v":"."},{"$f":"IF(T171=\".\",\".\",SUM($S171:T171))","v":"."},{"$f":"IF(U171=\".\",\".\",SUM($S171:U171))","v":"."},{"$f":"IF(V171=\".\",\".\",SUM($S171:V171))","v":"."},{"$f":"IF(W171=\".\",\".\",SUM($S171:W171))","v":"."},{"$f":"IF(X171=\".\",\".\",SUM($S171:X171))","v":"."},{"$f":"IF(Y171=\".\",\".\",SUM($S171:Y171))","v":"."},null,".",".",".",".",".",".","."]
[null,null,"Special rate",{"$f":"IF('WK2 - Notional General Income'!D138=\"\",\"\",'WK2 - Notional General Income'!D138)","v":""},{"$f":"IF('WK2 - Notional General Income'!M138=\".\",\".\",'WK2 - Notional General Income'!M138/'WK2 - Notional General Income'!E138)","v":"."},{"$f":"IF('WK3 - Notional GI Yr1 YIELD'!M138=\".\",\".\",'WK3 - Notional GI Yr1 YIELD'!M138/'WK3 - Notional GI Yr1 YIELD'!E138)","v":"."},null,null,null,null,null,null,null,null,{"$f":"'WK2 - Notional General Income'!$E138","v":0},{"$f":"'WK3 - Notional GI Yr1 YIELD'!$E138","v":0},null,null,".",".",".",".",".",".",".",null,".",".",".",".",".",".",".",null,{"$f":"IF(S172=\".\",\".\",SUM($S172:S172))","v":"."},{"$f":"IF(T172=\".\",\".\",SUM($S172:T172))","v":"."},{"$f":"IF(U172=\".\",\".\",SUM($S172:U172))","v":"."},{"$f":"IF(V172=\".\",\".\",SUM($S172:V172))","v":"."},{"$f":"IF(W172=\".\",\".\",SUM($S172:W172))","v":"."},{"$f":"IF(X172=\".\",\".\",SUM($S172:X172))","v":"."},{"$f":"IF(Y172=\".\",\".\",SUM($S172:Y172))","v":"."},null,".",".",".",".",".",".","."]
[null,null,"Special rate",{"$f":"IF('WK2 - Notional General Income'!D139=\"\",\"\",'WK2 - Notional General Income'!D139)","v":""},{"$f":"IF('WK2 - Notional General Income'!M139=\".\",\".\",'WK2 - Notional General Income'!M139/'WK2 - Notional General Income'!E139)","v":"."},{"$f":"IF('WK3 - Notional GI Yr1 YIELD'!M139=\".\",\".\",'WK3 - Notional GI Yr1 YIELD'!M139/'WK3 - Notional GI Yr1 YIELD'!E139)","v":"."},null,null,null,null,null,null,null,null,{"$f":"'WK2 - Notional General Income'!$E139","v":0},{"$f":"'WK3 - Notional GI Yr1 YIELD'!$E139","v":0},null,null,".",".",".",".",".",".",".",null,".",".",".",".",".",".",".",null,{"$f":"IF(S173=\".\",\".\",SUM($S173:S173))","v":"."},{"$f":"IF(T173=\".\",\".\",SUM($S173:T173))","v":"."},{"$f":"IF(U173=\".\",\".\",SUM($S173:U173))","v":"."},{"$f":"IF(V173=\".\",\".\",SUM($S173:V173))","v":"."},{"$f":"IF(W173=\".\",\".\",SUM($S173:W173))","v":"."},{"$f":"IF(X173=\".\",\".\",SUM($S173:X173))","v":"."},{"$f":"IF(Y173=\".\",\".\",SUM($S173:Y173))","v":"."},null,".",".",".",".",".",".","."]
[null,null,"Special rate",{"$f":"IF('WK2 - Notional General Income'!D140=\"\",\"\",'WK2 - Notional General Income'!D140)","v":""},{"$f":"IF('WK2 - Notional General Income'!M140=\".\",\".\",'WK2 - Notional General Income'!M140/'WK2 - Notional General Income'!E140)","v":"."},{"$f":"IF('WK3 - Notional GI Yr1 YIELD'!M140=\".\",\".\",'WK3 - Notional GI Yr1 YIELD'!M140/'WK3 - Notional GI Yr1 YIELD'!E140)","v":"."},null,null,null,null,null,null,null,null,{"$f":"'WK2 - Notional General Income'!$E140","v":0},{"$f":"'WK3 - Notional GI Yr1 YIELD'!$E140","v":0},null,null,".",".",".",".",".",".",".",null,".",".",".",".",".",".",".",null,{"$f":"IF(S174=\".\",\".\",SUM($S174:S174))","v":"."},{"$f":"IF(T174=\".\",\".\",SUM($S174:T174))","v":"."},{"$f":"IF(U174=\".\",\".\",SUM($S174:U174))","v":"."},{"$f":"IF(V174=\".\",\".\",SUM($S174:V174))","v":"."},{"$f":"IF(W174=\".\",\".\",SUM($S174:W174))","v":"."},{"$f":"IF(X174=\".\",\".\",SUM($S174:X174))","v":"."},{"$f":"IF(Y174=\".\",\".\",SUM($S174:Y174))","v":"."},null,".",".",".",".",".",".","."]
[null,null,"Special rate",{"$f":"IF('WK2 - Notional General Income'!D141=\"\",\"\",'WK2 - Notional General Income'!D141)","v":""},{"$f":"IF('WK2 - Notional General Income'!M141=\".\",\".\",'WK2 - Notional General Income'!M141/'WK2 - Notional General Income'!E141)","v":"."},{"$f":"IF('WK3 - Notional GI Yr1 YIELD'!M141=\".\",\".\",'WK3 - Notional GI Yr1 YIELD'!M141/'WK3 - Notional GI Yr1 YIELD'!E141)","v":"."},null,null,null,null,null,null,null,null,{"$f":"'WK2 - Notional General Income'!$E141","v":0},{"$f":"'WK3 - Notional GI Yr1 YIELD'!$E141","v":0},null,null,".",".",".",".",".",".",".",null,".",".",".",".",".",".",".",null,{"$f":"IF(S175=\".\",\".\",SUM($S175:S175))","v":"."},{"$f":"IF(T175=\".\",\".\",SUM($S175:T175))","v":"."},{"$f":"IF(U175=\".\",\".\",SUM($S175:U175))","v":"."},{"$f":"IF(V175=\".\",\".\",SUM($S175:V175))","v":"."},{"$f":"IF(W175=\".\",\".\",SUM($S175:W175))","v":"."},{"$f":"IF(X175=\".\",\".\",SUM($S175:X175))","v":"."},{"$f":"IF(Y175=\".\",\".\",SUM($S175:Y175))","v":"."},null,".",".",".",".",".",".","."]
[null,null,"Special rate",{"$f":"IF('WK2 - Notional General Income'!D142=\"\",\"\",'WK2 - Notional General Income'!D142)","v":""},{"$f":"IF('WK2 - Notional General Income'!M142=\".\",\".\",'WK2 - Notional General Income'!M142/'WK2 - Notional General Income'!E142)","v":"."},{"$f":"IF('WK3 - Notional GI Yr1 YIELD'!M142=\".\",\".\",'WK3 - Notional GI Yr1 YIELD'!M142/'WK3 - Notional GI Yr1 YIELD'!E142)","v":"."},null,null,null,null,null,null,null,null,{"$f":"'WK2 - Notional General Income'!$E142","v":0},{"$f":"'WK3 - Notional GI Yr1 YIELD'!$E142","v":0},null,null,".",".",".",".",".",".",".",null,".",".",".",".",".",".",".",null,{"$f":"IF(S176=\".\",\".\",SUM($S176:S176))","v":"."},{"$f":"IF(T176=\".\",\".\",SUM($S176:T176))","v":"."},{"$f":"IF(U176=\".\",\".\",SUM($S176:U176))","v":"."},{"$f":"IF(V176=\".\",\".\",SUM($S176:V176))","v":"."},{"$f":"IF(W176=\".\",\".\",SUM($S176:W176))","v":"."},{"$f":"IF(X176=\".\",\".\",SUM($S176:X176))","v":"."},{"$f":"IF(Y176=\".\",\".\",SUM($S176:Y176))","v":"."},null,".",".",".",".",".",".","."]
[null,null,"Special rate",{"$f":"IF('WK2 - Notional General Income'!D143=\"\",\"\",'WK2 - Notional General Income'!D143)","v":""},{"$f":"IF('WK2 - Notional General Income'!M143=\".\",\".\",'WK2 - Notional General Income'!M143/'WK2 - Notional General Income'!E143)","v":"."},{"$f":"IF('WK3 - Notional GI Yr1 YIELD'!M143=\".\",\".\",'WK3 - Notional GI Yr1 YIELD'!M143/'WK3 - Notional GI Yr1 YIELD'!E143)","v":"."},null,null,null,null,null,null,null,null,{"$f":"'WK2 - Notional General Income'!$E143","v":0},{"$f":"'WK3 - Notional GI Yr1 YIELD'!$E143","v":0},null,null,".",".",".",".",".",".",".",null,".",".",".",".",".",".",".",null,{"$f":"IF(S177=\".\",\".\",SUM($S177:S177))","v":"."},{"$f":"IF(T177=\".\",\".\",SUM($S177:T177))","v":"."},{"$f":"IF(U177=\".\",\".\",SUM($S177:U177))","v":"."},{"$f":"IF(V177=\".\",\".\",SUM($S177:V177))","v":"."},{"$f":"IF(W177=\".\",\".\",SUM($S177:W177))","v":"."},{"$f":"IF(X177=\".\",\".\",SUM($S177:X177))","v":"."},{"$f":"IF(Y177=\".\",\".\",SUM($S177:Y177))","v":"."},null,".",".",".",".",".",".","."]
[null,null,null,"TOTAL AVERAGE",{"$f":"IF(SUM(E158:E177)=0,\".\",('WK2 - Notional General Income'!M87+SUM('WK2 - Notional General Income'!M134:M143))/'WK2 - Notional General Income'!E87)","v":"."},{"$f":"IF(SUM(F158:F177)=0,\".\",('WK3 - Notional GI Yr1 YIELD'!M87+SUM('WK3 - Notional GI Yr1 YIELD'!M134:M143))/'WK3 - Notional GI Yr1 YIELD'!E87)","v":"."},{"$f":"IF($P178=0,\".\",SUMPRODUCT(G158:G177,$P158:$P177)/$P178)","v":"."},".",".",".",".",".",null,null,{"$f":"SUM(O158:O167)","v":0},{"$f":"SUM(P158:P167)","v":0},null,null,".",{"$f":"IF(G178=\".\",\".\",G178-F178)","v":"."},".",".",".",".",".",null,".",".",".",".",".",".",".",null,{"$f":"IF(S178=\".\",\".\",SUM($S178:S178))","v":"."},{"$f":"IF(T178=\".\",\".\",SUM($S178:T178))","v":"."},{"$f":"IF(U178=\".\",\".\",SUM($S178:U178))","v":"."},{"$f":"IF(V178=\".\",\".\",SUM($S178:V178))","v":"."},{"$f":"IF(W178=\".\",\".\",SUM($S178:W178))","v":"."},{"$f":"IF(X178=\".\",\".\",SUM($S178:X178))","v":"."},{"$f":"IF(Y178=\".\",\".\",SUM($S178:Y178))","v":"."},null,".",".",".",".",".",".","."]
[]
[]
[]
[null,null,"Average Ordinary and Special Rates - without proposed special variation (assumed rate peg only)",null,null,null,null,null,null,null,{"$f":"$H$21","v":"$ per year"},null,null,null,{"$f":"O58","v":"Number of Assessments"},null,null,null,{"$f":"S$21","v":"Annual increases (nominal $ per year)"},null,null,null,null,null,null,null,{"$f":"AA$21","v":"Annual increases (%)"},null,null,null,null,null,null,null,{"$f":"AI$21","v":"Cumulative increases (nominal $ per year)"},null,null,null,null,null,null,null,{"$f":"AQ$21","v":"Cumulative increases (%)"}]
[null,null,"Category","Sub-category or Special Rate name","Current Average Rate","Average\nRate\nYear 1","Average\nRate\nYear 2","Average\nRate\nYear 3","Average\nRate\nYear 4","Average\nRate\nYear 5","Average\nRate\nYear 6","Average\nRate\nYear 7",null,null,null,null,null,null,"Average Rates - without proposed special variation ",null,null,null,null,null,null,null,{"$f":"$S183","v":"Average Rates - without proposed special variation "},null,null,null,null,null,null,null,{"$f":"$S183","v":"Average Rates - without proposed special variation "},null,null,null,null,null,null,null,{"$f":"$S183","v":"Average Rates - without proposed special variation "}]
[null,null,null,null,{"$f":"E59","v":"2018-19"},"2019-20","2020-21","2021-22","2022-23","2023-24","2024-25","2025-26",null,null,{"$f":"O59","v":"2018-19"},"2019-20",null,null,{"$f":"S$23","v":"Year 1"},{"$f":"T$23","v":"Year 2"},"Year 3","Year 4","Year 5","Year 6","Year 7",null,{"$f":"AA$23","v":"Year 1"},"Year 2","Year 3","Year 4","Year 5","Year 6","Year 7",null,{"$f":"AI$23","v":"Year 1"},{"$f":"AJ$23","v":"Year 2"},"Year 3","Year 4","Year 5","Year 6","Year 7",null,{"$f":"AQ$23","v":"Year 1"},{"$f":"AR$23","v":"Year 2"},"Year 3","Year 4","Year 5","Year 6","Year 7"]
[null,null,{"$f":"C60","v":"Residential"},"Residential",1345.7780447712341,1379.42,1413.91,1449.26,1485.49,1522.62,1560.69,1599.71,null,null,10015.92,10015.92,null,null,{"$f":"IF(F185=\"\",\".\",F185-E185)","v":33.641955228765937},{"$f":"IF(G185=\"\",\".\",G185-F185)","v":34.490000000000009},{"$f":"IF(H185=\"\",\".\",H185-G185)","v":35.349999999999909},{"$f":"IF(I185=\"\",\".\",I185-H185)","v":36.230000000000018},{"$f":"IF(J185=\"\",\".\",J185-I185)","v":37.129999999999882},{"$f":"IF(K185=\"\",\".\",K185-J185)","v":38.070000000000164},{"$f":"IF(L185=\"\",\".\",L185-K185)","v":39.019999999999982},null,{"$f":"IF(ISNUMBER(E185),F185/E185-1,\".\")","v":2.4998145392158388E-2},{"$f":"IF(ISNUMBER(F185),G185/F185-1,\".\")","v":2.5003262240651969E-2},{"$f":"IF(ISNUMBER(G185),H185/G185-1,\".\")","v":2.5001591331838657E-2},{"$f":"IF(ISNUMBER(H185),I185/H185-1,\".\")","v":2.4998964989028982E-2},{"$f":"IF(ISNUMBER(I185),J185/I185-1,\".\")","v":2.4995119455533121E-2},{"$f":"IF(ISNUMBER(J185),K185/J185-1,\".\")","v":2.5002955432084306E-2},{"$f":"IF(ISNUMBER(K185),L185/K185-1,\".\")","v":2.5001762041148456E-2},null,{"$f":"IF(S185=\".\",\".\",SUM($S185:S185))","v":33.641955228765937},{"$f":"IF(T185=\".\",\".\",SUM($S185:T185))","v":68.131955228765946},{"$f":"IF(U185=\".\",\".\",SUM($S185:U185))","v":103.48195522876586},{"$f":"IF(V185=\".\",\".\",SUM($S185:V185))","v":139.71195522876587},{"$f":"IF(W185=\".\",\".\",SUM($S185:W185))","v":176.84195522876576},{"$f":"IF(X185=\".\",\".\",SUM($S185:X185))","v":214.91195522876592},{"$f":"IF(Y185=\".\",\".\",SUM($S185:Y185))","v":253.9319552287659},null,{"$f":"IF(ISNUMBER($E185),F185/$E185-1,\".\")","v":2.4998145392158388E-2},{"$f":"IF(ISNUMBER($E185),G185/$E185-1,\".\")","v":5.0626442817580219E-2},{"$f":"IF(ISNUMBER($E185),H185/$E185-1,\".\")","v":7.6893775783328788E-2},{"$f":"IF(ISNUMBER($E185),I185/$E185-1,\".\")","v":0.1038150055810394},{"$f":"IF(ISNUMBER($E185),J185/$E185-1,\".\")","v":0.13140499350234736},{"$f":"IF(ISNUMBER($E185),K185/$E185-1,\".\")","v":0.15969346213052416},{"$f":"IF(ISNUMBER($E185),L185/$E185-1,\".\")","v":0.18868784211138712}]
[null,null,"Residential","Town Centre",1257.2544383537024,1288.69,1320.9,1353.93,1387.77,1422.47,1458.03,1494.48,null,null,2782,2782,null,null,31.435561646297629,32.210000000000036,33.029999999999973,33.839999999999918,34.700000000000045,35.559999999999945,36.450000000000045,null,2.5003341159376191E-2,2.4994374131870334E-2,2.5005677946854377E-2,2.4993906627373663E-2,2.5004143337872931E-2,2.4998769745583349E-2,2.4999485607292149E-2,null,{"$f":"IF(S186=\".\",\".\",SUM($S186:S186))","v":31.435561646297629},{"$f":"IF(T186=\".\",\".\",SUM($S186:T186))","v":63.645561646297665},{"$f":"IF(U186=\".\",\".\",SUM($S186:U186))","v":96.675561646297638},{"$f":"IF(V186=\".\",\".\",SUM($S186:V186))","v":130.51556164629756},{"$f":"IF(W186=\".\",\".\",SUM($S186:W186))","v":165.2155616462976},{"$f":"IF(X186=\".\",\".\",SUM($S186:X186))","v":200.77556164629755},{"$f":"IF(Y186=\".\",\".\",SUM($S186:Y186))","v":237.22556164629759},null,2.5003341159376191E-2,5.0622658154730882E-2,7.6894189988216288E-2,0.10380998282034271,0.13140980584855777,0.15969365907286104,0.18868540401172096]
[null,null,"Residential","",".",null,null,null,null,null,null,null,null,null,0,0,null,null,".",".",".",".",".",".",".",null,".",".",".",".",".",".",".",null,{"$f":"IF(S187=\".\",\".\",SUM($S187:S187))","v":"."},{"$f":"IF(T187=\".\",\".\",SUM($S187:T187))","v":"."},{"$f":"IF(U187=\".\",\".\",SUM($S187:U187))","v":"."},{"$f":"IF(V187=\".\",\".\",SUM($S187:V187))","v":"."},{"$f":"IF(W187=\".\",\".\",SUM($S187:W187))","v":"."},{"$f":"IF(X187=\".\",\".\",SUM($S187:X187))","v":"."},{"$f":"IF(Y187=\".\",\".\",SUM($S187:Y187))","v":"."},null,".",".",".",".",".",".","."]
[null,null,"Residential","",".",null,null,null,null,null,null,null,null,null,0,0,null,null,".",".",".",".",".",".",".",null,".",".",".",".",".",".",".",null,{"$f":"IF(S188=\".\",\".\",SUM($S188:S188))","v":"."},{"$f":"IF(T188=\".\",\".\",SUM($S188:T188))","v":"."},{"$f":"IF(U188=\".\",\".\",SUM($S188:U188))","v":"."},{"$f":"IF(V188=\".\",\".\",SUM($S188:V188))","v":"."},{"$f":"IF(W188=\".\",\".\",SUM($S188:W188))","v":"."},{"$f":"IF(X188=\".\",\".\",SUM($S188:X188))","v":"."},{"$f":"IF(Y188=\".\",\".\",SUM($S188:Y188))","v":"."},null,".",".",".",".",".",".","."]
[null,null,"Residential","",".",null,null,null,null,null,null,null,null,null,0,0,null,null,".",".",".",".",".",".",".",null,".",".",".",".",".",".",".",null,{"$f":"IF(S189=\".\",\".\",SUM($S189:S189))","v":"."},{"$f":"IF(T189=\".\",\".\",SUM($S189:T189))","v":"."},{"$f":"IF(U189=\".\",\".\",SUM($S189:U189))","v":"."},{"$f":"IF(V189=\".\",\".\",SUM($S189:V189))","v":"."},{"$f":"IF(W189=\".\",\".\",SUM($S189:W189))","v":"."},{"$f":"IF(X189=\".\",\".\",SUM($S189:X189))","v":"."},{"$f":"IF(Y189=\".\",\".\",SUM($S189:Y189))","v":"."},null,".",".",".",".",".",".","."]
[null,null,"Residential","",".",null,null,null,null,null,null,null,null,null,0,0,null,null,".",".",".",".",".",".",".",null,".",".",".",".",".",".",".",null,{"$f":"IF(S190=\".\",\".\",SUM($S190:S190))","v":"."},{"$f":"IF(T190=\".\",\".\",SUM($S190:T190))","v":"."},{"$f":"IF(U190=\".\",\".\",SUM($S190:U190))","v":"."},{"$f":"IF(V190=\".\",\".\",SUM($S190:V190))","v":"."},{"$f":"IF(W190=\".\",\".\",SUM($S190:W190))","v":"."},{"$f":"IF(X190=\".\",\".\",SUM($S190:X190))","v":"."},{"$f":"IF(Y190=\".\",\".\",SUM($S190:Y190))","v":"."},null,".",".",".",".",".",".","."]
[null,null,"Residential","",".",null,null,null,null,null,null,null,null,null,0,0,null,null,".",".",".",".",".",".",".",null,".",".",".",".",".",".",".",null,{"$f":"IF(S191=\".\",\".\",SUM($S191:S191))","v":"."},{"$f":"IF(T191=\".\",\".\",SUM($S191:T191))","v":"."},{"$f":"IF(U191=\".\",\".\",SUM($S191:U191))","v":"."},{"$f":"IF(V191=\".\",\".\",SUM($S191:V191))","v":"."},{"$f":"IF(W191=\".\",\".\",SUM($S191:W191))","v":"."},{"$f":"IF(X191=\".\",\".\",SUM($S191:X191))","v":"."},{"$f":"IF(Y191=\".\",\".\",SUM($S191:Y191))","v":"."},null,".",".",".",".",".",".","."]
[null,null,"Residential","",".",null,null,null,null,null,null,null,null,null,0,0,null,null,".",".",".",".",".",".",".",null,".",".",".",".",".",".",".",null,{"$f":"IF(S192=\".\",\".\",SUM($S192:S192))","v":"."},{"$f":"IF(T192=\".\",\".\",SUM($S192:T192))","v":"."},{"$f":"IF(U192=\".\",\".\",SUM($S192:U192))","v":"."},{"$f":"IF(V192=\".\",\".\",SUM($S192:V192))","v":"."},{"$f":"IF(W192=\".\",\".\",SUM($S192:W192))","v":"."},{"$f":"IF(X192=\".\",\".\",SUM($S192:X192))","v":"."},{"$f":"IF(Y192=\".\",\".\",SUM($S192:Y192))","v":"."},null,".",".",".",".",".",".","."]
[null,null,"Residential","",".",null,null,null,null,null,null,null,null,null,0,0,null,null,".",".",".",".",".",".",".",null,".",".",".",".",".",".",".",null,{"$f":"IF(S193=\".\",\".\",SUM($S193:S193))","v":"."},{"$f":"IF(T193=\".\",\".\",SUM($S193:T193))","v":"."},{"$f":"IF(U193=\".\",\".\",SUM($S193:U193))","v":"."},{"$f":"IF(V193=\".\",\".\",SUM($S193:V193))","v":"."},{"$f":"IF(W193=\".\",\".\",SUM($S193:W193))","v":"."},{"$f":"IF(X193=\".\",\".\",SUM($S193:X193))","v":"."},{"$f":"IF(Y193=\".\",\".\",SUM($S193:Y193))","v":"."},null,".",".",".",".",".",".","."]
[null,null,"Residential","",".",null,null,null,null,null,null,null,null,null,0,0,null,null,".",".",".",".",".",".",".",null,".",".",".",".",".",".",".",null,{"$f":"IF(S194=\".\",\".\",SUM($S194:S194))","v":"."},{"$f":"IF(T194=\".\",\".\",SUM($S194:T194))","v":"."},{"$f":"IF(U194=\".\",\".\",SUM($S194:U194))","v":"."},{"$f":"IF(V194=\".\",\".\",SUM($S194:V194))","v":"."},{"$f":"IF(W194=\".\",\".\",SUM($S194:W194))","v":"."},{"$f":"IF(X194=\".\",\".\",SUM($S194:X194))","v":"."},{"$f":"IF(Y194=\".\",\".\",SUM($S194:Y194))","v":"."},null,".",".",".",".",".",".","."]
[null,null,"Residential","",".",null,null,null,null,null,null,null,null,null,0,0,null,null,".",".",".",".",".",".",".",null,".",".",".",".",".",".",".",null,{"$f":"IF(S195=\".\",\".\",SUM($S195:S195))","v":"."},{"$f":"IF(T195=\".\",\".\",SUM($S195:T195))","v":"."},{"$f":"IF(U195=\".\",\".\",SUM($S195:U195))","v":"."},{"$f":"IF(V195=\".\",\".\",SUM($S195:V195))","v":"."},{"$f":"IF(W195=\".\",\".\",SUM($S195:W195))","v":"."},{"$f":"IF(X195=\".\",\".\",SUM($S195:X195))","v":"."},{"$f":"IF(Y195=\".\",\".\",SUM($S195:Y195))","v":"."},null,".",".",".",".",".",".","."]
[null,null,"Residential","",".",null,null,null,null,null,null,null,null,null,0,0,null,null,".",".",".",".",".",".",".",null,".",".",".",".",".",".",".",null,{"$f":"IF(S196=\".\",\".\",SUM($S196:S196))","v":"."},{"$f":"IF(T196=\".\",\".\",SUM($S196:T196))","v":"."},{"$f":"IF(U196=\".\",\".\",SUM($S196:U196))","v":"."},{"$f":"IF(V196=\".\",\".\",SUM($S196:V196))","v":"."},{"$f":"IF(W196=\".\",\".\",SUM($S196:W196))","v":"."},{"$f":"IF(X196=\".\",\".\",SUM($S196:X196))","v":"."},{"$f":"IF(Y196=\".\",\".\",SUM($S196:Y196))","v":"."},null,".",".",".",".",".",".","."]
[null,null,"Residential","",".",null,null,null,null,null,null,null,null,null,0,0,null,null,".",".",".",".",".",".",".",null,".",".",".",".",".",".",".",null,{"$f":"IF(S197=\".\",\".\",SUM($S197:S197))","v":"."},{"$f":"IF(T197=\".\",\".\",SUM($S197:T197))","v":"."},{"$f":"IF(U197=\".\",\".\",SUM($S197:U197))","v":"."},{"$f":"IF(V197=\".\",\".\",SUM($S197:V197))","v":"."},{"$f":"IF(W197=\".\",\".\",SUM($S197:W197))","v":"."},{"$f":"IF(X197=\".\",\".\",SUM($S197:X197))","v":"."},{"$f":"IF(Y197=\".\",\".\",SUM($S197:Y197))","v":"."},null,".",".",".",".",".",".","."]
[null,null,"Residential","",".",null,null,null,null,null,null,null,null,null,0,0,null,null,".",".",".",".",".",".",".",null,".",".",".",".",".",".",".",null,{"$f":"IF(S198=\".\",\".\",SUM($S198:S198))","v":"."},{"$f":"IF(T198=\".\",\".\",SUM($S198:T198))","v":"."},{"$f":"IF(U198=\".\",\".\",SUM($S198:U198))","v":"."},{"$f":"IF(V198=\".\",\".\",SUM($S198:V198))","v":"."},{"$f":"IF(W198=\".\",\".\",SUM($S198:W198))","v":"."},{"$f":"IF(X198=\".\",\".\",SUM($S198:X198))","v":"."},{"$f":"IF(Y198=\".\",\".\",SUM($S198:Y198))","v":"."},null,".",".",".",".",".",".","."]
[null,null,"Residential","",".",null,null,null,null,null,null,null,null,null,0,0,null,null,".",".",".",".",".",".",".",null,".",".",".",".",".",".",".",null,{"$f":"IF(S199=\".\",\".\",SUM($S199:S199))","v":"."},{"$f":"IF(T199=\".\",\".\",SUM($S199:T199))","v":"."},{"$f":"IF(U199=\".\",\".\",SUM($S199:U199))","v":"."},{"$f":"IF(V199=\".\",\".\",SUM($S199:V199))","v":"."},{"$f":"IF(W199=\".\",\".\",SUM($S199:W199))","v":"."},{"$f":"IF(X199=\".\",\".\",SUM($S199:X199))","v":"."},{"$f":"IF(Y199=\".\",\".\",SUM($S199:Y199))","v":"."},null,".",".",".",".",".",".","."]
[null,null,"Residential","",".",null,null,null,null,null,null,null,null,null,0,0,null,null,".",".",".",".",".",".",".",null,".",".",".",".",".",".",".",null,{"$f":"IF(S200=\".\",\".\",SUM($S200:S200))","v":"."},{"$f":"IF(T200=\".\",\".\",SUM($S200:T200))","v":"."},{"$f":"IF(U200=\".\",\".\",SUM($S200:U200))","v":"."},{"$f":"IF(V200=\".\",\".\",SUM($S200:V200))","v":"."},{"$f":"IF(W200=\".\",\".\",SUM($S200:W200))","v":"."},{"$f":"IF(X200=\".\",\".\",SUM($S200:X200))","v":"."},{"$f":"IF(Y200=\".\",\".\",SUM($S200:Y200))","v":"."},null,".",".",".",".",".",".","."]
[null,null,"Residential","",".",null,null,null,null,null,null,null,null,null,0,0,null,null,".",".",".",".",".",".",".",null,".",".",".",".",".",".",".",null,{"$f":"IF(S201=\".\",\".\",SUM($S201:S201))","v":"."},{"$f":"IF(T201=\".\",\".\",SUM($S201:T201))","v":"."},{"$f":"IF(U201=\".\",\".\",SUM($S201:U201))","v":"."},{"$f":"IF(V201=\".\",\".\",SUM($S201:V201))","v":"."},{"$f":"IF(W201=\".\",\".\",SUM($S201:W201))","v":"."},{"$f":"IF(X201=\".\",\".\",SUM($S201:X201))","v":"."},{"$f":"IF(Y201=\".\",\".\",SUM($S201:Y201))","v":"."},null,".",".",".",".",".",".","."]
[null,null,"Residential","",".",null,null,null,null,null,null,null,null,null,0,0,null,null,".",".",".",".",".",".",".",null,".",".",".",".",".",".",".",null,{"$f":"IF(S202=\".\",\".\",SUM($S202:S202))","v":"."},{"$f":"IF(T202=\".\",\".\",SUM($S202:T202))","v":"."},{"$f":"IF(U202=\".\",\".\",SUM($S202:U202))","v":"."},{"$f":"IF(V202=\".\",\".\",SUM($S202:V202))","v":"."},{"$f":"IF(W202=\".\",\".\",SUM($S202:W202))","v":"."},{"$f":"IF(X202=\".\",\".\",SUM($S202:X202))","v":"."},{"$f":"IF(Y202=\".\",\".\",SUM($S202:Y202))","v":"."},null,".",".",".",".",".",".","."]
[null,null,"Residential","",".",null,null,null,null,null,null,null,null,null,0,0,null,null,".",".",".",".",".",".",".",null,".",".",".",".",".",".",".",null,{"$f":"IF(S203=\".\",\".\",SUM($S203:S203))","v":"."},{"$f":"IF(T203=\".\",\".\",SUM($S203:T203))","v":"."},{"$f":"IF(U203=\".\",\".\",SUM($S203:U203))","v":"."},{"$f":"IF(V203=\".\",\".\",SUM($S203:V203))","v":"."},{"$f":"IF(W203=\".\",\".\",SUM($S203:W203))","v":"."},{"$f":"IF(X203=\".\",\".\",SUM($S203:X203))","v":"."},{"$f":"IF(Y203=\".\",\".\",SUM($S203:Y203))","v":"."},null,".",".",".",".",".",".","."]
[null,null,"Residential","",".",null,null,null,null,null,null,null,null,null,{"$f":"O79","v":0},0,null,null,".",".",".",".",".",".",".",null,".",".",".",".",".",".",".",null,{"$f":"IF(S204=\".\",\".\",SUM($S204:S204))","v":"."},{"$f":"IF(T204=\".\",\".\",SUM($S204:T204))","v":"."},{"$f":"IF(U204=\".\",\".\",SUM($S204:U204))","v":"."},{"$f":"IF(V204=\".\",\".\",SUM($S204:V204))","v":"."},{"$f":"IF(W204=\".\",\".\",SUM($S204:W204))","v":"."},{"$f":"IF(X204=\".\",\".\",SUM($S204:X204))","v":"."},{"$f":"IF(Y204=\".\",\".\",SUM($S204:Y204))","v":"."},null,".",".",".",".",".",".","."]
[null,null,"Special rate","Not Applicable",".",null,null,null,null,null,null,null,null,null,0,0,null,null,".",".",".",".",".",".",".",null,".",".",".",".",".",".",".",null,{"$f":"IF(S205=\".\",\".\",SUM($S205:S205))","v":"."},{"$f":"IF(T205=\".\",\".\",SUM($S205:T205))","v":"."},{"$f":"IF(U205=\".\",\".\",SUM($S205:U205))","v":"."},{"$f":"IF(V205=\".\",\".\",SUM($S205:V205))","v":"."},{"$f":"IF(W205=\".\",\".\",SUM($S205:W205))","v":"."},{"$f":"IF(X205=\".\",\".\",SUM($S205:X205))","v":"."},{"$f":"IF(Y205=\".\",\".\",SUM($S205:Y205))","v":"."},null,".",".",".",".",".",".","."]
[null,null,"Special rate","",".",null,null,null,null,null,null,null,null,null,0,0,null,null,".",".",".",".",".",".",".",null,".",".",".",".",".",".",".",null,{"$f":"IF(S206=\".\",\".\",SUM($S206:S206))","v":"."},{"$f":"IF(T206=\".\",\".\",SUM($S206:T206))","v":"."},{"$f":"IF(U206=\".\",\".\",SUM($S206:U206))","v":"."},{"$f":"IF(V206=\".\",\".\",SUM($S206:V206))","v":"."},{"$f":"IF(W206=\".\",\".\",SUM($S206:W206))","v":"."},{"$f":"IF(X206=\".\",\".\",SUM($S206:X206))","v":"."},{"$f":"IF(Y206=\".\",\".\",SUM($S206:Y206))","v":"."},null,".",".",".",".",".",".","."]
[null,null,"Special rate","",".",null,null,null,null,null,null,null,null,null,0,0,null,null,".",".",".",".",".",".",".",null,".",".",".",".",".",".",".",null,{"$f":"IF(S207=\".\",\".\",SUM($S207:S207))","v":"."},{"$f":"IF(T207=\".\",\".\",SUM($S207:T207))","v":"."},{"$f":"IF(U207=\".\",\".\",SUM($S207:U207))","v":"."},{"$f":"IF(V207=\".\",\".\",SUM($S207:V207))","v":"."},{"$f":"IF(W207=\".\",\".\",SUM($S207:W207))","v":"."},{"$f":"IF(X207=\".\",\".\",SUM($S207:X207))","v":"."},{"$f":"IF(Y207=\".\",\".\",SUM($S207:Y207))","v":"."},null,".",".",".",".",".",".","."]
[null,null,"Special rate","",".",null,null,null,null,null,null,null,null,null,0,0,null,null,".",".",".",".",".",".",".",null,".",".",".",".",".",".",".",null,{"$f":"IF(S208=\".\",\".\",SUM($S208:S208))","v":"."},{"$f":"IF(T208=\".\",\".\",SUM($S208:T208))","v":"."},{"$f":"IF(U208=\".\",\".\",SUM($S208:U208))","v":"."},{"$f":"IF(V208=\".\",\".\",SUM($S208:V208))","v":"."},{"$f":"IF(W208=\".\",\".\",SUM($S208:W208))","v":"."},{"$f":"IF(X208=\".\",\".\",SUM($S208:X208))","v":"."},{"$f":"IF(Y208=\".\",\".\",SUM($S208:Y208))","v":"."},null,".",".",".",".",".",".","."]
[null,null,"Special rate","",".",null,null,null,null,null,null,null,null,null,0,0,null,null,".",".",".",".",".",".",".",null,".",".",".",".",".",".",".",null,{"$f":"IF(S209=\".\",\".\",SUM($S209:S209))","v":"."},{"$f":"IF(T209=\".\",\".\",SUM($S209:T209))","v":"."},{"$f":"IF(U209=\".\",\".\",SUM($S209:U209))","v":"."},{"$f":"IF(V209=\".\",\".\",SUM($S209:V209))","v":"."},{"$f":"IF(W209=\".\",\".\",SUM($S209:W209))","v":"."},{"$f":"IF(X209=\".\",\".\",SUM($S209:X209))","v":"."},{"$f":"IF(Y209=\".\",\".\",SUM($S209:Y209))","v":"."},null,".",".",".",".",".",".","."]
[null,null,"Special rate","",".",null,null,null,null,null,null,null,null,null,0,0,null,null,".",".",".",".",".",".",".",null,".",".",".",".",".",".",".",null,{"$f":"IF(S210=\".\",\".\",SUM($S210:S210))","v":"."},{"$f":"IF(T210=\".\",\".\",SUM($S210:T210))","v":"."},{"$f":"IF(U210=\".\",\".\",SUM($S210:U210))","v":"."},{"$f":"IF(V210=\".\",\".\",SUM($S210:V210))","v":"."},{"$f":"IF(W210=\".\",\".\",SUM($S210:W210))","v":"."},{"$f":"IF(X210=\".\",\".\",SUM($S210:X210))","v":"."},{"$f":"IF(Y210=\".\",\".\",SUM($S210:Y210))","v":"."},null,".",".",".",".",".",".","."]
[null,null,"Special rate","",".",null,null,null,null,null,null,null,null,null,0,0,null,null,".",".",".",".",".",".",".",null,".",".",".",".",".",".",".",null,{"$f":"IF(S211=\".\",\".\",SUM($S211:S211))","v":"."},{"$f":"IF(T211=\".\",\".\",SUM($S211:T211))","v":"."},{"$f":"IF(U211=\".\",\".\",SUM($S211:U211))","v":"."},{"$f":"IF(V211=\".\",\".\",SUM($S211:V211))","v":"."},{"$f":"IF(W211=\".\",\".\",SUM($S211:W211))","v":"."},{"$f":"IF(X211=\".\",\".\",SUM($S211:X211))","v":"."},{"$f":"IF(Y211=\".\",\".\",SUM($S211:Y211))","v":"."},null,".",".",".",".",".",".","."]
[null,null,"Special rate","",".",null,null,null,null,null,null,null,null,null,0,0,null,null,".",".",".",".",".",".",".",null,".",".",".",".",".",".",".",null,{"$f":"IF(S212=\".\",\".\",SUM($S212:S212))","v":"."},{"$f":"IF(T212=\".\",\".\",SUM($S212:T212))","v":"."},{"$f":"IF(U212=\".\",\".\",SUM($S212:U212))","v":"."},{"$f":"IF(V212=\".\",\".\",SUM($S212:V212))","v":"."},{"$f":"IF(W212=\".\",\".\",SUM($S212:W212))","v":"."},{"$f":"IF(X212=\".\",\".\",SUM($S212:X212))","v":"."},{"$f":"IF(Y212=\".\",\".\",SUM($S212:Y212))","v":"."},null,".",".",".",".",".",".","."]
[null,null,"Special rate","",".",null,null,null,null,null,null,null,null,null,0,0,null,null,".",".",".",".",".",".",".",null,".",".",".",".",".",".",".",null,{"$f":"IF(S213=\".\",\".\",SUM($S213:S213))","v":"."},{"$f":"IF(T213=\".\",\".\",SUM($S213:T213))","v":"."},{"$f":"IF(U213=\".\",\".\",SUM($S213:U213))","v":"."},{"$f":"IF(V213=\".\",\".\",SUM($S213:V213))","v":"."},{"$f":"IF(W213=\".\",\".\",SUM($S213:W213))","v":"."},{"$f":"IF(X213=\".\",\".\",SUM($S213:X213))","v":"."},{"$f":"IF(Y213=\".\",\".\",SUM($S213:Y213))","v":"."},null,".",".",".",".",".",".","."]
[null,null,"Special rate","",".",null,null,null,null,null,null,null,null,null,0,0,null,null,".",".",".",".",".",".",".",null,".",".",".",".",".",".",".",null,{"$f":"IF(S214=\".\",\".\",SUM($S214:S214))","v":"."},{"$f":"IF(T214=\".\",\".\",SUM($S214:T214))","v":"."},{"$f":"IF(U214=\".\",\".\",SUM($S214:U214))","v":"."},{"$f":"IF(V214=\".\",\".\",SUM($S214:V214))","v":"."},{"$f":"IF(W214=\".\",\".\",SUM($S214:W214))","v":"."},{"$f":"IF(X214=\".\",\".\",SUM($S214:X214))","v":"."},{"$f":"IF(Y214=\".\",\".\",SUM($S214:Y214))","v":"."},null,".",".",".",".",".",".","."]
[null,null,null,"TOTAL AVERAGE",{"$f":"E90","v":1326.5348651722388},{"$f":"IF($P215=0,\".\",SUMPRODUCT(F185:F214,$P185:$P214)/$P215)","v":1359.6971966069486},{"$f":"IF($P215=0,\".\",SUMPRODUCT(G185:G214,$P185:$P214)/$P215)","v":1393.6915723180018},1428.537252866091,1464.2477168789928,1500.8494857289309,1538.3738642529411,1576.8352000325053,null,null,12797.92,12797.92,null,null,{"$f":"IF(F215=\".\",\".\",F215-E215)","v":33.162331434709813},33.994375711053181,34.845680548089149,35.710464012901866,36.601768849938026,37.524378524010217,38.461335779564251,null,2.4999215855818546E-2,2.5001431050887257E-2,2.5002433278787484E-2,2.4997922834182784E-2,2.4996978604107989E-2,2.5002093068503317E-2,2.5001293036294392E-2,null,{"$f":"IF(S215=\".\",\".\",SUM($S215:S215))","v":33.162331434709813},{"$f":"IF(T215=\".\",\".\",SUM($S215:T215))","v":67.156707145762994},{"$f":"IF(U215=\".\",\".\",SUM($S215:U215))","v":102.00238769385214},{"$f":"IF(V215=\".\",\".\",SUM($S215:V215))","v":137.71285170675401},{"$f":"IF(W215=\".\",\".\",SUM($S215:W215))","v":174.31462055669203},{"$f":"IF(X215=\".\",\".\",SUM($S215:X215))","v":211.83899908070225},{"$f":"IF(Y215=\".\",\".\",SUM($S215:Y215))","v":250.3003348602665},null,2.4999215855818546E-2,5.0625663078251115E-2,7.6893861120346907E-2,0.10381397076123822,0.13140598497127232,0.15969350270578597,0.18868733979921992]
[null,null,{"$f":"C91","v":"Business"},"Business A",3111.9799123743137,3189.78,3269.52,3351.26,3435.04,3520.92,3608.94,3699.17,null,null,459.08,459.08,null,null,77.800087625686501,79.739999999999782,81.740000000000236,83.779999999999745,85.880000000000109,88.019999999999982,90.230000000000018,null,2.5000189530892003E-2,2.4998589244399128E-2,2.500061171058765E-2,2.4999552407154235E-2,2.5001164469700576E-2,2.4999147949967604E-2,2.5001801082866537E-2,null,{"$f":"IF(S216=\".\",\".\",SUM($S216:S216))","v":77.800087625686501},{"$f":"IF(T216=\".\",\".\",SUM($S216:T216))","v":157.54008762568628},{"$f":"IF(U216=\".\",\".\",SUM($S216:U216))","v":239.28008762568652},{"$f":"IF(V216=\".\",\".\",SUM($S216:V216))","v":323.06008762568626},{"$f":"IF(W216=\".\",\".\",SUM($S216:W216))","v":408.94008762568637},{"$f":"IF(X216=\".\",\".\",SUM($S216:X216))","v":496.96008762568636},{"$f":"IF(Y216=\".\",\".\",SUM($S216:Y216))","v":587.19008762568637},null,2.5000189530892003E-2,5.0623748244406075E-2,7.6889984628186525E-2,0.10381175223563854,0.13140833139687014,0.15969257566528627,0.18868697875934681]
[null,null,"Business","Business B",13396.522249413954,13731.44,14074.72,14426.59,14787.25,15156.94,15535.86,15924.26,null,null,43,43,null,null,{"$f":"IF(F217=\"\",\".\",F217-E217)","v":334.91775058604617},{"$f":"IF(G217=\"\",\".\",G217-F217)","v":343.27999999999884},{"$f":"IF(H217=\"\",\".\",H217-G217)","v":351.8700000000008},{"$f":"IF(I217=\"\",\".\",I217-H217)","v":360.65999999999985},{"$f":"IF(J217=\"\",\".\",J217-I217)","v":369.69000000000051},{"$f":"IF(K217=\"\",\".\",K217-J217)","v":378.92000000000007},{"$f":"IF(L217=\"\",\".\",L217-K217)","v":388.39999999999964},null,{"$f":"IF(ISNUMBER(E217),F217/E217-1,\".\")","v":2.500035041562354E-2},{"$f":"IF(ISNUMBER(F217),G217/F217-1,\".\")","v":2.4999563046555817E-2},{"$f":"IF(ISNUMBER(G217),H217/G217-1,\".\")","v":2.5000142098741573E-2},{"$f":"IF(ISNUMBER(H217),I217/H217-1,\".\")","v":2.4999670746864044E-2},{"$f":"IF(ISNUMBER(I217),J217/I217-1,\".\")","v":2.5000591725980126E-2},{"$f":"IF(ISNUMBER(J217),K217/J217-1,\".\")","v":2.4999769082677537E-2},{"$f":"IF(ISNUMBER(K217),L217/K217-1,\".\")","v":2.500022528524326E-2},null,{"$f":"IF(S217=\".\",\".\",SUM($S217:S217))","v":334.91775058604617},{"$f":"IF(T217=\".\",\".\",SUM($S217:T217))","v":678.197750586045},{"$f":"IF(U217=\".\",\".\",SUM($S217:U217))","v":1030.0677505860458},{"$f":"IF(V217=\".\",\".\",SUM($S217:V217))","v":1390.7277505860457},{"$f":"IF(W217=\".\",\".\",SUM($S217:W217))","v":1760.4177505860462},{"$f":"IF(X217=\".\",\".\",SUM($S217:X217))","v":2139.3377505860462},{"$f":"IF(Y217=\".\",\".\",SUM($S217:Y217))","v":2527.7377505860459},null,{"$f":"IF(ISNUMBER($E217),F217/$E217-1,\".\")","v":2.500035041562354E-2},{"$f":"IF(ISNUMBER($E217),G217/$E217-1,\".\")","v":5.0624911298580821E-2},{"$f":"IF(ISNUMBER($E217),H217/$E217-1,\".\")","v":7.6890683373523006E-2},{"$f":"IF(ISNUMBER($E217),I217/$E217-1,\".\")","v":0.10381259588822656},{"$f":"IF(ISNUMBER($E217),J217/$E217-1,\".\")","v":0.13140856394002243},{"$f":"IF(ISNUMBER($E217),K217/$E217-1,\".\")","v":0.15969351677668686},{"$f":"IF(ISNUMBER($E217),L217/$E217-1,\".\")","v":0.18868611595794005}]
[null,null,"Business","Business C",12880.859077780642,13202.88,13532.95,13871.28,14218.06,14573.51,14937.85,15311.29,null,null,31,31,null,null,322.02092221935709,330.07000000000153,338.32999999999993,346.77999999999884,355.45000000000073,364.34000000000015,373.44000000000051,null,2.4999956934148804E-2,2.499984851789927E-2,2.5000461835741561E-2,2.4999855817199101E-2,2.4999894500374875E-2,2.5000154389711149E-2,2.4999581599761678E-2,null,{"$f":"IF(S218=\".\",\".\",SUM($S218:S218))","v":322.02092221935709},{"$f":"IF(T218=\".\",\".\",SUM($S218:T218))","v":652.09092221935862},{"$f":"IF(U218=\".\",\".\",SUM($S218:U218))","v":990.42092221935854},{"$f":"IF(V218=\".\",\".\",SUM($S218:V218))","v":1337.2009222193574},{"$f":"IF(W218=\".\",\".\",SUM($S218:W218))","v":1692.6509222193581},{"$f":"IF(X218=\".\",\".\",SUM($S218:X218))","v":2056.9909222193583},{"$f":"IF(Y218=\".\",\".\",SUM($S218:Y218))","v":2430.4309222193588},null,2.4999956934148804E-2,5.0624800588355834E-2,7.6890905819148703E-2,0.10381302319548058,0.13140823232350751,0.15969361280938532,0.18868546791353613]
[null,null,"Business","Business D",45880.975400238094,47028,48203.7,49408.79,50644.01,51910.11,53207.87,54538.06,null,null,42,42,null,null,1147.0245997619058,1175.6999999999971,1205.0900000000038,1235.2200000000012,1266.0999999999985,1297.760000000002,1330.1899999999951,null,2.5000004680719057E-2,2.4999999999999911E-2,2.4999948136761319E-2,2.5000005059828467E-2,2.499999506358197E-2,2.5000139664508536E-2,2.4999873139067486E-2,null,{"$f":"IF(S219=\".\",\".\",SUM($S219:S219))","v":1147.0245997619058},{"$f":"IF(T219=\".\",\".\",SUM($S219:T219))","v":2322.7245997619029},{"$f":"IF(U219=\".\",\".\",SUM($S219:U219))","v":3527.8145997619067},{"$f":"IF(V219=\".\",\".\",SUM($S219:V219))","v":4763.0345997619079},{"$f":"IF(W219=\".\",\".\",SUM($S219:W219))","v":6029.1345997619064},{"$f":"IF(X219=\".\",\".\",SUM($S219:X219))","v":7326.8945997619085},{"$f":"IF(Y219=\".\",\".\",SUM($S219:Y219))","v":8657.0845997619035},null,2.5000004680719057E-2,5.0625004797737017E-2,7.6890575428864905E-2,0.10381284526346812,0.13140816094617325,0.15969352298739237,0.18868571394227551]
[null,null,"Business","Town Centre Minor",3469.6560489289404,3556.4,3645.31,3736.44,3829.85,3925.6,4023.74,4124.33,null,null,387,387,null,null,86.743951071059655,88.909999999999854,91.130000000000109,93.409999999999854,95.75,98.139999999999873,100.59000000000015,null,2.5000734899309984E-2,2.4999999999999911E-2,2.4999245605997977E-2,2.4999732365567295E-2,2.5000979150619385E-2,2.4999999999999911E-2,2.4999130162485672E-2,null,{"$f":"IF(S220=\".\",\".\",SUM($S220:S220))","v":86.743951071059655},{"$f":"IF(T220=\".\",\".\",SUM($S220:T220))","v":175.65395107105951},{"$f":"IF(U220=\".\",\".\",SUM($S220:U220))","v":266.78395107105962},{"$f":"IF(V220=\".\",\".\",SUM($S220:V220))","v":360.19395107105947},{"$f":"IF(W220=\".\",\".\",SUM($S220:W220))","v":455.94395107105947},{"$f":"IF(X220=\".\",\".\",SUM($S220:X220))","v":554.08395107105935},{"$f":"IF(Y220=\".\",\".\",SUM($S220:Y220))","v":654.67395107105949},null,2.5000734899309984E-2,5.062575327179264E-2,7.6890604517820815E-2,0.10381258141776017,0.13140897675197705,0.15969420117077648,0.18868554745452437]
[null,null,"Business","",".",null,null,null,null,null,null,null,null,null,0,0,null,null,".",".",".",".",".",".",".",null,".",".",".",".",".",".",".",null,{"$f":"IF(S221=\".\",\".\",SUM($S221:S221))","v":"."},{"$f":"IF(T221=\".\",\".\",SUM($S221:T221))","v":"."},{"$f":"IF(U221=\".\",\".\",SUM($S221:U221))","v":"."},{"$f":"IF(V221=\".\",\".\",SUM($S221:V221))","v":"."},{"$f":"IF(W221=\".\",\".\",SUM($S221:W221))","v":"."},{"$f":"IF(X221=\".\",\".\",SUM($S221:X221))","v":"."},{"$f":"IF(Y221=\".\",\".\",SUM($S221:Y221))","v":"."},null,".",".",".",".",".",".","."]
[null,null,"Business","",".",null,null,null,null,null,null,null,null,null,0,0,null,null,".",".",".",".",".",".",".",null,".",".",".",".",".",".",".",null,{"$f":"IF(S222=\".\",\".\",SUM($S222:S222))","v":"."},{"$f":"IF(T222=\".\",\".\",SUM($S222:T222))","v":"."},{"$f":"IF(U222=\".\",\".\",SUM($S222:U222))","v":"."},{"$f":"IF(V222=\".\",\".\",SUM($S222:V222))","v":"."},{"$f":"IF(W222=\".\",\".\",SUM($S222:W222))","v":"."},{"$f":"IF(X222=\".\",\".\",SUM($S222:X222))","v":"."},{"$f":"IF(Y222=\".\",\".\",SUM($S222:Y222))","v":"."},null,".",".",".",".",".",".","."]
[null,null,"Business","",".",null,null,null,null,null,null,null,null,null,0,0,null,null,".",".",".",".",".",".",".",null,".",".",".",".",".",".",".",null,{"$f":"IF(S223=\".\",\".\",SUM($S223:S223))","v":"."},{"$f":"IF(T223=\".\",\".\",SUM($S223:T223))","v":"."},{"$f":"IF(U223=\".\",\".\",SUM($S223:U223))","v":"."},{"$f":"IF(V223=\".\",\".\",SUM($S223:V223))","v":"."},{"$f":"IF(W223=\".\",\".\",SUM($S223:W223))","v":"."},{"$f":"IF(X223=\".\",\".\",SUM($S223:X223))","v":"."},{"$f":"IF(Y223=\".\",\".\",SUM($S223:Y223))","v":"."},null,".",".",".",".",".",".","."]
[null,null,"Business","",".",null,null,null,null,null,null,null,null,null,{"$f":"O99","v":0},0,null,null,".",".",".",".",".",".",".",null,".",".",".",".",".",".",".",null,{"$f":"IF(S224=\".\",\".\",SUM($S224:S224))","v":"."},{"$f":"IF(T224=\".\",\".\",SUM($S224:T224))","v":"."},{"$f":"IF(U224=\".\",\".\",SUM($S224:U224))","v":"."},{"$f":"IF(V224=\".\",\".\",SUM($S224:V224))","v":"."},{"$f":"IF(W224=\".\",\".\",SUM($S224:W224))","v":"."},{"$f":"IF(X224=\".\",\".\",SUM($S224:X224))","v":"."},{"$f":"IF(Y224=\".\",\".\",SUM($S224:Y224))","v":"."},null,".",".",".",".",".",".","."]
[null,null,"Business","",".",null,null,null,null,null,null,null,null,null,0,0,null,null,".",".",".",".",".",".",".",null,".",".",".",".",".",".",".",null,{"$f":"IF(S225=\".\",\".\",SUM($S225:S225))","v":"."},{"$f":"IF(T225=\".\",\".\",SUM($S225:T225))","v":"."},{"$f":"IF(U225=\".\",\".\",SUM($S225:U225))","v":"."},{"$f":"IF(V225=\".\",\".\",SUM($S225:V225))","v":"."},{"$f":"IF(W225=\".\",\".\",SUM($S225:W225))","v":"."},{"$f":"IF(X225=\".\",\".\",SUM($S225:X225))","v":"."},{"$f":"IF(Y225=\".\",\".\",SUM($S225:Y225))","v":"."},null,".",".",".",".",".",".","."]
[null,null,"Business","",".",null,null,null,null,null,null,null,null,null,0,0,null,null,".",".",".",".",".",".",".",null,".",".",".",".",".",".",".",null,{"$f":"IF(S226=\".\",\".\",SUM($S226:S226))","v":"."},{"$f":"IF(T226=\".\",\".\",SUM($S226:T226))","v":"."},{"$f":"IF(U226=\".\",\".\",SUM($S226:U226))","v":"."},{"$f":"IF(V226=\".\",\".\",SUM($S226:V226))","v":"."},{"$f":"IF(W226=\".\",\".\",SUM($S226:W226))","v":"."},{"$f":"IF(X226=\".\",\".\",SUM($S226:X226))","v":"."},{"$f":"IF(Y226=\".\",\".\",SUM($S226:Y226))","v":"."},null,".",".",".",".",".",".","."]
[null,null,"Business","",".",null,null,null,null,null,null,null,null,null,0,0,null,null,".",".",".",".",".",".",".",null,".",".",".",".",".",".",".",null,{"$f":"IF(S227=\".\",\".\",SUM($S227:S227))","v":"."},{"$f":"IF(T227=\".\",\".\",SUM($S227:T227))","v":"."},{"$f":"IF(U227=\".\",\".\",SUM($S227:U227))","v":"."},{"$f":"IF(V227=\".\",\".\",SUM($S227:V227))","v":"."},{"$f":"IF(W227=\".\",\".\",SUM($S227:W227))","v":"."},{"$f":"IF(X227=\".\",\".\",SUM($S227:X227))","v":"."},{"$f":"IF(Y227=\".\",\".\",SUM($S227:Y227))","v":"."},null,".",".",".",".",".",".","."]
[null,null,"Business","",".",null,null,null,null,null,null,null,null,null,0,0,null,null,".",".",".",".",".",".",".",null,".",".",".",".",".",".",".",null,{"$f":"IF(S228=\".\",\".\",SUM($S228:S228))","v":"."},{"$f":"IF(T228=\".\",\".\",SUM($S228:T228))","v":"."},{"$f":"IF(U228=\".\",\".\",SUM($S228:U228))","v":"."},{"$f":"IF(V228=\".\",\".\",SUM($S228:V228))","v":"."},{"$f":"IF(W228=\".\",\".\",SUM($S228:W228))","v":"."},{"$f":"IF(X228=\".\",\".\",SUM($S228:X228))","v":"."},{"$f":"IF(Y228=\".\",\".\",SUM($S228:Y228))","v":"."},null,".",".",".",".",".",".","."]
[null,null,"Business","",".",null,null,null,null,null,null,null,null,null,0,0,null,null,".",".",".",".",".",".",".",null,".",".",".",".",".",".",".",null,{"$f":"IF(S229=\".\",\".\",SUM($S229:S229))","v":"."},{"$f":"IF(T229=\".\",\".\",SUM($S229:T229))","v":"."},{"$f":"IF(U229=\".\",\".\",SUM($S229:U229))","v":"."},{"$f":"IF(V229=\".\",\".\",SUM($S229:V229))","v":"."},{"$f":"IF(W229=\".\",\".\",SUM($S229:W229))","v":"."},{"$f":"IF(X229=\".\",\".\",SUM($S229:X229))","v":"."},{"$f":"IF(Y229=\".\",\".\",SUM($S229:Y229))","v":"."},null,".",".",".",".",".",".","."]
[null,null,"Business","",".",null,null,null,null,null,null,null,null,null,0,0,null,null,".",".",".",".",".",".",".",null,".",".",".",".",".",".",".",null,{"$f":"IF(S230=\".\",\".\",SUM($S230:S230))","v":"."},{"$f":"IF(T230=\".\",\".\",SUM($S230:T230))","v":"."},{"$f":"IF(U230=\".\",\".\",SUM($S230:U230))","v":"."},{"$f":"IF(V230=\".\",\".\",SUM($S230:V230))","v":"."},{"$f":"IF(W230=\".\",\".\",SUM($S230:W230))","v":"."},{"$f":"IF(X230=\".\",\".\",SUM($S230:X230))","v":"."},{"$f":"IF(Y230=\".\",\".\",SUM($S230:Y230))","v":"."},null,".",".",".",".",".",".","."]
[null,null,"Business","",".",null,null,null,null,null,null,null,null,null,0,0,null,null,".",".",".",".",".",".",".",null,".",".",".",".",".",".",".",null,{"$f":"IF(S231=\".\",\".\",SUM($S231:S231))","v":"."},{"$f":"IF(T231=\".\",\".\",SUM($S231:T231))","v":"."},{"$f":"IF(U231=\".\",\".\",SUM($S231:U231))","v":"."},{"$f":"IF(V231=\".\",\".\",SUM($S231:V231))","v":"."},{"$f":"IF(W231=\".\",\".\",SUM($S231:W231))","v":"."},{"$f":"IF(X231=\".\",\".\",SUM($S231:X231))","v":"."},{"$f":"IF(Y231=\".\",\".\",SUM($S231:Y231))","v":"."},null,".",".",".",".",".",".","."]
[null,null,"Business","",".",null,null,null,null,null,null,null,null,null,0,0,null,null,".",".",".",".",".",".",".",null,".",".",".",".",".",".",".",null,{"$f":"IF(S232=\".\",\".\",SUM($S232:S232))","v":"."},{"$f":"IF(T232=\".\",\".\",SUM($S232:T232))","v":"."},{"$f":"IF(U232=\".\",\".\",SUM($S232:U232))","v":"."},{"$f":"IF(V232=\".\",\".\",SUM($S232:V232))","v":"."},{"$f":"IF(W232=\".\",\".\",SUM($S232:W232))","v":"."},{"$f":"IF(X232=\".\",\".\",SUM($S232:X232))","v":"."},{"$f":"IF(Y232=\".\",\".\",SUM($S232:Y232))","v":"."},null,".",".",".",".",".",".","."]
[null,null,"Business","",".",null,null,null,null,null,null,null,null,null,0,0,null,null,".",".",".",".",".",".",".",null,".",".",".",".",".",".",".",null,{"$f":"IF(S233=\".\",\".\",SUM($S233:S233))","v":"."},{"$f":"IF(T233=\".\",\".\",SUM($S233:T233))","v":"."},{"$f":"IF(U233=\".\",\".\",SUM($S233:U233))","v":"."},{"$f":"IF(V233=\".\",\".\",SUM($S233:V233))","v":"."},{"$f":"IF(W233=\".\",\".\",SUM($S233:W233))","v":"."},{"$f":"IF(X233=\".\",\".\",SUM($S233:X233))","v":"."},{"$f":"IF(Y233=\".\",\".\",SUM($S233:Y233))","v":"."},null,".",".",".",".",".",".","."]
[null,null,"Business","",".",null,null,null,null,null,null,null,null,null,0,0,null,null,".",".",".",".",".",".",".",null,".",".",".",".",".",".",".",null,{"$f":"IF(S234=\".\",\".\",SUM($S234:S234))","v":"."},{"$f":"IF(T234=\".\",\".\",SUM($S234:T234))","v":"."},{"$f":"IF(U234=\".\",\".\",SUM($S234:U234))","v":"."},{"$f":"IF(V234=\".\",\".\",SUM($S234:V234))","v":"."},{"$f":"IF(W234=\".\",\".\",SUM($S234:W234))","v":"."},{"$f":"IF(X234=\".\",\".\",SUM($S234:X234))","v":"."},{"$f":"IF(Y234=\".\",\".\",SUM($S234:Y234))","v":"."},null,".",".",".",".",".",".","."]
[null,null,"Business","",".",null,null,null,null,null,null,null,null,null,0,0,null,null,".",".",".",".",".",".",".",null,".",".",".",".",".",".",".",null,{"$f":"IF(S235=\".\",\".\",SUM($S235:S235))","v":"."},{"$f":"IF(T235=\".\",\".\",SUM($S235:T235))","v":"."},{"$f":"IF(U235=\".\",\".\",SUM($S235:U235))","v":"."},{"$f":"IF(V235=\".\",\".\",SUM($S235:V235))","v":"."},{"$f":"IF(W235=\".\",\".\",SUM($S235:W235))","v":"."},{"$f":"IF(X235=\".\",\".\",SUM($S235:X235))","v":"."},{"$f":"IF(Y235=\".\",\".\",SUM($S235:Y235))","v":"."},null,".",".",".",".",".",".","."]
[null,null,{"$f":"C111","v":"Business"},"",".",null,null,null,null,null,null,null,null,null,0,0,null,null,".",".",".",".",".",".",".",null,".",".",".",".",".",".",".",null,{"$f":"IF(S236=\".\",\".\",SUM($S236:S236))","v":"."},{"$f":"IF(T236=\".\",\".\",SUM($S236:T236))","v":"."},{"$f":"IF(U236=\".\",\".\",SUM($S236:U236))","v":"."},{"$f":"IF(V236=\".\",\".\",SUM($S236:V236))","v":"."},{"$f":"IF(W236=\".\",\".\",SUM($S236:W236))","v":"."},{"$f":"IF(X236=\".\",\".\",SUM($S236:X236))","v":"."},{"$f":"IF(Y236=\".\",\".\",SUM($S236:Y236))","v":"."},null,".",".",".",".",".",".","."]
[null,null,"Business","",".",null,null,null,null,null,null,null,null,null,0,0,null,null,".",".",".",".",".",".",".",null,".",".",".",".",".",".",".",null,{"$f":"IF(S237=\".\",\".\",SUM($S237:S237))","v":"."},{"$f":"IF(T237=\".\",\".\",SUM($S237:T237))","v":"."},{"$f":"IF(U237=\".\",\".\",SUM($S237:U237))","v":"."},{"$f":"IF(V237=\".\",\".\",SUM($S237:V237))","v":"."},{"$f":"IF(W237=\".\",\".\",SUM($S237:W237))","v":"."},{"$f":"IF(X237=\".\",\".\",SUM($S237:X237))","v":"."},{"$f":"IF(Y237=\".\",\".\",SUM($S237:Y237))","v":"."},null,".",".",".",".",".",".","."]
[null,null,"Business","",".",null,null,null,null,null,null,null,null,null,0,0,null,null,".",".",".",".",".",".",".",null,".",".",".",".",".",".",".",null,{"$f":"IF(S238=\".\",\".\",SUM($S238:S238))","v":"."},{"$f":"IF(T238=\".\",\".\",SUM($S238:T238))","v":"."},{"$f":"IF(U238=\".\",\".\",SUM($S238:U238))","v":"."},{"$f":"IF(V238=\".\",\".\",SUM($S238:V238))","v":"."},{"$f":"IF(W238=\".\",\".\",SUM($S238:W238))","v":"."},{"$f":"IF(X238=\".\",\".\",SUM($S238:X238))","v":"."},{"$f":"IF(Y238=\".\",\".\",SUM($S238:Y238))","v":"."},null,".",".",".",".",".",".","."]
[null,null,"Business","",".",null,null,null,null,null,null,null,null,null,0,0,null,null,".",".",".",".",".",".",".",null,".",".",".",".",".",".",".",null,{"$f":"IF(S239=\".\",\".\",SUM($S239:S239))","v":"."},{"$f":"IF(T239=\".\",\".\",SUM($S239:T239))","v":"."},{"$f":"IF(U239=\".\",\".\",SUM($S239:U239))","v":"."},{"$f":"IF(V239=\".\",\".\",SUM($S239:V239))","v":"."},{"$f":"IF(W239=\".\",\".\",SUM($S239:W239))","v":"."},{"$f":"IF(X239=\".\",\".\",SUM($S239:X239))","v":"."},{"$f":"IF(Y239=\".\",\".\",SUM($S239:Y239))","v":"."},null,".",".",".",".",".",".","."]
[null,null,"Business","",".",null,null,null,null,null,null,null,null,null,0,0,null,null,".",".",".",".",".",".",".",null,".",".",".",".",".",".",".",null,{"$f":"IF(S240=\".\",\".\",SUM($S240:S240))","v":"."},{"$f":"IF(T240=\".\",\".\",SUM($S240:T240))","v":"."},{"$f":"IF(U240=\".\",\".\",SUM($S240:U240))","v":"."},{"$f":"IF(V240=\".\",\".\",SUM($S240:V240))","v":"."},{"$f":"IF(W240=\".\",\".\",SUM($S240:W240))","v":"."},{"$f":"IF(X240=\".\",\".\",SUM($S240:X240))","v":"."},{"$f":"IF(Y240=\".\",\".\",SUM($S240:Y240))","v":"."},null,".",".",".",".",".",".","."]
[null,null,"Special rate","Not Applicable",".",null,null,null,null,null,null,null,null,null,0,0,null,null,".",".",".",".",".",".",".",null,".",".",".",".",".",".",".",null,{"$f":"IF(S241=\".\",\".\",SUM($S241:S241))","v":"."},{"$f":"IF(T241=\".\",\".\",SUM($S241:T241))","v":"."},{"$f":"IF(U241=\".\",\".\",SUM($S241:U241))","v":"."},{"$f":"IF(V241=\".\",\".\",SUM($S241:V241))","v":"."},{"$f":"IF(W241=\".\",\".\",SUM($S241:W241))","v":"."},{"$f":"IF(X241=\".\",\".\",SUM($S241:X241))","v":"."},{"$f":"IF(Y241=\".\",\".\",SUM($S241:Y241))","v":"."},null,".",".",".",".",".",".","."]
[null,null,"Special rate","",".",null,null,null,null,null,null,null,null,null,0,0,null,null,".",".",".",".",".",".",".",null,".",".",".",".",".",".",".",null,{"$f":"IF(S242=\".\",\".\",SUM($S242:S242))","v":"."},{"$f":"IF(T242=\".\",\".\",SUM($S242:T242))","v":"."},{"$f":"IF(U242=\".\",\".\",SUM($S242:U242))","v":"."},{"$f":"IF(V242=\".\",\".\",SUM($S242:V242))","v":"."},{"$f":"IF(W242=\".\",\".\",SUM($S242:W242))","v":"."},{"$f":"IF(X242=\".\",\".\",SUM($S242:X242))","v":"."},{"$f":"IF(Y242=\".\",\".\",SUM($S242:Y242))","v":"."},null,".",".",".",".",".",".","."]
[null,null,"Special rate","",".",null,null,null,null,null,null,null,null,null,0,0,null,null,".",".",".",".",".",".",".",null,".",".",".",".",".",".",".",null,{"$f":"IF(S243=\".\",\".\",SUM($S243:S243))","v":"."},{"$f":"IF(T243=\".\",\".\",SUM($S243:T243))","v":"."},{"$f":"IF(U243=\".\",\".\",SUM($S243:U243))","v":"."},{"$f":"IF(V243=\".\",\".\",SUM($S243:V243))","v":"."},{"$f":"IF(W243=\".\",\".\",SUM($S243:W243))","v":"."},{"$f":"IF(X243=\".\",\".\",SUM($S243:X243))","v":"."},{"$f":"IF(Y243=\".\",\".\",SUM($S243:Y243))","v":"."},null,".",".",".",".",".",".","."]
[null,null,"Special rate","",".",null,null,null,null,null,null,null,null,null,{"$f":"O119","v":0},0,null,null,".",".",".",".",".",".",".",null,".",".",".",".",".",".",".",null,{"$f":"IF(S244=\".\",\".\",SUM($S244:S244))","v":"."},{"$f":"IF(T244=\".\",\".\",SUM($S244:T244))","v":"."},{"$f":"IF(U244=\".\",\".\",SUM($S244:U244))","v":"."},{"$f":"IF(V244=\".\",\".\",SUM($S244:V244))","v":"."},{"$f":"IF(W244=\".\",\".\",SUM($S244:W244))","v":"."},{"$f":"IF(X244=\".\",\".\",SUM($S244:X244))","v":"."},{"$f":"IF(Y244=\".\",\".\",SUM($S244:Y244))","v":"."},null,".",".",".",".",".",".","."]
[null,null,"Special rate","",".",null,null,null,null,null,null,null,null,null,0,0,null,null,".",".",".",".",".",".",".",null,".",".",".",".",".",".",".",null,{"$f":"IF(S245=\".\",\".\",SUM($S245:S245))","v":"."},{"$f":"IF(T245=\".\",\".\",SUM($S245:T245))","v":"."},{"$f":"IF(U245=\".\",\".\",SUM($S245:U245))","v":"."},{"$f":"IF(V245=\".\",\".\",SUM($S245:V245))","v":"."},{"$f":"IF(W245=\".\",\".\",SUM($S245:W245))","v":"."},{"$f":"IF(X245=\".\",\".\",SUM($S245:X245))","v":"."},{"$f":"IF(Y245=\".\",\".\",SUM($S245:Y245))","v":"."},null,".",".",".",".",".",".","."]
[null,null,"Special rate","",".",null,null,null,null,null,null,null,null,null,0,0,null,null,".",".",".",".",".",".",".",null,".",".",".",".",".",".",".",null,{"$f":"IF(S246=\".\",\".\",SUM($S246:S246))","v":"."},{"$f":"IF(T246=\".\",\".\",SUM($S246:T246))","v":"."},{"$f":"IF(U246=\".\",\".\",SUM($S246:U246))","v":"."},{"$f":"IF(V246=\".\",\".\",SUM($S246:V246))","v":"."},{"$f":"IF(W246=\".\",\".\",SUM($S246:W246))","v":"."},{"$f":"IF(X246=\".\",\".\",SUM($S246:X246))","v":"."},{"$f":"IF(Y246=\".\",\".\",SUM($S246:Y246))","v":"."},null,".",".",".",".",".",".","."]
[null,null,"Special rate","",{"$f":"E122","v":"."},null,null,null,null,null,null,null,null,null,0,0,null,null,".",".",".",".",".",".",".",null,".",".",".",".",".",".",".",null,{"$f":"IF(S247=\".\",\".\",SUM($S247:S247))","v":"."},{"$f":"IF(T247=\".\",\".\",SUM($S247:T247))","v":"."},{"$f":"IF(U247=\".\",\".\",SUM($S247:U247))","v":"."},{"$f":"IF(V247=\".\",\".\",SUM($S247:V247))","v":"."},{"$f":"IF(W247=\".\",\".\",SUM($S247:W247))","v":"."},{"$f":"IF(X247=\".\",\".\",SUM($S247:X247))","v":"."},{"$f":"IF(Y247=\".\",\".\",SUM($S247:Y247))","v":"."},null,".",".",".",".",".",".","."]
[null,null,"Special rate","",".",null,null,null,null,null,null,null,null,null,0,0,null,null,".",".",".",".",".",".",".",null,".",".",".",".",".",".",".",null,{"$f":"IF(S248=\".\",\".\",SUM($S248:S248))","v":"."},{"$f":"IF(T248=\".\",\".\",SUM($S248:T248))","v":"."},{"$f":"IF(U248=\".\",\".\",SUM($S248:U248))","v":"."},{"$f":"IF(V248=\".\",\".\",SUM($S248:V248))","v":"."},{"$f":"IF(W248=\".\",\".\",SUM($S248:W248))","v":"."},{"$f":"IF(X248=\".\",\".\",SUM($S248:X248))","v":"."},{"$f":"IF(Y248=\".\",\".\",SUM($S248:Y248))","v":"."},null,".",".",".",".",".",".","."]
[null,null,"Special rate","",".",null,null,null,null,null,null,null,null,null,0,0,null,null,{"$f":"IF(F249=\"\",\".\",F249-E249)","v":"."},{"$f":"IF(G249=\"\",\".\",G249-F249)","v":"."},{"$f":"IF(H249=\"\",\".\",H249-G249)","v":"."},{"$f":"IF(I249=\"\",\".\",I249-H249)","v":"."},{"$f":"IF(J249=\"\",\".\",J249-I249)","v":"."},{"$f":"IF(K249=\"\",\".\",K249-J249)","v":"."},{"$f":"IF(L249=\"\",\".\",L249-K249)","v":"."},null,{"$f":"IF(ISNUMBER(E249),F249/E249-1,\".\")","v":"."},{"$f":"IF(ISNUMBER(F249),G249/F249-1,\".\")","v":"."},{"$f":"IF(ISNUMBER(G249),H249/G249-1,\".\")","v":"."},{"$f":"IF(ISNUMBER(H249),I249/H249-1,\".\")","v":"."},{"$f":"IF(ISNUMBER(I249),J249/I249-1,\".\")","v":"."},{"$f":"IF(ISNUMBER(J249),K249/J249-1,\".\")","v":"."},{"$f":"IF(ISNUMBER(K249),L249/K249-1,\".\")","v":"."},null,{"$f":"IF(S249=\".\",\".\",SUM($S249:S249))","v":"."},{"$f":"IF(T249=\".\",\".\",SUM($S249:T249))","v":"."},{"$f":"IF(U249=\".\",\".\",SUM($S249:U249))","v":"."},{"$f":"IF(V249=\".\",\".\",SUM($S249:V249))","v":"."},{"$f":"IF(W249=\".\",\".\",SUM($S249:W249))","v":"."},{"$f":"IF(X249=\".\",\".\",SUM($S249:X249))","v":"."},{"$f":"IF(Y249=\".\",\".\",SUM($S249:Y249))","v":"."},null,{"$f":"IF(ISNUMBER($E249),F249/$E249-1,\".\")","v":"."},{"$f":"IF(ISNUMBER($E249),G249/$E249-1,\".\")","v":"."},{"$f":"IF(ISNUMBER($E249),H249/$E249-1,\".\")","v":"."},{"$f":"IF(ISNUMBER($E249),I249/$E249-1,\".\")","v":"."},{"$f":"IF(ISNUMBER($E249),J249/$E249-1,\".\")","v":"."},{"$f":"IF(ISNUMBER($E249),K249/$E249-1,\".\")","v":"."},{"$f":"IF(ISNUMBER($E249),L249/$E249-1,\".\")","v":"."}]
[null,null,"Special rate","",".",null,null,null,null,null,null,null,null,null,0,0,null,null,".",".",".",".",".",".",".",null,".",".",".",".",".",".",".",null,{"$f":"IF(S250=\".\",\".\",SUM($S250:S250))","v":"."},{"$f":"IF(T250=\".\",\".\",SUM($S250:T250))","v":"."},{"$f":"IF(U250=\".\",\".\",SUM($S250:U250))","v":"."},{"$f":"IF(V250=\".\",\".\",SUM($S250:V250))","v":"."},{"$f":"IF(W250=\".\",\".\",SUM($S250:W250))","v":"."},{"$f":"IF(X250=\".\",\".\",SUM($S250:X250))","v":"."},{"$f":"IF(Y250=\".\",\".\",SUM($S250:Y250))","v":"."},null,".",".",".",".",".",".","."]
[null,null,"Special rate","",".",null,null,null,null,null,null,null,null,null,0,0,null,null,".",".",".",".",".",".",".",null,".",".",".",".",".",".",".",null,{"$f":"IF(S251=\".\",\".\",SUM($S251:S251))","v":"."},{"$f":"IF(T251=\".\",\".\",SUM($S251:T251))","v":"."},{"$f":"IF(U251=\".\",\".\",SUM($S251:U251))","v":"."},{"$f":"IF(V251=\".\",\".\",SUM($S251:V251))","v":"."},{"$f":"IF(W251=\".\",\".\",SUM($S251:W251))","v":"."},{"$f":"IF(X251=\".\",\".\",SUM($S251:X251))","v":"."},{"$f":"IF(Y251=\".\",\".\",SUM($S251:Y251))","v":"."},null,".",".",".",".",".",".","."]
[null,null,"Special rate","",".",null,null,null,null,null,null,null,null,null,0,0,null,null,".",".",".",".",".",".",".",null,".",".",".",".",".",".",".",null,{"$f":"IF(S252=\".\",\".\",SUM($S252:S252))","v":"."},{"$f":"IF(T252=\".\",\".\",SUM($S252:T252))","v":"."},{"$f":"IF(U252=\".\",\".\",SUM($S252:U252))","v":"."},{"$f":"IF(V252=\".\",\".\",SUM($S252:V252))","v":"."},{"$f":"IF(W252=\".\",\".\",SUM($S252:W252))","v":"."},{"$f":"IF(X252=\".\",\".\",SUM($S252:X252))","v":"."},{"$f":"IF(Y252=\".\",\".\",SUM($S252:Y252))","v":"."},null,".",".",".",".",".",".","."]
[null,null,"Special rate","",".",null,null,null,null,null,null,null,null,null,0,0,null,null,".",".",".",".",".",".",".",null,".",".",".",".",".",".",".",null,{"$f":"IF(S253=\".\",\".\",SUM($S253:S253))","v":"."},{"$f":"IF(T253=\".\",\".\",SUM($S253:T253))","v":"."},{"$f":"IF(U253=\".\",\".\",SUM($S253:U253))","v":"."},{"$f":"IF(V253=\".\",\".\",SUM($S253:V253))","v":"."},{"$f":"IF(W253=\".\",\".\",SUM($S253:W253))","v":"."},{"$f":"IF(X253=\".\",\".\",SUM($S253:X253))","v":"."},{"$f":"IF(Y253=\".\",\".\",SUM($S253:Y253))","v":"."},null,".",".",".",".",".",".","."]
[null,null,"Special rate","",".",null,null,null,null,null,null,null,null,null,0,0,null,null,".",".",".",".",".",".",".",null,".",".",".",".",".",".",".",null,{"$f":"IF(S254=\".\",\".\",SUM($S254:S254))","v":"."},{"$f":"IF(T254=\".\",\".\",SUM($S254:T254))","v":"."},{"$f":"IF(U254=\".\",\".\",SUM($S254:U254))","v":"."},{"$f":"IF(V254=\".\",\".\",SUM($S254:V254))","v":"."},{"$f":"IF(W254=\".\",\".\",SUM($S254:W254))","v":"."},{"$f":"IF(X254=\".\",\".\",SUM($S254:X254))","v":"."},{"$f":"IF(Y254=\".\",\".\",SUM($S254:Y254))","v":"."},null,".",".",".",".",".",".","."]
[null,null,"Special rate","",".",null,null,null,null,null,null,null,null,null,0,0,null,null,".",".",".",".",".",".",".",null,".",".",".",".",".",".",".",null,{"$f":"IF(S255=\".\",\".\",SUM($S255:S255))","v":"."},{"$f":"IF(T255=\".\",\".\",SUM($S255:T255))","v":"."},{"$f":"IF(U255=\".\",\".\",SUM($S255:U255))","v":"."},{"$f":"IF(V255=\".\",\".\",SUM($S255:V255))","v":"."},{"$f":"IF(W255=\".\",\".\",SUM($S255:W255))","v":"."},{"$f":"IF(X255=\".\",\".\",SUM($S255:X255))","v":"."},{"$f":"IF(Y255=\".\",\".\",SUM($S255:Y255))","v":"."},null,".",".",".",".",".",".","."]
[null,null,{"$f":"C131","v":"Special rate"},"",".",null,null,null,null,null,null,null,null,null,0,0,null,null,".",".",".",".",".",".",".",null,".",".",".",".",".",".",".",null,{"$f":"IF(S256=\".\",\".\",SUM($S256:S256))","v":"."},{"$f":"IF(T256=\".\",\".\",SUM($S256:T256))","v":"."},{"$f":"IF(U256=\".\",\".\",SUM($S256:U256))","v":"."},{"$f":"IF(V256=\".\",\".\",SUM($S256:V256))","v":"."},{"$f":"IF(W256=\".\",\".\",SUM($S256:W256))","v":"."},{"$f":"IF(X256=\".\",\".\",SUM($S256:X256))","v":"."},{"$f":"IF(Y256=\".\",\".\",SUM($S256:Y256))","v":"."},null,".",".",".",".",".",".","."]
[null,null,"Special rate","",".",null,null,null,null,null,null,null,null,null,0,0,null,null,".",".",".",".",".",".",".",null,".",".",".",".",".",".",".",null,{"$f":"IF(S257=\".\",\".\",SUM($S257:S257))","v":"."},{"$f":"IF(T257=\".\",\".\",SUM($S257:T257))","v":"."},{"$f":"IF(U257=\".\",\".\",SUM($S257:U257))","v":"."},{"$f":"IF(V257=\".\",\".\",SUM($S257:V257))","v":"."},{"$f":"IF(W257=\".\",\".\",SUM($S257:W257))","v":"."},{"$f":"IF(X257=\".\",\".\",SUM($S257:X257))","v":"."},{"$f":"IF(Y257=\".\",\".\",SUM($S257:Y257))","v":"."},null,".",".",".",".",".",".","."]
[null,null,"Special rate","",".",null,null,null,null,null,null,null,null,null,0,0,null,null,".",".",".",".",".",".",".",null,".",".",".",".",".",".",".",null,{"$f":"IF(S258=\".\",\".\",SUM($S258:S258))","v":"."},{"$f":"IF(T258=\".\",\".\",SUM($S258:T258))","v":"."},{"$f":"IF(U258=\".\",\".\",SUM($S258:U258))","v":"."},{"$f":"IF(V258=\".\",\".\",SUM($S258:V258))","v":"."},{"$f":"IF(W258=\".\",\".\",SUM($S258:W258))","v":"."},{"$f":"IF(X258=\".\",\".\",SUM($S258:X258))","v":"."},{"$f":"IF(Y258=\".\",\".\",SUM($S258:Y258))","v":"."},null,".",".",".",".",".",".","."]
[null,null,"Special rate","",".",null,null,null,null,null,null,null,null,null,0,0,null,null,".",".",".",".",".",".",".",null,".",".",".",".",".",".",".",null,{"$f":"IF(S259=\".\",\".\",SUM($S259:S259))","v":"."},{"$f":"IF(T259=\".\",\".\",SUM($S259:T259))","v":"."},{"$f":"IF(U259=\".\",\".\",SUM($S259:U259))","v":"."},{"$f":"IF(V259=\".\",\".\",SUM($S259:V259))","v":"."},{"$f":"IF(W259=\".\",\".\",SUM($S259:W259))","v":"."},{"$f":"IF(X259=\".\",\".\",SUM($S259:X259))","v":"."},{"$f":"IF(Y259=\".\",\".\",SUM($S259:Y259))","v":"."},null,".",".",".",".",".",".","."]
[null,null,"Special rate","",".",null,null,null,null,null,null,null,null,null,0,0,null,null,".",".",".",".",".",".",".",null,".",".",".",".",".",".",".",null,{"$f":"IF(S260=\".\",\".\",SUM($S260:S260))","v":"."},{"$f":"IF(T260=\".\",\".\",SUM($S260:T260))","v":"."},{"$f":"IF(U260=\".\",\".\",SUM($S260:U260))","v":"."},{"$f":"IF(V260=\".\",\".\",SUM($S260:V260))","v":"."},{"$f":"IF(W260=\".\",\".\",SUM($S260:W260))","v":"."},{"$f":"IF(X260=\".\",\".\",SUM($S260:X260))","v":"."},{"$f":"IF(Y260=\".\",\".\",SUM($S260:Y260))","v":"."},null,".",".",".",".",".",".","."]
[null,null,null,"TOTAL AVERAGE",5897.3917803657705,{"$f":"IF($P261=0,\".\",SUMPRODUCT(F216:F260,$P216:$P260)/$P261)","v":6044.8280833194749},6195.9463055047399,6350.8449929319822,6509.6147339098625,6672.3588512389833,6839.1666235656076,7010.1471432729086,null,null,962.07999999999993,962.07999999999993,null,null,{"$f":"IF(F261=\".\",\".\",F261-E261)","v":147.4363029537044},151.11822218526504,154.89868742724229,158.76974097788025,162.74411732912085,166.80777232662422,170.98051970730103,null,2.500025578164311E-2,2.4999589748841977E-2,2.5000004807921528E-2,2.4999782100583401E-2,2.5000575914478462E-2,2.4999820310271481E-2,2.5000197994614837E-2,null,{"$f":"IF(S261=\".\",\".\",SUM($S261:S261))","v":147.4363029537044},{"$f":"IF(T261=\".\",\".\",SUM($S261:T261))","v":298.55452513896944},{"$f":"IF(U261=\".\",\".\",SUM($S261:U261))","v":453.45321256621173},{"$f":"IF(V261=\".\",\".\",SUM($S261:V261))","v":612.22295354409198},{"$f":"IF(W261=\".\",\".\",SUM($S261:W261))","v":774.96707087321283},{"$f":"IF(X261=\".\",\".\",SUM($S261:X261))","v":941.77484319983705},{"$f":"IF(Y261=\".\",\".\",SUM($S261:Y261))","v":1112.7553629071381},null,2.500025578164311E-2,5.062484166864234E-2,7.6890467761680181E-2,0.10381249480191745,0.13140844287356268,0.15969345064292573,0.18868601652205697]
[null,null,{"$f":"C137","v":"Farmland"},"Not Applicable",".",null,null,null,null,null,null,null,null,null,0,0,null,null,".",".",".",".",".",".",".",null,".",".",".",".",".",".",".",null,{"$f":"IF(S262=\".\",\".\",SUM($S262:S262))","v":"."},{"$f":"IF(T262=\".\",\".\",SUM($S262:T262))","v":"."},{"$f":"IF(U262=\".\",\".\",SUM($S262:U262))","v":"."},{"$f":"IF(V262=\".\",\".\",SUM($S262:V262))","v":"."},{"$f":"IF(W262=\".\",\".\",SUM($S262:W262))","v":"."},{"$f":"IF(X262=\".\",\".\",SUM($S262:X262))","v":"."},{"$f":"IF(Y262=\".\",\".\",SUM($S262:Y262))","v":"."},null,".",".",".",".",".",".","."]
[null,null,"Farmland","",".",null,null,null,null,null,null,null,null,null,0,0,null,null,".",".",".",".",".",".",".",null,".",".",".",".",".",".",".",null,{"$f":"IF(S263=\".\",\".\",SUM($S263:S263))","v":"."},{"$f":"IF(T263=\".\",\".\",SUM($S263:T263))","v":"."},{"$f":"IF(U263=\".\",\".\",SUM($S263:U263))","v":"."},{"$f":"IF(V263=\".\",\".\",SUM($S263:V263))","v":"."},{"$f":"IF(W263=\".\",\".\",SUM($S263:W263))","v":"."},{"$f":"IF(X263=\".\",\".\",SUM($S263:X263))","v":"."},{"$f":"IF(Y263=\".\",\".\",SUM($S263:Y263))","v":"."},null,".",".",".",".",".",".","."]
[null,null,"Farmland","",".",null,null,null,null,null,null,null,null,null,{"$f":"O139","v":0},0,null,null,".",".",".",".",".",".",".",null,".",".",".",".",".",".",".",null,{"$f":"IF(S264=\".\",\".\",SUM($S264:S264))","v":"."},{"$f":"IF(T264=\".\",\".\",SUM($S264:T264))","v":"."},{"$f":"IF(U264=\".\",\".\",SUM($S264:U264))","v":"."},{"$f":"IF(V264=\".\",\".\",SUM($S264:V264))","v":"."},{"$f":"IF(W264=\".\",\".\",SUM($S264:W264))","v":"."},{"$f":"IF(X264=\".\",\".\",SUM($S264:X264))","v":"."},{"$f":"IF(Y264=\".\",\".\",SUM($S264:Y264))","v":"."},null,".",".",".",".",".",".","."]
[null,null,"Farmland","",".",null,null,null,null,null,null,null,null,null,0,0,null,null,".",".",".",".",".",".",".",null,".",".",".",".",".",".",".",null,{"$f":"IF(S265=\".\",\".\",SUM($S265:S265))","v":"."},{"$f":"IF(T265=\".\",\".\",SUM($S265:T265))","v":"."},{"$f":"IF(U265=\".\",\".\",SUM($S265:U265))","v":"."},{"$f":"IF(V265=\".\",\".\",SUM($S265:V265))","v":"."},{"$f":"IF(W265=\".\",\".\",SUM($S265:W265))","v":"."},{"$f":"IF(X265=\".\",\".\",SUM($S265:X265))","v":"."},{"$f":"IF(Y265=\".\",\".\",SUM($S265:Y265))","v":"."},null,".",".",".",".",".",".","."]
[null,null,"Farmland","",".",null,null,null,null,null,null,null,null,null,0,0,null,null,".",".",".",".",".",".",".",null,".",".",".",".",".",".",".",null,{"$f":"IF(S266=\".\",\".\",SUM($S266:S266))","v":"."},{"$f":"IF(T266=\".\",\".\",SUM($S266:T266))","v":"."},{"$f":"IF(U266=\".\",\".\",SUM($S266:U266))","v":"."},{"$f":"IF(V266=\".\",\".\",SUM($S266:V266))","v":"."},{"$f":"IF(W266=\".\",\".\",SUM($S266:W266))","v":"."},{"$f":"IF(X266=\".\",\".\",SUM($S266:X266))","v":"."},{"$f":"IF(Y266=\".\",\".\",SUM($S266:Y266))","v":"."},null,".",".",".",".",".",".","."]
[null,null,"Farmland","",".",null,null,null,null,null,null,null,null,null,0,0,null,null,".",".",".",".",".",".",".",null,".",".",".",".",".",".",".",null,{"$f":"IF(S267=\".\",\".\",SUM($S267:S267))","v":"."},{"$f":"IF(T267=\".\",\".\",SUM($S267:T267))","v":"."},{"$f":"IF(U267=\".\",\".\",SUM($S267:U267))","v":"."},{"$f":"IF(V267=\".\",\".\",SUM($S267:V267))","v":"."},{"$f":"IF(W267=\".\",\".\",SUM($S267:W267))","v":"."},{"$f":"IF(X267=\".\",\".\",SUM($S267:X267))","v":"."},{"$f":"IF(Y267=\".\",\".\",SUM($S267:Y267))","v":"."},null,".",".",".",".",".",".","."]
[null,null,"Farmland","",".",null,null,null,null,null,null,null,null,null,0,0,null,null,".",".",".",".",".",".",".",null,".",".",".",".",".",".",".",null,{"$f":"IF(S268=\".\",\".\",SUM($S268:S268))","v":"."},{"$f":"IF(T268=\".\",\".\",SUM($S268:T268))","v":"."},{"$f":"IF(U268=\".\",\".\",SUM($S268:U268))","v":"."},{"$f":"IF(V268=\".\",\".\",SUM($S268:V268))","v":"."},{"$f":"IF(W268=\".\",\".\",SUM($S268:W268))","v":"."},{"$f":"IF(X268=\".\",\".\",SUM($S268:X268))","v":"."},{"$f":"IF(Y268=\".\",\".\",SUM($S268:Y268))","v":"."},null,".",".",".",".",".",".","."]
[null,null,"Farmland","",".",null,null,null,null,null,null,null,null,null,0,0,null,null,".",".",".",".",".",".",".",null,".",".",".",".",".",".",".",null,{"$f":"IF(S269=\".\",\".\",SUM($S269:S269))","v":"."},{"$f":"IF(T269=\".\",\".\",SUM($S269:T269))","v":"."},{"$f":"IF(U269=\".\",\".\",SUM($S269:U269))","v":"."},{"$f":"IF(V269=\".\",\".\",SUM($S269:V269))","v":"."},{"$f":"IF(W269=\".\",\".\",SUM($S269:W269))","v":"."},{"$f":"IF(X269=\".\",\".\",SUM($S269:X269))","v":"."},{"$f":"IF(Y269=\".\",\".\",SUM($S269:Y269))","v":"."},null,".",".",".",".",".",".","."]
[null,null,"Farmland","",".",null,null,null,null,null,null,null,null,null,0,0,null,null,".",".",".",".",".",".",".",null,".",".",".",".",".",".",".",null,{"$f":"IF(S270=\".\",\".\",SUM($S270:S270))","v":"."},{"$f":"IF(T270=\".\",\".\",SUM($S270:T270))","v":"."},{"$f":"IF(U270=\".\",\".\",SUM($S270:U270))","v":"."},{"$f":"IF(V270=\".\",\".\",SUM($S270:V270))","v":"."},{"$f":"IF(W270=\".\",\".\",SUM($S270:W270))","v":"."},{"$f":"IF(X270=\".\",\".\",SUM($S270:X270))","v":"."},{"$f":"IF(Y270=\".\",\".\",SUM($S270:Y270))","v":"."},null,".",".",".",".",".",".","."]
[null,null,"Farmland","",".",null,null,null,null,null,null,null,null,null,0,0,null,null,".",".",".",".",".",".",".",null,".",".",".",".",".",".",".",null,{"$f":"IF(S271=\".\",\".\",SUM($S271:S271))","v":"."},{"$f":"IF(T271=\".\",\".\",SUM($S271:T271))","v":"."},{"$f":"IF(U271=\".\",\".\",SUM($S271:U271))","v":"."},{"$f":"IF(V271=\".\",\".\",SUM($S271:V271))","v":"."},{"$f":"IF(W271=\".\",\".\",SUM($S271:W271))","v":"."},{"$f":"IF(X271=\".\",\".\",SUM($S271:X271))","v":"."},{"$f":"IF(Y271=\".\",\".\",SUM($S271:Y271))","v":"."},null,".",".",".",".",".",".","."]
[null,null,"Special rate","Not Applicable",".",null,null,null,null,null,null,null,null,null,0,0,null,null,".",".",".",".",".",".",".",null,".",".",".",".",".",".",".",null,{"$f":"IF(S272=\".\",\".\",SUM($S272:S272))","v":"."},{"$f":"IF(T272=\".\",\".\",SUM($S272:T272))","v":"."},{"$f":"IF(U272=\".\",\".\",SUM($S272:U272))","v":"."},{"$f":"IF(V272=\".\",\".\",SUM($S272:V272))","v":"."},{"$f":"IF(W272=\".\",\".\",SUM($S272:W272))","v":"."},{"$f":"IF(X272=\".\",\".\",SUM($S272:X272))","v":"."},{"$f":"IF(Y272=\".\",\".\",SUM($S272:Y272))","v":"."},null,".",".",".",".",".",".","."]
[null,null,"Special rate","",".",null,null,null,null,null,null,null,null,null,0,0,null,null,".",".",".",".",".",".",".",null,".",".",".",".",".",".",".",null,{"$f":"IF(S273=\".\",\".\",SUM($S273:S273))","v":"."},{"$f":"IF(T273=\".\",\".\",SUM($S273:T273))","v":"."},{"$f":"IF(U273=\".\",\".\",SUM($S273:U273))","v":"."},{"$f":"IF(V273=\".\",\".\",SUM($S273:V273))","v":"."},{"$f":"IF(W273=\".\",\".\",SUM($S273:W273))","v":"."},{"$f":"IF(X273=\".\",\".\",SUM($S273:X273))","v":"."},{"$f":"IF(Y273=\".\",\".\",SUM($S273:Y273))","v":"."},null,".",".",".",".",".",".","."]
[null,null,"Special rate","",".",null,null,null,null,null,null,null,null,null,0,0,null,null,".",".",".",".",".",".",".",null,".",".",".",".",".",".",".",null,{"$f":"IF(S274=\".\",\".\",SUM($S274:S274))","v":"."},{"$f":"IF(T274=\".\",\".\",SUM($S274:T274))","v":"."},{"$f":"IF(U274=\".\",\".\",SUM($S274:U274))","v":"."},{"$f":"IF(V274=\".\",\".\",SUM($S274:V274))","v":"."},{"$f":"IF(W274=\".\",\".\",SUM($S274:W274))","v":"."},{"$f":"IF(X274=\".\",\".\",SUM($S274:X274))","v":"."},{"$f":"IF(Y274=\".\",\".\",SUM($S274:Y274))","v":"."},null,".",".",".",".",".",".","."]
[null,null,"Special rate","",".",null,null,null,null,null,null,null,null,null,0,0,null,null,".",".",".",".",".",".",".",null,".",".",".",".",".",".",".",null,{"$f":"IF(S275=\".\",\".\",SUM($S275:S275))","v":"."},{"$f":"IF(T275=\".\",\".\",SUM($S275:T275))","v":"."},{"$f":"IF(U275=\".\",\".\",SUM($S275:U275))","v":"."},{"$f":"IF(V275=\".\",\".\",SUM($S275:V275))","v":"."},{"$f":"IF(W275=\".\",\".\",SUM($S275:W275))","v":"."},{"$f":"IF(X275=\".\",\".\",SUM($S275:X275))","v":"."},{"$f":"IF(Y275=\".\",\".\",SUM($S275:Y275))","v":"."},null,".",".",".",".",".",".","."]
[null,null,"Special rate","",".",null,null,null,null,null,null,null,null,null,0,0,null,null,".",".",".",".",".",".",".",null,".",".",".",".",".",".",".",null,{"$f":"IF(S276=\".\",\".\",SUM($S276:S276))","v":"."},{"$f":"IF(T276=\".\",\".\",SUM($S276:T276))","v":"."},{"$f":"IF(U276=\".\",\".\",SUM($S276:U276))","v":"."},{"$f":"IF(V276=\".\",\".\",SUM($S276:V276))","v":"."},{"$f":"IF(W276=\".\",\".\",SUM($S276:W276))","v":"."},{"$f":"IF(X276=\".\",\".\",SUM($S276:X276))","v":"."},{"$f":"IF(Y276=\".\",\".\",SUM($S276:Y276))","v":"."},null,".",".",".",".",".",".","."]
[null,null,"Special rate","",".",null,null,null,null,null,null,null,null,null,0,0,null,null,".",".",".",".",".",".",".",null,".",".",".",".",".",".",".",null,{"$f":"IF(S277=\".\",\".\",SUM($S277:S277))","v":"."},{"$f":"IF(T277=\".\",\".\",SUM($S277:T277))","v":"."},{"$f":"IF(U277=\".\",\".\",SUM($S277:U277))","v":"."},{"$f":"IF(V277=\".\",\".\",SUM($S277:V277))","v":"."},{"$f":"IF(W277=\".\",\".\",SUM($S277:W277))","v":"."},{"$f":"IF(X277=\".\",\".\",SUM($S277:X277))","v":"."},{"$f":"IF(Y277=\".\",\".\",SUM($S277:Y277))","v":"."},null,".",".",".",".",".",".","."]
[null,null,"Special rate","",".",null,null,null,null,null,null,null,null,null,0,0,null,null,".",".",".",".",".",".",".",null,".",".",".",".",".",".",".",null,{"$f":"IF(S278=\".\",\".\",SUM($S278:S278))","v":"."},{"$f":"IF(T278=\".\",\".\",SUM($S278:T278))","v":"."},{"$f":"IF(U278=\".\",\".\",SUM($S278:U278))","v":"."},{"$f":"IF(V278=\".\",\".\",SUM($S278:V278))","v":"."},{"$f":"IF(W278=\".\",\".\",SUM($S278:W278))","v":"."},{"$f":"IF(X278=\".\",\".\",SUM($S278:X278))","v":"."},{"$f":"IF(Y278=\".\",\".\",SUM($S278:Y278))","v":"."},null,".",".",".",".",".",".","."]
[null,null,"Special rate","",{"$f":"E154","v":"."},null,null,null,null,null,null,null,null,null,0,0,null,null,".",".",".",".",".",".",".",null,".",".",".",".",".",".",".",null,{"$f":"IF(S279=\".\",\".\",SUM($S279:S279))","v":"."},{"$f":"IF(T279=\".\",\".\",SUM($S279:T279))","v":"."},{"$f":"IF(U279=\".\",\".\",SUM($S279:U279))","v":"."},{"$f":"IF(V279=\".\",\".\",SUM($S279:V279))","v":"."},{"$f":"IF(W279=\".\",\".\",SUM($S279:W279))","v":"."},{"$f":"IF(X279=\".\",\".\",SUM($S279:X279))","v":"."},{"$f":"IF(Y279=\".\",\".\",SUM($S279:Y279))","v":"."},null,".",".",".",".",".",".","."]
[null,null,"Special rate","",".",null,null,null,null,null,null,null,null,null,0,0,null,null,".",".",".",".",".",".",".",null,".",".",".",".",".",".",".",null,{"$f":"IF(S280=\".\",\".\",SUM($S280:S280))","v":"."},{"$f":"IF(T280=\".\",\".\",SUM($S280:T280))","v":"."},{"$f":"IF(U280=\".\",\".\",SUM($S280:U280))","v":"."},{"$f":"IF(V280=\".\",\".\",SUM($S280:V280))","v":"."},{"$f":"IF(W280=\".\",\".\",SUM($S280:W280))","v":"."},{"$f":"IF(X280=\".\",\".\",SUM($S280:X280))","v":"."},{"$f":"IF(Y280=\".\",\".\",SUM($S280:Y280))","v":"."},null,".",".",".",".",".",".","."]
[null,null,"Special rate","",".",null,null,null,null,null,null,null,null,null,0,0,null,null,{"$f":"IF(F281=\"\",\".\",F281-E281)","v":"."},{"$f":"IF(G281=\"\",\".\",G281-F281)","v":"."},{"$f":"IF(H281=\"\",\".\",H281-G281)","v":"."},{"$f":"IF(I281=\"\",\".\",I281-H281)","v":"."},{"$f":"IF(J281=\"\",\".\",J281-I281)","v":"."},{"$f":"IF(K281=\"\",\".\",K281-J281)","v":"."},{"$f":"IF(L281=\"\",\".\",L281-K281)","v":"."},null,{"$f":"IF(ISNUMBER(E281),F281/E281-1,\".\")","v":"."},{"$f":"IF(ISNUMBER(F281),G281/F281-1,\".\")","v":"."},{"$f":"IF(ISNUMBER(G281),H281/G281-1,\".\")","v":"."},{"$f":"IF(ISNUMBER(H281),I281/H281-1,\".\")","v":"."},{"$f":"IF(ISNUMBER(I281),J281/I281-1,\".\")","v":"."},{"$f":"IF(ISNUMBER(J281),K281/J281-1,\".\")","v":"."},{"$f":"IF(ISNUMBER(K281),L281/K281-1,\".\")","v":"."},null,{"$f":"IF(S281=\".\",\".\",SUM($S281:S281))","v":"."},{"$f":"IF(T281=\".\",\".\",SUM($S281:T281))","v":"."},{"$f":"IF(U281=\".\",\".\",SUM($S281:U281))","v":"."},{"$f":"IF(V281=\".\",\".\",SUM($S281:V281))","v":"."},{"$f":"IF(W281=\".\",\".\",SUM($S281:W281))","v":"."},{"$f":"IF(X281=\".\",\".\",SUM($S281:X281))","v":"."},{"$f":"IF(Y281=\".\",\".\",SUM($S281:Y281))","v":"."},null,{"$f":"IF(ISNUMBER($E281),F281/$E281-1,\".\")","v":"."},{"$f":"IF(ISNUMBER($E281),G281/$E281-1,\".\")","v":"."},{"$f":"IF(ISNUMBER($E281),H281/$E281-1,\".\")","v":"."},{"$f":"IF(ISNUMBER($E281),I281/$E281-1,\".\")","v":"."},{"$f":"IF(ISNUMBER($E281),J281/$E281-1,\".\")","v":"."},{"$f":"IF(ISNUMBER($E281),K281/$E281-1,\".\")","v":"."},{"$f":"IF(ISNUMBER($E281),L281/$E281-1,\".\")","v":"."}]
[null,null,null,"TOTAL AVERAGE",".",{"$f":"IF($P282=0,\".\",SUMPRODUCT(F262:F281,$P262:$P281)/$P282)","v":"."},".",".",".",".",".",".",null,null,0,0,null,null,{"$f":"IF(F282=\".\",\".\",F282-E282)","v":"."},".",".",".",".",".",".",null,".",".",".",".",".",".",".",null,{"$f":"IF(S282=\".\",\".\",SUM($S282:S282))","v":"."},{"$f":"IF(T282=\".\",\".\",SUM($S282:T282))","v":"."},{"$f":"IF(U282=\".\",\".\",SUM($S282:U282))","v":"."},{"$f":"IF(V282=\".\",\".\",SUM($S282:V282))","v":"."},{"$f":"IF(W282=\".\",\".\",SUM($S282:W282))","v":"."},{"$f":"IF(X282=\".\",\".\",SUM($S282:X282))","v":"."},{"$f":"IF(Y282=\".\",\".\",SUM($S282:Y282))","v":"."},null,".",".",".",".",".",".","."]
[null,null,{"$f":"C158","v":"Mining"},"Not Applicable",".",null,null,null,null,null,null,null,null,null,0,0,null,null,".",".",".",".",".",".",".",null,".",".",".",".",".",".",".",null,{"$f":"IF(S283=\".\",\".\",SUM($S283:S283))","v":"."},{"$f":"IF(T283=\".\",\".\",SUM($S283:T283))","v":"."},{"$f":"IF(U283=\".\",\".\",SUM($S283:U283))","v":"."},{"$f":"IF(V283=\".\",\".\",SUM($S283:V283))","v":"."},{"$f":"IF(W283=\".\",\".\",SUM($S283:W283))","v":"."},{"$f":"IF(X283=\".\",\".\",SUM($S283:X283))","v":"."},{"$f":"IF(Y283=\".\",\".\",SUM($S283:Y283))","v":"."},null,".",".",".",".",".",".","."]
[null,null,"Mining","",".",null,null,null,null,null,null,null,null,null,{"$f":"O159","v":0},0,null,null,".",".",".",".",".",".",".",null,".",".",".",".",".",".",".",null,{"$f":"IF(S284=\".\",\".\",SUM($S284:S284))","v":"."},{"$f":"IF(T284=\".\",\".\",SUM($S284:T284))","v":"."},{"$f":"IF(U284=\".\",\".\",SUM($S284:U284))","v":"."},{"$f":"IF(V284=\".\",\".\",SUM($S284:V284))","v":"."},{"$f":"IF(W284=\".\",\".\",SUM($S284:W284))","v":"."},{"$f":"IF(X284=\".\",\".\",SUM($S284:X284))","v":"."},{"$f":"IF(Y284=\".\",\".\",SUM($S284:Y284))","v":"."},null,".",".",".",".",".",".","."]
[null,null,"Mining","",".",null,null,null,null,null,null,null,null,null,0,0,null,null,".",".",".",".",".",".",".",null,".",".",".",".",".",".",".",null,{"$f":"IF(S285=\".\",\".\",SUM($S285:S285))","v":"."},{"$f":"IF(T285=\".\",\".\",SUM($S285:T285))","v":"."},{"$f":"IF(U285=\".\",\".\",SUM($S285:U285))","v":"."},{"$f":"IF(V285=\".\",\".\",SUM($S285:V285))","v":"."},{"$f":"IF(W285=\".\",\".\",SUM($S285:W285))","v":"."},{"$f":"IF(X285=\".\",\".\",SUM($S285:X285))","v":"."},{"$f":"IF(Y285=\".\",\".\",SUM($S285:Y285))","v":"."},null,".",".",".",".",".",".","."]
[null,null,"Mining","",".",null,null,null,null,null,null,null,null,null,0,0,null,null,".",".",".",".",".",".",".",null,".",".",".",".",".",".",".",null,{"$f":"IF(S286=\".\",\".\",SUM($S286:S286))","v":"."},{"$f":"IF(T286=\".\",\".\",SUM($S286:T286))","v":"."},{"$f":"IF(U286=\".\",\".\",SUM($S286:U286))","v":"."},{"$f":"IF(V286=\".\",\".\",SUM($S286:V286))","v":"."},{"$f":"IF(W286=\".\",\".\",SUM($S286:W286))","v":"."},{"$f":"IF(X286=\".\",\".\",SUM($S286:X286))","v":"."},{"$f":"IF(Y286=\".\",\".\",SUM($S286:Y286))","v":"."},null,".",".",".",".",".",".","."]
[null,null,"Mining","",".",null,null,null,null,null,null,null,null,null,0,0,null,null,".",".",".",".",".",".",".",null,".",".",".",".",".",".",".",null,{"$f":"IF(S287=\".\",\".\",SUM($S287:S287))","v":"."},{"$f":"IF(T287=\".\",\".\",SUM($S287:T287))","v":"."},{"$f":"IF(U287=\".\",\".\",SUM($S287:U287))","v":"."},{"$f":"IF(V287=\".\",\".\",SUM($S287:V287))","v":"."},{"$f":"IF(W287=\".\",\".\",SUM($S287:W287))","v":"."},{"$f":"IF(X287=\".\",\".\",SUM($S287:X287))","v":"."},{"$f":"IF(Y287=\".\",\".\",SUM($S287:Y287))","v":"."},null,".",".",".",".",".",".","."]
[null,null,"Mining","",".",null,null,null,null,null,null,null,null,null,0,0,null,null,".",".",".",".",".",".",".",null,".",".",".",".",".",".",".",null,{"$f":"IF(S288=\".\",\".\",SUM($S288:S288))","v":"."},{"$f":"IF(T288=\".\",\".\",SUM($S288:T288))","v":"."},{"$f":"IF(U288=\".\",\".\",SUM($S288:U288))","v":"."},{"$f":"IF(V288=\".\",\".\",SUM($S288:V288))","v":"."},{"$f":"IF(W288=\".\",\".\",SUM($S288:W288))","v":"."},{"$f":"IF(X288=\".\",\".\",SUM($S288:X288))","v":"."},{"$f":"IF(Y288=\".\",\".\",SUM($S288:Y288))","v":"."},null,".",".",".",".",".",".","."]
[null,null,"Mining","",".",null,null,null,null,null,null,null,null,null,0,0,null,null,".",".",".",".",".",".",".",null,".",".",".",".",".",".",".",null,{"$f":"IF(S289=\".\",\".\",SUM($S289:S289))","v":"."},{"$f":"IF(T289=\".\",\".\",SUM($S289:T289))","v":"."},{"$f":"IF(U289=\".\",\".\",SUM($S289:U289))","v":"."},{"$f":"IF(V289=\".\",\".\",SUM($S289:V289))","v":"."},{"$f":"IF(W289=\".\",\".\",SUM($S289:W289))","v":"."},{"$f":"IF(X289=\".\",\".\",SUM($S289:X289))","v":"."},{"$f":"IF(Y289=\".\",\".\",SUM($S289:Y289))","v":"."},null,".",".",".",".",".",".","."]
[null,null,"Mining","",".",null,null,null,null,null,null,null,null,null,0,0,null,null,".",".",".",".",".",".",".",null,".",".",".",".",".",".",".",null,{"$f":"IF(S290=\".\",\".\",SUM($S290:S290))","v":"."},{"$f":"IF(T290=\".\",\".\",SUM($S290:T290))","v":"."},{"$f":"IF(U290=\".\",\".\",SUM($S290:U290))","v":"."},{"$f":"IF(V290=\".\",\".\",SUM($S290:V290))","v":"."},{"$f":"IF(W290=\".\",\".\",SUM($S290:W290))","v":"."},{"$f":"IF(X290=\".\",\".\",SUM($S290:X290))","v":"."},{"$f":"IF(Y290=\".\",\".\",SUM($S290:Y290))","v":"."},null,".",".",".",".",".",".","."]
[null,null,"Mining","",".",null,null,null,null,null,null,null,null,null,0,0,null,null,".",".",".",".",".",".",".",null,".",".",".",".",".",".",".",null,{"$f":"IF(S291=\".\",\".\",SUM($S291:S291))","v":"."},{"$f":"IF(T291=\".\",\".\",SUM($S291:T291))","v":"."},{"$f":"IF(U291=\".\",\".\",SUM($S291:U291))","v":"."},{"$f":"IF(V291=\".\",\".\",SUM($S291:V291))","v":"."},{"$f":"IF(W291=\".\",\".\",SUM($S291:W291))","v":"."},{"$f":"IF(X291=\".\",\".\",SUM($S291:X291))","v":"."},{"$f":"IF(Y291=\".\",\".\",SUM($S291:Y291))","v":"."},null,".",".",".",".",".",".","."]
[null,null,"Mining","",".",null,null,null,null,null,null,null,null,null,0,0,null,null,".",".",".",".",".",".",".",null,".",".",".",".",".",".",".",null,{"$f":"IF(S292=\".\",\".\",SUM($S292:S292))","v":"."},{"$f":"IF(T292=\".\",\".\",SUM($S292:T292))","v":"."},{"$f":"IF(U292=\".\",\".\",SUM($S292:U292))","v":"."},{"$f":"IF(V292=\".\",\".\",SUM($S292:V292))","v":"."},{"$f":"IF(W292=\".\",\".\",SUM($S292:W292))","v":"."},{"$f":"IF(X292=\".\",\".\",SUM($S292:X292))","v":"."},{"$f":"IF(Y292=\".\",\".\",SUM($S292:Y292))","v":"."},null,".",".",".",".",".",".","."]
[null,null,"Special rate","Not Applicable",".",null,null,null,null,null,null,null,null,null,0,0,null,null,".",".",".",".",".",".",".",null,".",".",".",".",".",".",".",null,{"$f":"IF(S293=\".\",\".\",SUM($S293:S293))","v":"."},{"$f":"IF(T293=\".\",\".\",SUM($S293:T293))","v":"."},{"$f":"IF(U293=\".\",\".\",SUM($S293:U293))","v":"."},{"$f":"IF(V293=\".\",\".\",SUM($S293:V293))","v":"."},{"$f":"IF(W293=\".\",\".\",SUM($S293:W293))","v":"."},{"$f":"IF(X293=\".\",\".\",SUM($S293:X293))","v":"."},{"$f":"IF(Y293=\".\",\".\",SUM($S293:Y293))","v":"."},null,".",".",".",".",".",".","."]
[null,null,"Special rate","",".",null,null,null,null,null,null,null,null,null,0,0,null,null,".",".",".",".",".",".",".",null,".",".",".",".",".",".",".",null,{"$f":"IF(S294=\".\",\".\",SUM($S294:S294))","v":"."},{"$f":"IF(T294=\".\",\".\",SUM($S294:T294))","v":"."},{"$f":"IF(U294=\".\",\".\",SUM($S294:U294))","v":"."},{"$f":"IF(V294=\".\",\".\",SUM($S294:V294))","v":"."},{"$f":"IF(W294=\".\",\".\",SUM($S294:W294))","v":"."},{"$f":"IF(X294=\".\",\".\",SUM($S294:X294))","v":"."},{"$f":"IF(Y294=\".\",\".\",SUM($S294:Y294))","v":"."},null,".",".",".",".",".",".","."]
[null,null,"Special rate","",".",null,null,null,null,null,null,null,null,null,0,0,null,null,".",".",".",".",".",".",".",null,".",".",".",".",".",".",".",null,{"$f":"IF(S295=\".\",\".\",SUM($S295:S295))","v":"."},{"$f":"IF(T295=\".\",\".\",SUM($S295:T295))","v":"."},{"$f":"IF(U295=\".\",\".\",SUM($S295:U295))","v":"."},{"$f":"IF(V295=\".\",\".\",SUM($S295:V295))","v":"."},{"$f":"IF(W295=\".\",\".\",SUM($S295:W295))","v":"."},{"$f":"IF(X295=\".\",\".\",SUM($S295:X295))","v":"."},{"$f":"IF(Y295=\".\",\".\",SUM($S295:Y295))","v":"."},null,".",".",".",".",".",".","."]
[null,null,"Special rate","",".",null,null,null,null,null,null,null,null,null,0,0,null,null,".",".",".",".",".",".",".",null,".",".",".",".",".",".",".",null,{"$f":"IF(S296=\".\",\".\",SUM($S296:S296))","v":"."},{"$f":"IF(T296=\".\",\".\",SUM($S296:T296))","v":"."},{"$f":"IF(U296=\".\",\".\",SUM($S296:U296))","v":"."},{"$f":"IF(V296=\".\",\".\",SUM($S296:V296))","v":"."},{"$f":"IF(W296=\".\",\".\",SUM($S296:W296))","v":"."},{"$f":"IF(X296=\".\",\".\",SUM($S296:X296))","v":"."},{"$f":"IF(Y296=\".\",\".\",SUM($S296:Y296))","v":"."},null,".",".",".",".",".",".","."]
[null,null,"Special rate","",".",null,null,null,null,null,null,null,null,null,0,0,null,null,".",".",".",".",".",".",".",null,".",".",".",".",".",".",".",null,{"$f":"IF(S297=\".\",\".\",SUM($S297:S297))","v":"."},{"$f":"IF(T297=\".\",\".\",SUM($S297:T297))","v":"."},{"$f":"IF(U297=\".\",\".\",SUM($S297:U297))","v":"."},{"$f":"IF(V297=\".\",\".\",SUM($S297:V297))","v":"."},{"$f":"IF(W297=\".\",\".\",SUM($S297:W297))","v":"."},{"$f":"IF(X297=\".\",\".\",SUM($S297:X297))","v":"."},{"$f":"IF(Y297=\".\",\".\",SUM($S297:Y297))","v":"."},null,".",".",".",".",".",".","."]
[null,null,"Special rate","",".",null,null,null,null,null,null,null,null,null,0,0,null,null,".",".",".",".",".",".",".",null,".",".",".",".",".",".",".",null,{"$f":"IF(S298=\".\",\".\",SUM($S298:S298))","v":"."},{"$f":"IF(T298=\".\",\".\",SUM($S298:T298))","v":"."},{"$f":"IF(U298=\".\",\".\",SUM($S298:U298))","v":"."},{"$f":"IF(V298=\".\",\".\",SUM($S298:V298))","v":"."},{"$f":"IF(W298=\".\",\".\",SUM($S298:W298))","v":"."},{"$f":"IF(X298=\".\",\".\",SUM($S298:X298))","v":"."},{"$f":"IF(Y298=\".\",\".\",SUM($S298:Y298))","v":"."},null,".",".",".",".",".",".","."]
[null,null,"Special rate","",".",null,null,null,null,null,null,null,null,null,0,0,null,null,".",".",".",".",".",".",".",null,".",".",".",".",".",".",".",null,{"$f":"IF(S299=\".\",\".\",SUM($S299:S299))","v":"."},{"$f":"IF(T299=\".\",\".\",SUM($S299:T299))","v":"."},{"$f":"IF(U299=\".\",\".\",SUM($S299:U299))","v":"."},{"$f":"IF(V299=\".\",\".\",SUM($S299:V299))","v":"."},{"$f":"IF(W299=\".\",\".\",SUM($S299:W299))","v":"."},{"$f":"IF(X299=\".\",\".\",SUM($S299:X299))","v":"."},{"$f":"IF(Y299=\".\",\".\",SUM($S299:Y299))","v":"."},null,".",".",".",".",".",".","."]
[null,null,"Special rate","",".",null,null,null,null,null,null,null,null,null,0,0,null,null,".",".",".",".",".",".",".",null,".",".",".",".",".",".",".",null,{"$f":"IF(S300=\".\",\".\",SUM($S300:S300))","v":"."},{"$f":"IF(T300=\".\",\".\",SUM($S300:T300))","v":"."},{"$f":"IF(U300=\".\",\".\",SUM($S300:U300))","v":"."},{"$f":"IF(V300=\".\",\".\",SUM($S300:V300))","v":"."},{"$f":"IF(W300=\".\",\".\",SUM($S300:W300))","v":"."},{"$f":"IF(X300=\".\",\".\",SUM($S300:X300))","v":"."},{"$f":"IF(Y300=\".\",\".\",SUM($S300:Y300))","v":"."},null,".",".",".",".",".",".","."]
[null,null,"Special rate","",".",null,null,null,null,null,null,null,null,null,0,0,null,null,".",".",".",".",".",".",".",null,".",".",".",".",".",".",".",null,{"$f":"IF(S301=\".\",\".\",SUM($S301:S301))","v":"."},{"$f":"IF(T301=\".\",\".\",SUM($S301:T301))","v":"."},{"$f":"IF(U301=\".\",\".\",SUM($S301:U301))","v":"."},{"$f":"IF(V301=\".\",\".\",SUM($S301:V301))","v":"."},{"$f":"IF(W301=\".\",\".\",SUM($S301:W301))","v":"."},{"$f":"IF(X301=\".\",\".\",SUM($S301:X301))","v":"."},{"$f":"IF(Y301=\".\",\".\",SUM($S301:Y301))","v":"."},null,".",".",".",".",".",".","."]
[null,null,"Special rate","",".",null,null,null,null,null,null,null,null,null,0,0,null,null,".",".",".",".",".",".",".",null,".",".",".",".",".",".",".",null,{"$f":"IF(S302=\".\",\".\",SUM($S302:S302))","v":"."},{"$f":"IF(T302=\".\",\".\",SUM($S302:T302))","v":"."},{"$f":"IF(U302=\".\",\".\",SUM($S302:U302))","v":"."},{"$f":"IF(V302=\".\",\".\",SUM($S302:V302))","v":"."},{"$f":"IF(W302=\".\",\".\",SUM($S302:W302))","v":"."},{"$f":"IF(X302=\".\",\".\",SUM($S302:X302))","v":"."},{"$f":"IF(Y302=\".\",\".\",SUM($S302:Y302))","v":"."},null,".",".",".",".",".",".","."]
[null,null,null,"TOTAL AVERAGE",".",{"$f":"IF($P303=0,\".\",SUMPRODUCT(F283:F302,$P283:$P302)/$P303)","v":"."},{"$f":"IF($P303=0,\".\",SUMPRODUCT(G283:G302,$P283:$P302)/$P303)","v":"."},{"$f":"IF($P303=0,\".\",SUMPRODUCT(H283:H302,$P283:$P302)/$P303)","v":"."},".",".",".",".",null,null,0,0,null,null,{"$f":"IF(F303=\".\",\".\",F303-E303)","v":"."},{"$f":"IF(G303=\".\",\".\",G303-F303)","v":"."},".",".",".",".",".",null,".",".",".",".",".",".",".",null,{"$f":"IF(S303=\".\",\".\",SUM($S303:S303))","v":"."},{"$f":"IF(T303=\".\",\".\",SUM($S303:T303))","v":"."},{"$f":"IF(U303=\".\",\".\",SUM($S303:U303))","v":"."},{"$f":"IF(V303=\".\",\".\",SUM($S303:V303))","v":"."},{"$f":"IF(W303=\".\",\".\",SUM($S303:W303))","v":"."},{"$f":"IF(X303=\".\",\".\",SUM($S303:X303))","v":"."},{"$f":"IF(Y303=\".\",\".\",SUM($S303:Y303))","v":"."},null,".",".",".",".",".",".","."]
[]
[]
[]
[]
[]
[null,null,"Domestic Waste Management Services - Annual Charge",null,null,null,null,{"$f":"$H$21","v":"$ per year"}]
[null,null,"(Enter the current annual charge and the proposed annual charge for each year of the application.)",null,null,null,null,null,null,null,null,null,null,null,null,null,null,null,{"$f":"S$21","v":"Annual increases (nominal $ per year)"},null,null,null,null,null,null,null,{"$f":"AA$21","v":"Annual increases (%)"},null,null,null,null,null,null,null,{"$f":"AI$21","v":"Cumulative increases (nominal $ per year)"},null,null,null,null,null,null,null,{"$f":"AQ$21","v":"Cumulative increases (%)"}]
[null,null,"Description",null,"Current Average Charge","Annual\nCharge\nYear 1","Annual\nCharge\nYear 2","Annual\nCharge\nYear 3","Annual\nCharge\nYear 4","Annual\nCharge\nYear 5","Annual\nCharge\nYear 6","Annual\nCharge\nYear 7",null,null,null,null,null,null,{"$f":"C309","v":"Domestic Waste Management Services - Annual Charge"},null,null,null,null,null,null,null,{"$f":"$S311","v":"Domestic Waste Management Services - Annual Charge"},null,null,null,null,null,null,null,{"$f":"$S311","v":"Domestic Waste Management Services - Annual Charge"},null,null,null,null,null,null,null,{"$f":"$S311","v":"Domestic Waste Management Services - Annual Charge"}]
[null,null,null,null,{"$f":"E184","v":"2018-19"},"2019-20","2020-21","2021-22","2022-23","2023-24","2024-25","2025-26",null,null,null,null,null,null,{"$f":"S$23","v":"Year 1"},{"$f":"T$23","v":"Year 2"},"Year 3","Year 4","Year 5","Year 6","Year 7",null,{"$f":"AA$23","v":"Year 1"},"Year 2","Year 3","Year 4","Year 5","Year 6","Year 7",null,{"$f":"AI$23","v":"Year 1"},{"$f":"AJ$23","v":"Year 2"},"Year 3","Year 4","Year 5","Year 6","Year 7",null,{"$f":"AQ$23","v":"Year 1"},{"$f":"AR$23","v":"Year 2"},"Year 3","Year 4","Year 5","Year 6","Year 7"]
[null,null,"Residential Waste Charge",null,398.1,408.1,418.3,428.76,439.48,450.47,461.73,473.27,null,null,null,null,null,null,{"$f":"IF(F313=\"\",\".\",F313-E313)","v":10},{"$f":"IF(G313=\"\",\".\",G313-F313)","v":10.199999999999989},{"$f":"IF(H313=\"\",\".\",H313-G313)","v":10.45999999999998},{"$f":"IF(I313=\"\",\".\",I313-H313)","v":10.720000000000027},{"$f":"IF(J313=\"\",\".\",J313-I313)","v":10.990000000000009},{"$f":"IF(K313=\"\",\".\",K313-J313)","v":11.259999999999991},{"$f":"IF(L313=\"\",\".\",L313-K313)","v":11.539999999999964},null,{"$f":"IF(ISNUMBER(E313),F313/E313-1,\".\")","v":2.5119316754584231E-2},{"$f":"IF(ISNUMBER(F313),G313/F313-1,\".\")","v":2.4993874050477816E-2},{"$f":"IF(ISNUMBER(G313),H313/G313-1,\".\")","v":2.5005976571838451E-2},{"$f":"IF(ISNUMBER(H313),I313/H313-1,\".\")","v":2.5002332307118236E-2},{"$f":"IF(ISNUMBER(I313),J313/I313-1,\".\")","v":2.5006826249203584E-2},{"$f":"IF(ISNUMBER(J313),K313/J313-1,\".\")","v":2.4996115168601563E-2},{"$f":"IF(ISNUMBER(K313),L313/K313-1,\".\")","v":2.4992961254412638E-2},null,{"$f":"IF(S313=\".\",\".\",SUM($S313:S313))","v":10},{"$f":"IF(T313=\".\",\".\",SUM($S313:T313))","v":20.199999999999989},{"$f":"IF(U313=\".\",\".\",SUM($S313:U313))","v":30.659999999999968},{"$f":"IF(V313=\".\",\".\",SUM($S313:V313))","v":41.379999999999995},{"$f":"IF(W313=\".\",\".\",SUM($S313:W313))","v":52.370000000000005},{"$f":"IF(X313=\".\",\".\",SUM($S313:X313))","v":63.629999999999995},{"$f":"IF(Y313=\".\",\".\",SUM($S313:Y313))","v":75.169999999999959},null,{"$f":"IF(ISNUMBER($E313),F313/$E313-1,\".\")","v":2.5119316754584231E-2},{"$f":"IF(ISNUMBER($E313),G313/$E313-1,\".\")","v":5.074101984426016E-2},{"$f":"IF(ISNUMBER($E313),H313/$E313-1,\".\")","v":7.7015825169555407E-2},{"$f":"IF(ISNUMBER($E313),I313/$E313-1,\".\")","v":0.10394373273046975},{"$f":"IF(ISNUMBER($E313),J313/$E313-1,\".\")","v":0.13154986184375783},{"$f":"IF(ISNUMBER($E313),K313/$E313-1,\".\")","v":0.15983421250941965},{"$f":"IF(ISNUMBER($E313),L313/$E313-1,\".\")","v":0.18882190404420984}]
[null,null,null,null,null,null,null,null,null,null,null,null,null,null,null,null,null,null,".",".",".",".",".",".",".",null,".",".",".",".",".",".",".",null,{"$f":"IF(S314=\".\",\".\",SUM($S314:S314))","v":"."},{"$f":"IF(T314=\".\",\".\",SUM($S314:T314))","v":"."},{"$f":"IF(U314=\".\",\".\",SUM($S314:U314))","v":"."},{"$f":"IF(V314=\".\",\".\",SUM($S314:V314))","v":"."},{"$f":"IF(W314=\".\",\".\",SUM($S314:W314))","v":"."},{"$f":"IF(X314=\".\",\".\",SUM($S314:X314))","v":"."},{"$f":"IF(Y314=\".\",\".\",SUM($S314:Y314))","v":"."},null,".",".",".",".",".",".","."]
[null,null,null,null,null,null,null,null,null,null,null,null,null,null,null,null,null,null,".",".",".",".",".",".",".",null,".",".",".",".",".",".",".",null,{"$f":"IF(S315=\".\",\".\",SUM($S315:S315))","v":"."},{"$f":"IF(T315=\".\",\".\",SUM($S315:T315))","v":"."},{"$f":"IF(U315=\".\",\".\",SUM($S315:U315))","v":"."},{"$f":"IF(V315=\".\",\".\",SUM($S315:V315))","v":"."},{"$f":"IF(W315=\".\",\".\",SUM($S315:W315))","v":"."},{"$f":"IF(X315=\".\",\".\",SUM($S315:X315))","v":"."},{"$f":"IF(Y315=\".\",\".\",SUM($S315:Y315))","v":"."},null,".",".",".",".",".",".","."]
[null,null,null,null,null,null,null,null,null,null,null,null,null,null,null,null,null,null,".",".",".",".",".",".",".",null,".",".",".",".",".",".",".",null,{"$f":"IF(S316=\".\",\".\",SUM($S316:S316))","v":"."},{"$f":"IF(T316=\".\",\".\",SUM($S316:T316))","v":"."},{"$f":"IF(U316=\".\",\".\",SUM($S316:U316))","v":"."},{"$f":"IF(V316=\".\",\".\",SUM($S316:V316))","v":"."},{"$f":"IF(W316=\".\",\".\",SUM($S316:W316))","v":"."},{"$f":"IF(X316=\".\",\".\",SUM($S316:X316))","v":"."},{"$f":"IF(Y316=\".\",\".\",SUM($S316:Y316))","v":"."},null,".",".",".",".",".",".","."]
[null,null,null,null,null,null,null,null,null,null,null,null,null,null,null,null,null,null,".",".",".",".",".",".",".",null,".",".",".",".",".",".",".",null,{"$f":"IF(S317=\".\",\".\",SUM($S317:S317))","v":"."},{"$f":"IF(T317=\".\",\".\",SUM($S317:T317))","v":"."},{"$f":"IF(U317=\".\",\".\",SUM($S317:U317))","v":"."},{"$f":"IF(V317=\".\",\".\",SUM($S317:V317))","v":"."},{"$f":"IF(W317=\".\",\".\",SUM($S317:W317))","v":"."},{"$f":"IF(X317=\".\",\".\",SUM($S317:X317))","v":"."},{"$f":"IF(Y317=\".\",\".\",SUM($S317:Y317))","v":"."},null,".",".",".",".",".",".","."]
[null,null,null,null,null,null,null,null,null,null,null,null,null,null,null,null,null,null,".",".",".",".",".",".",".",null,".",".",".",".",".",".",".",null,{"$f":"IF(S318=\".\",\".\",SUM($S318:S318))","v":"."},{"$f":"IF(T318=\".\",\".\",SUM($S318:T318))","v":"."},{"$f":"IF(U318=\".\",\".\",SUM($S318:U318))","v":"."},{"$f":"IF(V318=\".\",\".\",SUM($S318:V318))","v":"."},{"$f":"IF(W318=\".\",\".\",SUM($S318:W318))","v":"."},{"$f":"IF(X318=\".\",\".\",SUM($S318:X318))","v":"."},{"$f":"IF(Y318=\".\",\".\",SUM($S318:Y318))","v":"."},null,".",".",".",".",".",".","."]
[null,null,null,null,null,null,null,null,null,null,null,null,null,null,null,null,null,null,".",".",".",".",".",".",".",null,".",".",".",".",".",".",".",null,{"$f":"IF(S319=\".\",\".\",SUM($S319:S319))","v":"."},{"$f":"IF(T319=\".\",\".\",SUM($S319:T319))","v":"."},{"$f":"IF(U319=\".\",\".\",SUM($S319:U319))","v":"."},{"$f":"IF(V319=\".\",\".\",SUM($S319:V319))","v":"."},{"$f":"IF(W319=\".\",\".\",SUM($S319:W319))","v":"."},{"$f":"IF(X319=\".\",\".\",SUM($S319:X319))","v":"."},{"$f":"IF(Y319=\".\",\".\",SUM($S319:Y319))","v":"."},null,".",".",".",".",".",".","."]
[null,null,null,null,null,null,null,null,null,null,null,null,null,null,null,null,null,null,".",".",".",".",".",".",".",null,".",".",".",".",".",".",".",null,{"$f":"IF(S320=\".\",\".\",SUM($S320:S320))","v":"."},{"$f":"IF(T320=\".\",\".\",SUM($S320:T320))","v":"."},{"$f":"IF(U320=\".\",\".\",SUM($S320:U320))","v":"."},{"$f":"IF(V320=\".\",\".\",SUM($S320:V320))","v":"."},{"$f":"IF(W320=\".\",\".\",SUM($S320:W320))","v":"."},{"$f":"IF(X320=\".\",\".\",SUM($S320:X320))","v":"."},{"$f":"IF(Y320=\".\",\".\",SUM($S320:Y320))","v":"."},null,".",".",".",".",".",".","."]
[null,null,null,null,null,null,null,null,null,null,null,null,null,null,null,null,null,null,".",".",".",".",".",".",".",null,".",".",".",".",".",".",".",null,{"$f":"IF(S321=\".\",\".\",SUM($S321:S321))","v":"."},{"$f":"IF(T321=\".\",\".\",SUM($S321:T321))","v":"."},{"$f":"IF(U321=\".\",\".\",SUM($S321:U321))","v":"."},{"$f":"IF(V321=\".\",\".\",SUM($S321:V321))","v":"."},{"$f":"IF(W321=\".\",\".\",SUM($S321:W321))","v":"."},{"$f":"IF(X321=\".\",\".\",SUM($S321:X321))","v":"."},{"$f":"IF(Y321=\".\",\".\",SUM($S321:Y321))","v":"."},null,".",".",".",".",".",".","."]
[null,null,null,null,null,null,null,null,null,null,null,null,null,null,null,null,null,null,".",".",".",".",".",".",".",null,".",".",".",".",".",".",".",null,{"$f":"IF(S322=\".\",\".\",SUM($S322:S322))","v":"."},{"$f":"IF(T322=\".\",\".\",SUM($S322:T322))","v":"."},{"$f":"IF(U322=\".\",\".\",SUM($S322:U322))","v":"."},{"$f":"IF(V322=\".\",\".\",SUM($S322:V322))","v":"."},{"$f":"IF(W322=\".\",\".\",SUM($S322:W322))","v":"."},{"$f":"IF(X322=\".\",\".\",SUM($S322:X322))","v":"."},{"$f":"IF(Y322=\".\",\".\",SUM($S322:Y322))","v":"."},null,".",".",".",".",".",".","."]
[null,null,null,null,null,null,null,null,null,null,null,null,null,null,null,null,null,null,".",".",".",".",".",".",".",null,".",".",".",".",".",".",".",null,{"$f":"IF(S323=\".\",\".\",SUM($S323:S323))","v":"."},{"$f":"IF(T323=\".\",\".\",SUM($S323:T323))","v":"."},{"$f":"IF(U323=\".\",\".\",SUM($S323:U323))","v":"."},{"$f":"IF(V323=\".\",\".\",SUM($S323:V323))","v":"."},{"$f":"IF(W323=\".\",\".\",SUM($S323:W323))","v":"."},{"$f":"IF(X323=\".\",\".\",SUM($S323:X323))","v":"."},{"$f":"IF(Y323=\".\",\".\",SUM($S323:Y323))","v":"."},null,".",".",".",".",".",".","."]
[null,null,null,null,null,null,null,null,null,null,null,null,null,null,null,null,null,null,".",".",".",".",".",".",".",null,".",".",".",".",".",".",".",null,{"$f":"IF(S324=\".\",\".\",SUM($S324:S324))","v":"."},{"$f":"IF(T324=\".\",\".\",SUM($S324:T324))","v":"."},{"$f":"IF(U324=\".\",\".\",SUM($S324:U324))","v":"."},{"$f":"IF(V324=\".\",\".\",SUM($S324:V324))","v":"."},{"$f":"IF(W324=\".\",\".\",SUM($S324:W324))","v":"."},{"$f":"IF(X324=\".\",\".\",SUM($S324:X324))","v":"."},{"$f":"IF(Y324=\".\",\".\",SUM($S324:Y324))","v":"."},null,".",".",".",".",".",".","."]
[null,null,null,null,null,null,null,null,null,null,null,null,null,null,null,null,null,null,".",".",".",".",".",".",".",null,".",".",".",".",".",".",".",null,{"$f":"IF(S325=\".\",\".\",SUM($S325:S325))","v":"."},{"$f":"IF(T325=\".\",\".\",SUM($S325:T325))","v":"."},{"$f":"IF(U325=\".\",\".\",SUM($S325:U325))","v":"."},{"$f":"IF(V325=\".\",\".\",SUM($S325:V325))","v":"."},{"$f":"IF(W325=\".\",\".\",SUM($S325:W325))","v":"."},{"$f":"IF(X325=\".\",\".\",SUM($S325:X325))","v":"."},{"$f":"IF(Y325=\".\",\".\",SUM($S325:Y325))","v":"."},null,".",".",".",".",".",".","."]
[null,null,null,null,null,null,null,null,null,null,null,null,null,null,null,null,null,null,".",".",".",".",".",".",".",null,".",".",".",".",".",".",".",null,{"$f":"IF(S326=\".\",\".\",SUM($S326:S326))","v":"."},{"$f":"IF(T326=\".\",\".\",SUM($S326:T326))","v":"."},{"$f":"IF(U326=\".\",\".\",SUM($S326:U326))","v":"."},{"$f":"IF(V326=\".\",\".\",SUM($S326:V326))","v":"."},{"$f":"IF(W326=\".\",\".\",SUM($S326:W326))","v":"."},{"$f":"IF(X326=\".\",\".\",SUM($S326:X326))","v":"."},{"$f":"IF(Y326=\".\",\".\",SUM($S326:Y326))","v":"."},null,".",".",".",".",".",".","."]
[null,null,null,null,null,null,null,null,null,null,null,null,null,null,null,null,null,null,".",".",".",".",".",".",".",null,".",".",".",".",".",".",".",null,{"$f":"IF(S327=\".\",\".\",SUM($S327:S327))","v":"."},{"$f":"IF(T327=\".\",\".\",SUM($S327:T327))","v":"."},{"$f":"IF(U327=\".\",\".\",SUM($S327:U327))","v":"."},{"$f":"IF(V327=\".\",\".\",SUM($S327:V327))","v":"."},{"$f":"IF(W327=\".\",\".\",SUM($S327:W327))","v":"."},{"$f":"IF(X327=\".\",\".\",SUM($S327:X327))","v":"."},{"$f":"IF(Y327=\".\",\".\",SUM($S327:Y327))","v":"."},null,".",".",".",".",".",".","."]
[null,null,null,null,null,null,null,null,null,null,null,null,null,null,null,null,null,null,".",".",".",".",".",".",".",null,".",".",".",".",".",".",".",null,{"$f":"IF(S328=\".\",\".\",SUM($S328:S328))","v":"."},{"$f":"IF(T328=\".\",\".\",SUM($S328:T328))","v":"."},{"$f":"IF(U328=\".\",\".\",SUM($S328:U328))","v":"."},{"$f":"IF(V328=\".\",\".\",SUM($S328:V328))","v":"."},{"$f":"IF(W328=\".\",\".\",SUM($S328:W328))","v":"."},{"$f":"IF(X328=\".\",\".\",SUM($S328:X328))","v":"."},{"$f":"IF(Y328=\".\",\".\",SUM($S328:Y328))","v":"."},null,".",".",".",".",".",".","."]
[null,null,null,null,null,null,null,null,null,null,null,null,null,null,null,null,null,null,".",".",".",".",".",".",".",null,".",".",".",".",".",".",".",null,{"$f":"IF(S329=\".\",\".\",SUM($S329:S329))","v":"."},{"$f":"IF(T329=\".\",\".\",SUM($S329:T329))","v":"."},{"$f":"IF(U329=\".\",\".\",SUM($S329:U329))","v":"."},{"$f":"IF(V329=\".\",\".\",SUM($S329:V329))","v":"."},{"$f":"IF(W329=\".\",\".\",SUM($S329:W329))","v":"."},{"$f":"IF(X329=\".\",\".\",SUM($S329:X329))","v":"."},{"$f":"IF(Y329=\".\",\".\",SUM($S329:Y329))","v":"."},null,".",".",".",".",".",".","."]
[null,null,null,null,null,null,null,null,null,null,null,null,null,null,null,null,null,null,".",".",".",".",".",".",".",null,".",".",".",".",".",".",".",null,{"$f":"IF(S330=\".\",\".\",SUM($S330:S330))","v":"."},{"$f":"IF(T330=\".\",\".\",SUM($S330:T330))","v":"."},{"$f":"IF(U330=\".\",\".\",SUM($S330:U330))","v":"."},{"$f":"IF(V330=\".\",\".\",SUM($S330:V330))","v":"."},{"$f":"IF(W330=\".\",\".\",SUM($S330:W330))","v":"."},{"$f":"IF(X330=\".\",\".\",SUM($S330:X330))","v":"."},{"$f":"IF(Y330=\".\",\".\",SUM($S330:Y330))","v":"."},null,".",".",".",".",".",".","."]
[null,null,null,null,null,null,null,null,null,null,null,null,null,null,null,null,null,null,".",".",".",".",".",".",".",null,".",".",".",".",".",".",".",null,{"$f":"IF(S331=\".\",\".\",SUM($S331:S331))","v":"."},{"$f":"IF(T331=\".\",\".\",SUM($S331:T331))","v":"."},{"$f":"IF(U331=\".\",\".\",SUM($S331:U331))","v":"."},{"$f":"IF(V331=\".\",\".\",SUM($S331:V331))","v":"."},{"$f":"IF(W331=\".\",\".\",SUM($S331:W331))","v":"."},{"$f":"IF(X331=\".\",\".\",SUM($S331:X331))","v":"."},{"$f":"IF(Y331=\".\",\".\",SUM($S331:Y331))","v":"."},null,".",".",".",".",".",".","."]
[null,null,null,null,null,null,null,null,null,null,null,null,null,null,null,null,null,null,".",".",".",".",".",".",".",null,".",".",".",".",".",".",".",null,{"$f":"IF(S332=\".\",\".\",SUM($S332:S332))","v":"."},{"$f":"IF(T332=\".\",\".\",SUM($S332:T332))","v":"."},{"$f":"IF(U332=\".\",\".\",SUM($S332:U332))","v":"."},{"$f":"IF(V332=\".\",\".\",SUM($S332:V332))","v":"."},{"$f":"IF(W332=\".\",\".\",SUM($S332:W332))","v":"."},{"$f":"IF(X332=\".\",\".\",SUM($S332:X332))","v":"."},{"$f":"IF(Y332=\".\",\".\",SUM($S332:Y332))","v":"."},null,".",".",".",".",".",".","."]
[null,null,null,null,null,null,null,null,null,null,null,null,null,null,null,null,null,null,".",".",".",".",".",".",".",null,".",".",".",".",".",".",".",null,{"$f":"IF(S333=\".\",\".\",SUM($S333:S333))","v":"."},{"$f":"IF(T333=\".\",\".\",SUM($S333:T333))","v":"."},{"$f":"IF(U333=\".\",\".\",SUM($S333:U333))","v":"."},{"$f":"IF(V333=\".\",\".\",SUM($S333:V333))","v":"."},{"$f":"IF(W333=\".\",\".\",SUM($S333:W333))","v":"."},{"$f":"IF(X333=\".\",\".\",SUM($S333:X333))","v":"."},{"$f":"IF(Y333=\".\",\".\",SUM($S333:Y333))","v":"."},null,".",".",".",".",".",".","."]
[null,null,null,null,null,null,null,null,null,null,null,null,null,null,null,null,null,null,".",".",".",".",".",".",".",null,".",".",".",".",".",".",".",null,{"$f":"IF(S334=\".\",\".\",SUM($S334:S334))","v":"."},{"$f":"IF(T334=\".\",\".\",SUM($S334:T334))","v":"."},{"$f":"IF(U334=\".\",\".\",SUM($S334:U334))","v":"."},{"$f":"IF(V334=\".\",\".\",SUM($S334:V334))","v":"."},{"$f":"IF(W334=\".\",\".\",SUM($S334:W334))","v":"."},{"$f":"IF(X334=\".\",\".\",SUM($S334:X334))","v":"."},{"$f":"IF(Y334=\".\",\".\",SUM($S334:Y334))","v":"."},null,".",".",".",".",".",".","."]
[null,null,null,null,null,null,null,null,null,null,null,null,null,null,null,null,null,null,".",".",".",".",".",".",".",null,".",".",".",".",".",".",".",null,{"$f":"IF(S335=\".\",\".\",SUM($S335:S335))","v":"."},{"$f":"IF(T335=\".\",\".\",SUM($S335:T335))","v":"."},{"$f":"IF(U335=\".\",\".\",SUM($S335:U335))","v":"."},{"$f":"IF(V335=\".\",\".\",SUM($S335:V335))","v":"."},{"$f":"IF(W335=\".\",\".\",SUM($S335:W335))","v":"."},{"$f":"IF(X335=\".\",\".\",SUM($S335:X335))","v":"."},{"$f":"IF(Y335=\".\",\".\",SUM($S335:Y335))","v":"."},null,".",".",".",".",".",".","."]
[null,null,null,null,null,null,null,null,null,null,null,null,null,null,null,null,null,null,".",".",".",".",".",".",".",null,".",".",".",".",".",".",".",null,{"$f":"IF(S336=\".\",\".\",SUM($S336:S336))","v":"."},{"$f":"IF(T336=\".\",\".\",SUM($S336:T336))","v":"."},{"$f":"IF(U336=\".\",\".\",SUM($S336:U336))","v":"."},{"$f":"IF(V336=\".\",\".\",SUM($S336:V336))","v":"."},{"$f":"IF(W336=\".\",\".\",SUM($S336:W336))","v":"."},{"$f":"IF(X336=\".\",\".\",SUM($S336:X336))","v":"."},{"$f":"IF(Y336=\".\",\".\",SUM($S336:Y336))","v":"."},null,".",".",".",".",".",".","."]
[null,null,null,null,null,null,null,null,null,null,null,null,null,null,null,null,null,null,".",".",".",".",".",".",".",null,".",".",".",".",".",".",".",null,{"$f":"IF(S337=\".\",\".\",SUM($S337:S337))","v":"."},{"$f":"IF(T337=\".\",\".\",SUM($S337:T337))","v":"."},{"$f":"IF(U337=\".\",\".\",SUM($S337:U337))","v":"."},{"$f":"IF(V337=\".\",\".\",SUM($S337:V337))","v":"."},{"$f":"IF(W337=\".\",\".\",SUM($S337:W337))","v":"."},{"$f":"IF(X337=\".\",\".\",SUM($S337:X337))","v":"."},{"$f":"IF(Y337=\".\",\".\",SUM($S337:Y337))","v":"."},null,".",".",".",".",".",".","."]
[null,null,null,null,null,null,null,null,null,null,null,null,null,null,null,null,null,null,".",".",".",".",".",".",".",null,".",".",".",".",".",".",".",null,{"$f":"IF(S338=\".\",\".\",SUM($S338:S338))","v":"."},{"$f":"IF(T338=\".\",\".\",SUM($S338:T338))","v":"."},{"$f":"IF(U338=\".\",\".\",SUM($S338:U338))","v":"."},{"$f":"IF(V338=\".\",\".\",SUM($S338:V338))","v":"."},{"$f":"IF(W338=\".\",\".\",SUM($S338:W338))","v":"."},{"$f":"IF(X338=\".\",\".\",SUM($S338:X338))","v":"."},{"$f":"IF(Y338=\".\",\".\",SUM($S338:Y338))","v":"."},null,".",".",".",".",".",".","."]
[]
[]
[null,null,"Water Supply Services - Annual Charge"]
[]
[null,null,"Water Supply Services - Annual Charge",null,null,{"$f":"$H$21","v":"$ per year"}]
[null,null,"(Enter the current annual charge and the proposed annual charge for each year of the application.)",null,null,null,null,null,null,null,null,null,null,null,null,null,null,null,{"$f":"S$21","v":"Annual increases (nominal $ per year)"},null,null,null,null,null,null,null,{"$f":"AA$21","v":"Annual increases (%)"},null,null,null,null,null,null,null,{"$f":"AI$21","v":"Cumulative increases (nominal $ per year)"},null,null,null,null,null,null,null,{"$f":"AQ$21","v":"Cumulative increases (%)"}]
[null,null,"Description",null,"Current Average Charge","Annual\nCharge\nYear 1","Annual\nCharge\nYear 2","Annual\nCharge\nYear 3","Annual\nCharge\nYear 4","Annual\nCharge\nYear 5","Annual\nCharge\nYear 6","Annual\nCharge\nYear 7",null,null,null,null,null,null,{"$f":"C343","v":"Water Supply Services - Annual Charge"},null,null,null,null,null,null,null,{"$f":"$S345","v":"Water Supply Services - Annual Charge"},null,null,null,null,null,null,null,{"$f":"$S345","v":"Water Supply Services - Annual Charge"},null,null,null,null,null,null,null,{"$f":"$S345","v":"Water Supply Services - Annual Charge"}]
[null,null,null,null,{"$f":"E312","v":"2018-19"},{"$f":"F312","v":"2019-20"},{"$f":"G312","v":"2020-21"},"2021-22","2022-23","2023-24","2024-25","2025-26",null,null,null,null,null,null,{"$f":"S$23","v":"Year 1"},{"$f":"T$23","v":"Year 2"},"Year 3","Year 4","Year 5","Year 6","Year 7",null,{"$f":"AA$23","v":"Year 1"},"Year 2","Year 3","Year 4","Year 5","Year 6","Year 7",null,{"$f":"AI$23","v":"Year 1"},{"$f":"AJ$23","v":"Year 2"},"Year 3","Year 4","Year 5","Year 6","Year 7",null,{"$f":"AQ$23","v":"Year 1"},{"$f":"AR$23","v":"Year 2"},"Year 3","Year 4","Year 5","Year 6","Year 7"]
[null,null,"Not Applicable",null,null,null,null,null,null,null,null,null,null,null,null,null,null,null,{"$f":"IF(F347=\"\",\".\",F347-E347)","v":"."},{"$f":"IF(G347=\"\",\".\",G347-F347)","v":"."},{"$f":"IF(H347=\"\",\".\",H347-G347)","v":"."},{"$f":"IF(I347=\"\",\".\",I347-H347)","v":"."},{"$f":"IF(J347=\"\",\".\",J347-I347)","v":"."},{"$f":"IF(K347=\"\",\".\",K347-J347)","v":"."},{"$f":"IF(L347=\"\",\".\",L347-K347)","v":"."},null,{"$f":"IF(ISNUMBER(E347),F347/E347-1,\".\")","v":"."},{"$f":"IF(ISNUMBER(F347),G347/F347-1,\".\")","v":"."},{"$f":"IF(ISNUMBER(G347),H347/G347-1,\".\")","v":"."},{"$f":"IF(ISNUMBER(H347),I347/H347-1,\".\")","v":"."},{"$f":"IF(ISNUMBER(I347),J347/I347-1,\".\")","v":"."},{"$f":"IF(ISNUMBER(J347),K347/J347-1,\".\")","v":"."},{"$f":"IF(ISNUMBER(K347),L347/K347-1,\".\")","v":"."},null,{"$f":"IF(S347=\".\",\".\",SUM($S347:S347))","v":"."},{"$f":"IF(T347=\".\",\".\",SUM($S347:T347))","v":"."},{"$f":"IF(U347=\".\",\".\",SUM($S347:U347))","v":"."},{"$f":"IF(V347=\".\",\".\",SUM($S347:V347))","v":"."},{"$f":"IF(W347=\".\",\".\",SUM($S347:W347))","v":"."},{"$f":"IF(X347=\".\",\".\",SUM($S347:X347))","v":"."},{"$f":"IF(Y347=\".\",\".\",SUM($S347:Y347))","v":"."},null,{"$f":"IF(ISNUMBER($E347),F347/$E347-1,\".\")","v":"."},{"$f":"IF(ISNUMBER($E347),G347/$E347-1,\".\")","v":"."},{"$f":"IF(ISNUMBER($E347),H347/$E347-1,\".\")","v":"."},{"$f":"IF(ISNUMBER($E347),I347/$E347-1,\".\")","v":"."},{"$f":"IF(ISNUMBER($E347),J347/$E347-1,\".\")","v":"."},{"$f":"IF(ISNUMBER($E347),K347/$E347-1,\".\")","v":"."},{"$f":"IF(ISNUMBER($E347),L347/$E347-1,\".\")","v":"."}]
[null,null,null,null,null,null,null,null,null,null,null,null,null,null,null,null,null,null,".",".",".",".",".",".",".",null,".",".",".",".",".",".",".",null,{"$f":"IF(S348=\".\",\".\",SUM($S348:S348))","v":"."},{"$f":"IF(T348=\".\",\".\",SUM($S348:T348))","v":"."},{"$f":"IF(U348=\".\",\".\",SUM($S348:U348))","v":"."},{"$f":"IF(V348=\".\",\".\",SUM($S348:V348))","v":"."},{"$f":"IF(W348=\".\",\".\",SUM($S348:W348))","v":"."},{"$f":"IF(X348=\".\",\".\",SUM($S348:X348))","v":"."},{"$f":"IF(Y348=\".\",\".\",SUM($S348:Y348))","v":"."},null,".",".",".",".",".",".","."]
[null,null,null,null,null,null,null,null,null,null,null,null,null,null,null,null,null,null,".",".",".",".",".",".",".",null,".",".",".",".",".",".",".",null,{"$f":"IF(S349=\".\",\".\",SUM($S349:S349))","v":"."},{"$f":"IF(T349=\".\",\".\",SUM($S349:T349))","v":"."},{"$f":"IF(U349=\".\",\".\",SUM($S349:U349))","v":"."},{"$f":"IF(V349=\".\",\".\",SUM($S349:V349))","v":"."},{"$f":"IF(W349=\".\",\".\",SUM($S349:W349))","v":"."},{"$f":"IF(X349=\".\",\".\",SUM($S349:X349))","v":"."},{"$f":"IF(Y349=\".\",\".\",SUM($S349:Y349))","v":"."},null,".",".",".",".",".",".","."]
[null,null,null,null,null,null,null,null,null,null,null,null,null,null,null,null,null,null,".",".",".",".",".",".",".",null,".",".",".",".",".",".",".",null,{"$f":"IF(S350=\".\",\".\",SUM($S350:S350))","v":"."},{"$f":"IF(T350=\".\",\".\",SUM($S350:T350))","v":"."},{"$f":"IF(U350=\".\",\".\",SUM($S350:U350))","v":"."},{"$f":"IF(V350=\".\",\".\",SUM($S350:V350))","v":"."},{"$f":"IF(W350=\".\",\".\",SUM($S350:W350))","v":"."},{"$f":"IF(X350=\".\",\".\",SUM($S350:X350))","v":"."},{"$f":"IF(Y350=\".\",\".\",SUM($S350:Y350))","v":"."},null,".",".",".",".",".",".","."]
[null,null,null,null,null,null,null,null,null,null,null,null,null,null,null,null,null,null,".",".",".",".",".",".",".",null,".",".",".",".",".",".",".",null,{"$f":"IF(S351=\".\",\".\",SUM($S351:S351))","v":"."},{"$f":"IF(T351=\".\",\".\",SUM($S351:T351))","v":"."},{"$f":"IF(U351=\".\",\".\",SUM($S351:U351))","v":"."},{"$f":"IF(V351=\".\",\".\",SUM($S351:V351))","v":"."},{"$f":"IF(W351=\".\",\".\",SUM($S351:W351))","v":"."},{"$f":"IF(X351=\".\",\".\",SUM($S351:X351))","v":"."},{"$f":"IF(Y351=\".\",\".\",SUM($S351:Y351))","v":"."},null,".",".",".",".",".",".","."]
[null,null,null,null,null,null,null,null,null,null,null,null,null,null,null,null,null,null,".",".",".",".",".",".",".",null,".",".",".",".",".",".",".",null,{"$f":"IF(S352=\".\",\".\",SUM($S352:S352))","v":"."},{"$f":"IF(T352=\".\",\".\",SUM($S352:T352))","v":"."},{"$f":"IF(U352=\".\",\".\",SUM($S352:U352))","v":"."},{"$f":"IF(V352=\".\",\".\",SUM($S352:V352))","v":"."},{"$f":"IF(W352=\".\",\".\",SUM($S352:W352))","v":"."},{"$f":"IF(X352=\".\",\".\",SUM($S352:X352))","v":"."},{"$f":"IF(Y352=\".\",\".\",SUM($S352:Y352))","v":"."},null,".",".",".",".",".",".","."]
[null,null,null,null,null,null,null,null,null,null,null,null,null,null,null,null,null,null,".",".",".",".",".",".",".",null,".",".",".",".",".",".",".",null,{"$f":"IF(S353=\".\",\".\",SUM($S353:S353))","v":"."},{"$f":"IF(T353=\".\",\".\",SUM($S353:T353))","v":"."},{"$f":"IF(U353=\".\",\".\",SUM($S353:U353))","v":"."},{"$f":"IF(V353=\".\",\".\",SUM($S353:V353))","v":"."},{"$f":"IF(W353=\".\",\".\",SUM($S353:W353))","v":"."},{"$f":"IF(X353=\".\",\".\",SUM($S353:X353))","v":"."},{"$f":"IF(Y353=\".\",\".\",SUM($S353:Y353))","v":"."},null,".",".",".",".",".",".","."]
[null,null,null,null,null,null,null,null,null,null,null,null,null,null,null,null,null,null,".",".",".",".",".",".",".",null,".",".",".",".",".",".",".",null,{"$f":"IF(S354=\".\",\".\",SUM($S354:S354))","v":"."},{"$f":"IF(T354=\".\",\".\",SUM($S354:T354))","v":"."},{"$f":"IF(U354=\".\",\".\",SUM($S354:U354))","v":"."},{"$f":"IF(V354=\".\",\".\",SUM($S354:V354))","v":"."},{"$f":"IF(W354=\".\",\".\",SUM($S354:W354))","v":"."},{"$f":"IF(X354=\".\",\".\",SUM($S354:X354))","v":"."},{"$f":"IF(Y354=\".\",\".\",SUM($S354:Y354))","v":"."},null,".",".",".",".",".",".","."]
[null,null,null,null,null,null,null,null,null,null,null,null,null,null,null,null,null,null,".",".",".",".",".",".",".",null,".",".",".",".",".",".",".",null,{"$f":"IF(S355=\".\",\".\",SUM($S355:S355))","v":"."},{"$f":"IF(T355=\".\",\".\",SUM($S355:T355))","v":"."},{"$f":"IF(U355=\".\",\".\",SUM($S355:U355))","v":"."},{"$f":"IF(V355=\".\",\".\",SUM($S355:V355))","v":"."},{"$f":"IF(W355=\".\",\".\",SUM($S355:W355))","v":"."},{"$f":"IF(X355=\".\",\".\",SUM($S355:X355))","v":"."},{"$f":"IF(Y355=\".\",\".\",SUM($S355:Y355))","v":"."},null,".",".",".",".",".",".","."]
[null,null,null,null,null,null,null,null,null,null,null,null,null,null,null,null,null,null,".",".",".",".",".",".",".",null,".",".",".",".",".",".",".",null,{"$f":"IF(S356=\".\",\".\",SUM($S356:S356))","v":"."},{"$f":"IF(T356=\".\",\".\",SUM($S356:T356))","v":"."},{"$f":"IF(U356=\".\",\".\",SUM($S356:U356))","v":"."},{"$f":"IF(V356=\".\",\".\",SUM($S356:V356))","v":"."},{"$f":"IF(W356=\".\",\".\",SUM($S356:W356))","v":"."},{"$f":"IF(X356=\".\",\".\",SUM($S356:X356))","v":"."},{"$f":"IF(Y356=\".\",\".\",SUM($S356:Y356))","v":"."},null,".",".",".",".",".",".","."]
[null,null,null,null,null,null,null,null,null,null,null,null,null,null,null,null,null,null,".",".",".",".",".",".",".",null,".",".",".",".",".",".",".",null,{"$f":"IF(S357=\".\",\".\",SUM($S357:S357))","v":"."},{"$f":"IF(T357=\".\",\".\",SUM($S357:T357))","v":"."},{"$f":"IF(U357=\".\",\".\",SUM($S357:U357))","v":"."},{"$f":"IF(V357=\".\",\".\",SUM($S357:V357))","v":"."},{"$f":"IF(W357=\".\",\".\",SUM($S357:W357))","v":"."},{"$f":"IF(X357=\".\",\".\",SUM($S357:X357))","v":"."},{"$f":"IF(Y357=\".\",\".\",SUM($S357:Y357))","v":"."},null,".",".",".",".",".",".","."]
[null,null,null,null,null,null,null,null,null,null,null,null,null,null,null,null,null,null,".",".",".",".",".",".",".",null,".",".",".",".",".",".",".",null,{"$f":"IF(S358=\".\",\".\",SUM($S358:S358))","v":"."},{"$f":"IF(T358=\".\",\".\",SUM($S358:T358))","v":"."},{"$f":"IF(U358=\".\",\".\",SUM($S358:U358))","v":"."},{"$f":"IF(V358=\".\",\".\",SUM($S358:V358))","v":"."},{"$f":"IF(W358=\".\",\".\",SUM($S358:W358))","v":"."},{"$f":"IF(X358=\".\",\".\",SUM($S358:X358))","v":"."},{"$f":"IF(Y358=\".\",\".\",SUM($S358:Y358))","v":"."},null,".",".",".",".",".",".","."]
[null,null,null,null,null,null,null,null,null,null,null,null,null,null,null,null,null,null,".",".",".",".",".",".",".",null,".",".",".",".",".",".",".",null,{"$f":"IF(S359=\".\",\".\",SUM($S359:S359))","v":"."},{"$f":"IF(T359=\".\",\".\",SUM($S359:T359))","v":"."},{"$f":"IF(U359=\".\",\".\",SUM($S359:U359))","v":"."},{"$f":"IF(V359=\".\",\".\",SUM($S359:V359))","v":"."},{"$f":"IF(W359=\".\",\".\",SUM($S359:W359))","v":"."},{"$f":"IF(X359=\".\",\".\",SUM($S359:X359))","v":"."},{"$f":"IF(Y359=\".\",\".\",SUM($S359:Y359))","v":"."},null,".",".",".",".",".",".","."]
[null,null,null,null,null,null,null,null,null,null,null,null,null,null,null,null,null,null,".",".",".",".",".",".",".",null,".",".",".",".",".",".",".",null,{"$f":"IF(S360=\".\",\".\",SUM($S360:S360))","v":"."},{"$f":"IF(T360=\".\",\".\",SUM($S360:T360))","v":"."},{"$f":"IF(U360=\".\",\".\",SUM($S360:U360))","v":"."},{"$f":"IF(V360=\".\",\".\",SUM($S360:V360))","v":"."},{"$f":"IF(W360=\".\",\".\",SUM($S360:W360))","v":"."},{"$f":"IF(X360=\".\",\".\",SUM($S360:X360))","v":"."},{"$f":"IF(Y360=\".\",\".\",SUM($S360:Y360))","v":"."},null,".",".",".",".",".",".","."]
[null,null,null,null,null,null,null,null,null,null,null,null,null,null,null,null,null,null,".",".",".",".",".",".",".",null,".",".",".",".",".",".",".",null,{"$f":"IF(S361=\".\",\".\",SUM($S361:S361))","v":"."},{"$f":"IF(T361=\".\",\".\",SUM($S361:T361))","v":"."},{"$f":"IF(U361=\".\",\".\",SUM($S361:U361))","v":"."},{"$f":"IF(V361=\".\",\".\",SUM($S361:V361))","v":"."},{"$f":"IF(W361=\".\",\".\",SUM($S361:W361))","v":"."},{"$f":"IF(X361=\".\",\".\",SUM($S361:X361))","v":"."},{"$f":"IF(Y361=\".\",\".\",SUM($S361:Y361))","v":"."},null,".",".",".",".",".",".","."]
[null,null,null,null,null,null,null,null,null,null,null,null,null,null,null,null,null,null,".",".",".",".",".",".",".",null,".",".",".",".",".",".",".",null,{"$f":"IF(S362=\".\",\".\",SUM($S362:S362))","v":"."},{"$f":"IF(T362=\".\",\".\",SUM($S362:T362))","v":"."},{"$f":"IF(U362=\".\",\".\",SUM($S362:U362))","v":"."},{"$f":"IF(V362=\".\",\".\",SUM($S362:V362))","v":"."},{"$f":"IF(W362=\".\",\".\",SUM($S362:W362))","v":"."},{"$f":"IF(X362=\".\",\".\",SUM($S362:X362))","v":"."},{"$f":"IF(Y362=\".\",\".\",SUM($S362:Y362))","v":"."},null,".",".",".",".",".",".","."]
[null,null,null,null,null,null,null,null,null,null,null,null,null,null,null,null,null,null,".",".",".",".",".",".",".",null,".",".",".",".",".",".",".",null,{"$f":"IF(S363=\".\",\".\",SUM($S363:S363))","v":"."},{"$f":"IF(T363=\".\",\".\",SUM($S363:T363))","v":"."},{"$f":"IF(U363=\".\",\".\",SUM($S363:U363))","v":"."},{"$f":"IF(V363=\".\",\".\",SUM($S363:V363))","v":"."},{"$f":"IF(W363=\".\",\".\",SUM($S363:W363))","v":"."},{"$f":"IF(X363=\".\",\".\",SUM($S363:X363))","v":"."},{"$f":"IF(Y363=\".\",\".\",SUM($S363:Y363))","v":"."},null,".",".",".",".",".",".","."]
[null,null,null,null,null,null,null,null,null,null,null,null,null,null,null,null,null,null,".",".",".",".",".",".",".",null,".",".",".",".",".",".",".",null,{"$f":"IF(S364=\".\",\".\",SUM($S364:S364))","v":"."},{"$f":"IF(T364=\".\",\".\",SUM($S364:T364))","v":"."},{"$f":"IF(U364=\".\",\".\",SUM($S364:U364))","v":"."},{"$f":"IF(V364=\".\",\".\",SUM($S364:V364))","v":"."},{"$f":"IF(W364=\".\",\".\",SUM($S364:W364))","v":"."},{"$f":"IF(X364=\".\",\".\",SUM($S364:X364))","v":"."},{"$f":"IF(Y364=\".\",\".\",SUM($S364:Y364))","v":"."},null,".",".",".",".",".",".","."]
[null,null,null,null,null,null,null,null,null,null,null,null,null,null,null,null,null,null,".",".",".",".",".",".",".",null,".",".",".",".",".",".",".",null,{"$f":"IF(S365=\".\",\".\",SUM($S365:S365))","v":"."},{"$f":"IF(T365=\".\",\".\",SUM($S365:T365))","v":"."},{"$f":"IF(U365=\".\",\".\",SUM($S365:U365))","v":"."},{"$f":"IF(V365=\".\",\".\",SUM($S365:V365))","v":"."},{"$f":"IF(W365=\".\",\".\",SUM($S365:W365))","v":"."},{"$f":"IF(X365=\".\",\".\",SUM($S365:X365))","v":"."},{"$f":"IF(Y365=\".\",\".\",SUM($S365:Y365))","v":"."},null,".",".",".",".",".",".","."]
[null,null,null,null,null,null,null,null,null,null,null,null,null,null,null,null,null,null,".",".",".",".",".",".",".",null,".",".",".",".",".",".",".",null,{"$f":"IF(S366=\".\",\".\",SUM($S366:S366))","v":"."},{"$f":"IF(T366=\".\",\".\",SUM($S366:T366))","v":"."},{"$f":"IF(U366=\".\",\".\",SUM($S366:U366))","v":"."},{"$f":"IF(V366=\".\",\".\",SUM($S366:V366))","v":"."},{"$f":"IF(W366=\".\",\".\",SUM($S366:W366))","v":"."},{"$f":"IF(X366=\".\",\".\",SUM($S366:X366))","v":"."},{"$f":"IF(Y366=\".\",\".\",SUM($S366:Y366))","v":"."},null,".",".",".",".",".",".","."]
[]
[]
[]
[]
[null,null,"Sewerage Services - Annual Charge",null,null,{"$f":"$H$21","v":"$ per year"}]
[null,null,"(Enter the current annual charge and the proposed annual charge for each year of the application.)",null,null,null,null,null,null,null,null,null,null,null,null,null,null,null,{"$f":"S$21","v":"Annual increases (nominal $ per year)"},null,null,null,null,null,null,null,{"$f":"AA$21","v":"Annual increases (%)"},null,null,null,null,null,null,null,{"$f":"AI$21","v":"Cumulative increases (nominal $ per year)"},null,null,null,null,null,null,null,{"$f":"AQ$21","v":"Cumulative increases (%)"}]
[null,null,"Description",null,"Current Average Charge","Annual\nCharge\nYear 1","Annual\nCharge\nYear 2","Annual\nCharge\nYear 3","Annual\nCharge\nYear 4","Annual\nCharge\nYear 5","Annual\nCharge\nYear 6","Annual\nCharge\nYear 7",null,null,null,null,null,null,{"$f":"C371","v":"Sewerage Services - Annual Charge"},null,null,null,null,null,null,null,{"$f":"$S373","v":"Sewerage Services - Annual Charge"},null,null,null,null,null,null,null,{"$f":"$S373","v":"Sewerage Services - Annual Charge"},null,null,null,null,null,null,null,{"$f":"$S373","v":"Sewerage Services - Annual Charge"}]
[null,null,null,null,{"$f":"E346","v":"2018-19"},{"$f":"F346","v":"2019-20"},"2020-21","2021-22","2022-23","2023-24","2024-25","2025-26",null,null,null,null,null,null,{"$f":"S$23","v":"Year 1"},{"$f":"T$23","v":"Year 2"},"Year 3","Year 4","Year 5","Year 6","Year 7",null,{"$f":"AA$23","v":"Year 1"},"Year 2","Year 3","Year 4","Year 5","Year 6","Year 7",null,{"$f":"AI$23","v":"Year 1"},{"$f":"AJ$23","v":"Year 2"},"Year 3","Year 4","Year 5","Year 6","Year 7",null,{"$f":"AQ$23","v":"Year 1"},{"$f":"AR$23","v":"Year 2"},"Year 3","Year 4","Year 5","Year 6","Year 7"]
[null,null,"Not Applicable",null,null,null,null,null,null,null,null,null,null,null,null,null,null,null,{"$f":"IF(F375=\"\",\".\",F375-E375)","v":"."},{"$f":"IF(G375=\"\",\".\",G375-F375)","v":"."},{"$f":"IF(H375=\"\",\".\",H375-G375)","v":"."},{"$f":"IF(I375=\"\",\".\",I375-H375)","v":"."},{"$f":"IF(J375=\"\",\".\",J375-I375)","v":"."},{"$f":"IF(K375=\"\",\".\",K375-J375)","v":"."},{"$f":"IF(L375=\"\",\".\",L375-K375)","v":"."},null,{"$f":"IF(ISNUMBER(E375),F375/E375-1,\".\")","v":"."},{"$f":"IF(ISNUMBER(F375),G375/F375-1,\".\")","v":"."},{"$f":"IF(ISNUMBER(G375),H375/G375-1,\".\")","v":"."},{"$f":"IF(ISNUMBER(H375),I375/H375-1,\".\")","v":"."},{"$f":"IF(ISNUMBER(I375),J375/I375-1,\".\")","v":"."},{"$f":"IF(ISNUMBER(J375),K375/J375-1,\".\")","v":"."},{"$f":"IF(ISNUMBER(K375),L375/K375-1,\".\")","v":"."},null,{"$f":"IF(S375=\".\",\".\",SUM($S375:S375))","v":"."},{"$f":"IF(T375=\".\",\".\",SUM($S375:T375))","v":"."},{"$f":"IF(U375=\".\",\".\",SUM($S375:U375))","v":"."},{"$f":"IF(V375=\".\",\".\",SUM($S375:V375))","v":"."},{"$f":"IF(W375=\".\",\".\",SUM($S375:W375))","v":"."},{"$f":"IF(X375=\".\",\".\",SUM($S375:X375))","v":"."},{"$f":"IF(Y375=\".\",\".\",SUM($S375:Y375))","v":"."},null,{"$f":"IF(ISNUMBER($E375),F375/$E375-1,\".\")","v":"."},{"$f":"IF(ISNUMBER($E375),G375/$E375-1,\".\")","v":"."},{"$f":"IF(ISNUMBER($E375),H375/$E375-1,\".\")","v":"."},{"$f":"IF(ISNUMBER($E375),I375/$E375-1,\".\")","v":"."},{"$f":"IF(ISNUMBER($E375),J375/$E375-1,\".\")","v":"."},{"$f":"IF(ISNUMBER($E375),K375/$E375-1,\".\")","v":"."},{"$f":"IF(ISNUMBER($E375),L375/$E375-1,\".\")","v":"."}]
[null,null,null,null,null,null,null,null,null,null,null,null,null,null,null,null,null,null,".",".",".",".",".",".",".",null,".",".",".",".",".",".",".",null,{"$f":"IF(S376=\".\",\".\",SUM($S376:S376))","v":"."},{"$f":"IF(T376=\".\",\".\",SUM($S376:T376))","v":"."},{"$f":"IF(U376=\".\",\".\",SUM($S376:U376))","v":"."},{"$f":"IF(V376=\".\",\".\",SUM($S376:V376))","v":"."},{"$f":"IF(W376=\".\",\".\",SUM($S376:W376))","v":"."},{"$f":"IF(X376=\".\",\".\",SUM($S376:X376))","v":"."},{"$f":"IF(Y376=\".\",\".\",SUM($S376:Y376))","v":"."},null,".",".",".",".",".",".","."]
[null,null,null,null,null,null,null,null,null,null,null,null,null,null,null,null,null,null,".",".",".",".",".",".",".",null,".",".",".",".",".",".",".",null,{"$f":"IF(S377=\".\",\".\",SUM($S377:S377))","v":"."},{"$f":"IF(T377=\".\",\".\",SUM($S377:T377))","v":"."},{"$f":"IF(U377=\".\",\".\",SUM($S377:U377))","v":"."},{"$f":"IF(V377=\".\",\".\",SUM($S377:V377))","v":"."},{"$f":"IF(W377=\".\",\".\",SUM($S377:W377))","v":"."},{"$f":"IF(X377=\".\",\".\",SUM($S377:X377))","v":"."},{"$f":"IF(Y377=\".\",\".\",SUM($S377:Y377))","v":"."},null,".",".",".",".",".",".","."]
[null,null,null,null,null,null,null,null,null,null,null,null,null,null,null,null,null,null,".",".",".",".",".",".",".",null,".",".",".",".",".",".",".",null,{"$f":"IF(S378=\".\",\".\",SUM($S378:S378))","v":"."},{"$f":"IF(T378=\".\",\".\",SUM($S378:T378))","v":"."},{"$f":"IF(U378=\".\",\".\",SUM($S378:U378))","v":"."},{"$f":"IF(V378=\".\",\".\",SUM($S378:V378))","v":"."},{"$f":"IF(W378=\".\",\".\",SUM($S378:W378))","v":"."},{"$f":"IF(X378=\".\",\".\",SUM($S378:X378))","v":"."},{"$f":"IF(Y378=\".\",\".\",SUM($S378:Y378))","v":"."},null,".",".",".",".",".",".","."]
[null,null,null,null,null,null,null,null,null,null,null,null,null,null,null,null,null,null,".",".",".",".",".",".",".",null,".",".",".",".",".",".",".",null,{"$f":"IF(S379=\".\",\".\",SUM($S379:S379))","v":"."},{"$f":"IF(T379=\".\",\".\",SUM($S379:T379))","v":"."},{"$f":"IF(U379=\".\",\".\",SUM($S379:U379))","v":"."},{"$f":"IF(V379=\".\",\".\",SUM($S379:V379))","v":"."},{"$f":"IF(W379=\".\",\".\",SUM($S379:W379))","v":"."},{"$f":"IF(X379=\".\",\".\",SUM($S379:X379))","v":"."},{"$f":"IF(Y379=\".\",\".\",SUM($S379:Y379))","v":"."},null,".",".",".",".",".",".","."]
[null,null,null,null,null,null,null,null,null,null,null,null,null,null,null,null,null,null,".",".",".",".",".",".",".",null,".",".",".",".",".",".",".",null,{"$f":"IF(S380=\".\",\".\",SUM($S380:S380))","v":"."},{"$f":"IF(T380=\".\",\".\",SUM($S380:T380))","v":"."},{"$f":"IF(U380=\".\",\".\",SUM($S380:U380))","v":"."},{"$f":"IF(V380=\".\",\".\",SUM($S380:V380))","v":"."},{"$f":"IF(W380=\".\",\".\",SUM($S380:W380))","v":"."},{"$f":"IF(X380=\".\",\".\",SUM($S380:X380))","v":"."},{"$f":"IF(Y380=\".\",\".\",SUM($S380:Y380))","v":"."},null,".",".",".",".",".",".","."]
[null,null,null,null,null,null,null,null,null,null,null,null,null,null,null,null,null,null,".",".",".",".",".",".",".",null,".",".",".",".",".",".",".",null,{"$f":"IF(S381=\".\",\".\",SUM($S381:S381))","v":"."},{"$f":"IF(T381=\".\",\".\",SUM($S381:T381))","v":"."},{"$f":"IF(U381=\".\",\".\",SUM($S381:U381))","v":"."},{"$f":"IF(V381=\".\",\".\",SUM($S381:V381))","v":"."},{"$f":"IF(W381=\".\",\".\",SUM($S381:W381))","v":"."},{"$f":"IF(X381=\".\",\".\",SUM($S381:X381))","v":"."},{"$f":"IF(Y381=\".\",\".\",SUM($S381:Y381))","v":"."},null,".",".",".",".",".",".","."]
[null,null,null,null,null,null,null,null,null,null,null,null,null,null,null,null,null,null,".",".",".",".",".",".",".",null,".",".",".",".",".",".",".",null,{"$f":"IF(S382=\".\",\".\",SUM($S382:S382))","v":"."},{"$f":"IF(T382=\".\",\".\",SUM($S382:T382))","v":"."},{"$f":"IF(U382=\".\",\".\",SUM($S382:U382))","v":"."},{"$f":"IF(V382=\".\",\".\",SUM($S382:V382))","v":"."},{"$f":"IF(W382=\".\",\".\",SUM($S382:W382))","v":"."},{"$f":"IF(X382=\".\",\".\",SUM($S382:X382))","v":"."},{"$f":"IF(Y382=\".\",\".\",SUM($S382:Y382))","v":"."},null,".",".",".",".",".",".","."]
[null,null,null,null,null,null,null,null,null,null,null,null,null,null,null,null,null,null,".",".",".",".",".",".",".",null,".",".",".",".",".",".",".",null,{"$f":"IF(S383=\".\",\".\",SUM($S383:S383))","v":"."},{"$f":"IF(T383=\".\",\".\",SUM($S383:T383))","v":"."},{"$f":"IF(U383=\".\",\".\",SUM($S383:U383))","v":"."},{"$f":"IF(V383=\".\",\".\",SUM($S383:V383))","v":"."},{"$f":"IF(W383=\".\",\".\",SUM($S383:W383))","v":"."},{"$f":"IF(X383=\".\",\".\",SUM($S383:X383))","v":"."},{"$f":"IF(Y383=\".\",\".\",SUM($S383:Y383))","v":"."},null,".",".",".",".",".",".","."]
[null,null,null,null,null,null,null,null,null,null,null,null,null,null,null,null,null,null,".",".",".",".",".",".",".",null,".",".",".",".",".",".",".",null,{"$f":"IF(S384=\".\",\".\",SUM($S384:S384))","v":"."},{"$f":"IF(T384=\".\",\".\",SUM($S384:T384))","v":"."},{"$f":"IF(U384=\".\",\".\",SUM($S384:U384))","v":"."},{"$f":"IF(V384=\".\",\".\",SUM($S384:V384))","v":"."},{"$f":"IF(W384=\".\",\".\",SUM($S384:W384))","v":"."},{"$f":"IF(X384=\".\",\".\",SUM($S384:X384))","v":"."},{"$f":"IF(Y384=\".\",\".\",SUM($S384:Y384))","v":"."},null,".",".",".",".",".",".","."]
[null,null,null,null,null,null,null,null,null,null,null,null,null,null,null,null,null,null,".",".",".",".",".",".",".",null,".",".",".",".",".",".",".",null,{"$f":"IF(S385=\".\",\".\",SUM($S385:S385))","v":"."},{"$f":"IF(T385=\".\",\".\",SUM($S385:T385))","v":"."},{"$f":"IF(U385=\".\",\".\",SUM($S385:U385))","v":"."},{"$f":"IF(V385=\".\",\".\",SUM($S385:V385))","v":"."},{"$f":"IF(W385=\".\",\".\",SUM($S385:W385))","v":"."},{"$f":"IF(X385=\".\",\".\",SUM($S385:X385))","v":"."},{"$f":"IF(Y385=\".\",\".\",SUM($S385:Y385))","v":"."},null,".",".",".",".",".",".","."]
[null,null,null,null,null,null,null,null,null,null,null,null,null,null,null,null,null,null,".",".",".",".",".",".",".",null,".",".",".",".",".",".",".",null,{"$f":"IF(S386=\".\",\".\",SUM($S386:S386))","v":"."},{"$f":"IF(T386=\".\",\".\",SUM($S386:T386))","v":"."},{"$f":"IF(U386=\".\",\".\",SUM($S386:U386))","v":"."},{"$f":"IF(V386=\".\",\".\",SUM($S386:V386))","v":"."},{"$f":"IF(W386=\".\",\".\",SUM($S386:W386))","v":"."},{"$f":"IF(X386=\".\",\".\",SUM($S386:X386))","v":"."},{"$f":"IF(Y386=\".\",\".\",SUM($S386:Y386))","v":"."},null,".",".",".",".",".",".","."]
[null,null,null,null,null,null,null,null,null,null,null,null,null,null,null,null,null,null,".",".",".",".",".",".",".",null,".",".",".",".",".",".",".",null,{"$f":"IF(S387=\".\",\".\",SUM($S387:S387))","v":"."},{"$f":"IF(T387=\".\",\".\",SUM($S387:T387))","v":"."},{"$f":"IF(U387=\".\",\".\",SUM($S387:U387))","v":"."},{"$f":"IF(V387=\".\",\".\",SUM($S387:V387))","v":"."},{"$f":"IF(W387=\".\",\".\",SUM($S387:W387))","v":"."},{"$f":"IF(X387=\".\",\".\",SUM($S387:X387))","v":"."},{"$f":"IF(Y387=\".\",\".\",SUM($S387:Y387))","v":"."},null,".",".",".",".",".",".","."]
[null,null,null,null,null,null,null,null,null,null,null,null,null,null,null,null,null,null,".",".",".",".",".",".",".",null,".",".",".",".",".",".",".",null,{"$f":"IF(S388=\".\",\".\",SUM($S388:S388))","v":"."},{"$f":"IF(T388=\".\",\".\",SUM($S388:T388))","v":"."},{"$f":"IF(U388=\".\",\".\",SUM($S388:U388))","v":"."},{"$f":"IF(V388=\".\",\".\",SUM($S388:V388))","v":"."},{"$f":"IF(W388=\".\",\".\",SUM($S388:W388))","v":"."},{"$f":"IF(X388=\".\",\".\",SUM($S388:X388))","v":"."},{"$f":"IF(Y388=\".\",\".\",SUM($S388:Y388))","v":"."},null,".",".",".",".",".",".","."]
[null,null,null,null,null,null,null,null,null,null,null,null,null,null,null,null,null,null,".",".",".",".",".",".",".",null,".",".",".",".",".",".",".",null,{"$f":"IF(S389=\".\",\".\",SUM($S389:S389))","v":"."},{"$f":"IF(T389=\".\",\".\",SUM($S389:T389))","v":"."},{"$f":"IF(U389=\".\",\".\",SUM($S389:U389))","v":"."},{"$f":"IF(V389=\".\",\".\",SUM($S389:V389))","v":"."},{"$f":"IF(W389=\".\",\".\",SUM($S389:W389))","v":"."},{"$f":"IF(X389=\".\",\".\",SUM($S389:X389))","v":"."},{"$f":"IF(Y389=\".\",\".\",SUM($S389:Y389))","v":"."},null,".",".",".",".",".",".","."]
[null,null,null,null,null,null,null,null,null,null,null,null,null,null,null,null,null,null,".",".",".",".",".",".",".",null,".",".",".",".",".",".",".",null,{"$f":"IF(S390=\".\",\".\",SUM($S390:S390))","v":"."},{"$f":"IF(T390=\".\",\".\",SUM($S390:T390))","v":"."},{"$f":"IF(U390=\".\",\".\",SUM($S390:U390))","v":"."},{"$f":"IF(V390=\".\",\".\",SUM($S390:V390))","v":"."},{"$f":"IF(W390=\".\",\".\",SUM($S390:W390))","v":"."},{"$f":"IF(X390=\".\",\".\",SUM($S390:X390))","v":"."},{"$f":"IF(Y390=\".\",\".\",SUM($S390:Y390))","v":"."},null,".",".",".",".",".",".","."]
[null,null,null,null,null,null,null,null,null,null,null,null,null,null,null,null,null,null,".",".",".",".",".",".",".",null,".",".",".",".",".",".",".",null,{"$f":"IF(S391=\".\",\".\",SUM($S391:S391))","v":"."},{"$f":"IF(T391=\".\",\".\",SUM($S391:T391))","v":"."},{"$f":"IF(U391=\".\",\".\",SUM($S391:U391))","v":"."},{"$f":"IF(V391=\".\",\".\",SUM($S391:V391))","v":"."},{"$f":"IF(W391=\".\",\".\",SUM($S391:W391))","v":"."},{"$f":"IF(X391=\".\",\".\",SUM($S391:X391))","v":"."},{"$f":"IF(Y391=\".\",\".\",SUM($S391:Y391))","v":"."},null,".",".",".",".",".",".","."]
[null,null,null,null,null,null,null,null,null,null,null,null,null,null,null,null,null,null,".",".",".",".",".",".",".",null,".",".",".",".",".",".",".",null,{"$f":"IF(S392=\".\",\".\",SUM($S392:S392))","v":"."},{"$f":"IF(T392=\".\",\".\",SUM($S392:T392))","v":"."},{"$f":"IF(U392=\".\",\".\",SUM($S392:U392))","v":"."},{"$f":"IF(V392=\".\",\".\",SUM($S392:V392))","v":"."},{"$f":"IF(W392=\".\",\".\",SUM($S392:W392))","v":"."},{"$f":"IF(X392=\".\",\".\",SUM($S392:X392))","v":"."},{"$f":"IF(Y392=\".\",\".\",SUM($S392:Y392))","v":"."},null,".",".",".",".",".",".","."]
[null,null,null,null,null,null,null,null,null,null,null,null,null,null,null,null,null,null,".",".",".",".",".",".",".",null,".",".",".",".",".",".",".",null,{"$f":"IF(S393=\".\",\".\",SUM($S393:S393))","v":"."},{"$f":"IF(T393=\".\",\".\",SUM($S393:T393))","v":"."},{"$f":"IF(U393=\".\",\".\",SUM($S393:U393))","v":"."},{"$f":"IF(V393=\".\",\".\",SUM($S393:V393))","v":"."},{"$f":"IF(W393=\".\",\".\",SUM($S393:W393))","v":"."},{"$f":"IF(X393=\".\",\".\",SUM($S393:X393))","v":"."},{"$f":"IF(Y393=\".\",\".\",SUM($S393:Y393))","v":"."},null,".",".",".",".",".",".","."]
[null,null,null,null,null,null,null,null,null,null,null,null,null,null,null,null,null,null,".",".",".",".",".",".",".",null,".",".",".",".",".",".",".",null,{"$f":"IF(S394=\".\",\".\",SUM($S394:S394))","v":"."},{"$f":"IF(T394=\".\",\".\",SUM($S394:T394))","v":"."},{"$f":"IF(U394=\".\",\".\",SUM($S394:U394))","v":"."},{"$f":"IF(V394=\".\",\".\",SUM($S394:V394))","v":"."},{"$f":"IF(W394=\".\",\".\",SUM($S394:W394))","v":"."},{"$f":"IF(X394=\".\",\".\",SUM($S394:X394))","v":"."},{"$f":"IF(Y394=\".\",\".\",SUM($S394:Y394))","v":"."},null,".",".",".",".",".",".","."]
[]
[]
[]
[]
[null,null,"Other Annual Charges",null,{"$f":"$H$21","v":"$ per year"}]
[null,null,"(Enter the current annual charge and the proposed annual charge for each year of the application.)",null,null,null,null,null,null,null,null,null,null,null,null,null,null,null,{"$f":"S$21","v":"Annual increases (nominal $ per year)"},null,null,null,null,null,null,null,{"$f":"AA$21","v":"Annual increases (%)"},null,null,null,null,null,null,null,{"$f":"AI$21","v":"Cumulative increases (nominal $ per year)"},null,null,null,null,null,null,null,{"$f":"AQ$21","v":"Cumulative increases (%)"}]
[null,null,"Description",null,"Current Average Charge","Annual\nCharge\nYear 1","Annual\nCharge\nYear 2","Annual\nCharge\nYear 3","Annual\nCharge\nYear 4","Annual\nCharge\nYear 5","Annual\nCharge\nYear 6","Annual\nCharge\nYear 7",null,null,null,null,null,null,{"$f":"C399","v":"Other Annual Charges"},null,null,null,null,null,null,null,{"$f":"$S401","v":"Other Annual Charges"},null,null,null,null,null,null,null,{"$f":"$S401","v":"Other Annual Charges"},null,null,null,null,null,null,null,{"$f":"$S401","v":"Other Annual Charges"}]
[null,null,null,null,{"$f":"E374","v":"2018-19"},"2019-20","2020-21","2021-22","2022-23","2023-24","2024-25","2025-26",null,null,null,null,null,null,{"$f":"S$23","v":"Year 1"},{"$f":"T$23","v":"Year 2"},"Year 3","Year 4","Year 5","Year 6","Year 7",null,{"$f":"AA$23","v":"Year 1"},"Year 2","Year 3","Year 4","Year 5","Year 6","Year 7",null,{"$f":"AI$23","v":"Year 1"},{"$f":"AJ$23","v":"Year 2"},"Year 3","Year 4","Year 5","Year 6","Year 7",null,{"$f":"AQ$23","v":"Year 1"},{"$f":"AR$23","v":"Year 2"},"Year 3","Year 4","Year 5","Year 6","Year 7"]
[null,null,"Not Applicable",null,null,null,null,null,null,null,null,null,null,null,null,null,null,null,{"$f":"IF(F403=\"\",\".\",F403-E403)","v":"."},{"$f":"IF(G403=\"\",\".\",G403-F403)","v":"."},{"$f":"IF(H403=\"\",\".\",H403-G403)","v":"."},{"$f":"IF(I403=\"\",\".\",I403-H403)","v":"."},{"$f":"IF(J403=\"\",\".\",J403-I403)","v":"."},{"$f":"IF(K403=\"\",\".\",K403-J403)","v":"."},{"$f":"IF(L403=\"\",\".\",L403-K403)","v":"."},null,{"$f":"IF(ISNUMBER(E403),F403/E403-1,\".\")","v":"."},{"$f":"IF(ISNUMBER(F403),G403/F403-1,\".\")","v":"."},{"$f":"IF(ISNUMBER(G403),H403/G403-1,\".\")","v":"."},{"$f":"IF(ISNUMBER(H403),I403/H403-1,\".\")","v":"."},{"$f":"IF(ISNUMBER(I403),J403/I403-1,\".\")","v":"."},{"$f":"IF(ISNUMBER(J403),K403/J403-1,\".\")","v":"."},{"$f":"IF(ISNUMBER(K403),L403/K403-1,\".\")","v":"."},null,{"$f":"IF(S403=\".\",\".\",SUM($S403:S403))","v":"."},{"$f":"IF(T403=\".\",\".\",SUM($S403:T403))","v":"."},{"$f":"IF(U403=\".\",\".\",SUM($S403:U403))","v":"."},{"$f":"IF(V403=\".\",\".\",SUM($S403:V403))","v":"."},{"$f":"IF(W403=\".\",\".\",SUM($S403:W403))","v":"."},{"$f":"IF(X403=\".\",\".\",SUM($S403:X403))","v":"."},{"$f":"IF(Y403=\".\",\".\",SUM($S403:Y403))","v":"."},null,{"$f":"IF(ISNUMBER($E403),F403/$E403-1,\".\")","v":"."},{"$f":"IF(ISNUMBER($E403),G403/$E403-1,\".\")","v":"."},{"$f":"IF(ISNUMBER($E403),H403/$E403-1,\".\")","v":"."},{"$f":"IF(ISNUMBER($E403),I403/$E403-1,\".\")","v":"."},{"$f":"IF(ISNUMBER($E403),J403/$E403-1,\".\")","v":"."},{"$f":"IF(ISNUMBER($E403),K403/$E403-1,\".\")","v":"."},{"$f":"IF(ISNUMBER($E403),L403/$E403-1,\".\")","v":"."}]
[null,null,null,null,null,null,null,null,null,null,null,null,null,null,null,null,null,null,".",".",".",".",".",".",".",null,".",".",".",".",".",".",".",null,{"$f":"IF(S404=\".\",\".\",SUM($S404:S404))","v":"."},{"$f":"IF(T404=\".\",\".\",SUM($S404:T404))","v":"."},{"$f":"IF(U404=\".\",\".\",SUM($S404:U404))","v":"."},{"$f":"IF(V404=\".\",\".\",SUM($S404:V404))","v":"."},{"$f":"IF(W404=\".\",\".\",SUM($S404:W404))","v":"."},{"$f":"IF(X404=\".\",\".\",SUM($S404:X404))","v":"."},{"$f":"IF(Y404=\".\",\".\",SUM($S404:Y404))","v":"."},null,".",".",".",".",".",".","."]
[null,null,null,null,null,null,null,null,null,null,null,null,null,null,null,null,null,null,".",".",".",".",".",".",".",null,".",".",".",".",".",".",".",null,{"$f":"IF(S405=\".\",\".\",SUM($S405:S405))","v":"."},{"$f":"IF(T405=\".\",\".\",SUM($S405:T405))","v":"."},{"$f":"IF(U405=\".\",\".\",SUM($S405:U405))","v":"."},{"$f":"IF(V405=\".\",\".\",SUM($S405:V405))","v":"."},{"$f":"IF(W405=\".\",\".\",SUM($S405:W405))","v":"."},{"$f":"IF(X405=\".\",\".\",SUM($S405:X405))","v":"."},{"$f":"IF(Y405=\".\",\".\",SUM($S405:Y405))","v":"."},null,".",".",".",".",".",".","."]
[null,null,null,null,null,null,null,null,null,null,null,null,null,null,null,null,null,null,".",".",".",".",".",".",".",null,".",".",".",".",".",".",".",null,{"$f":"IF(S406=\".\",\".\",SUM($S406:S406))","v":"."},{"$f":"IF(T406=\".\",\".\",SUM($S406:T406))","v":"."},{"$f":"IF(U406=\".\",\".\",SUM($S406:U406))","v":"."},{"$f":"IF(V406=\".\",\".\",SUM($S406:V406))","v":"."},{"$f":"IF(W406=\".\",\".\",SUM($S406:W406))","v":"."},{"$f":"IF(X406=\".\",\".\",SUM($S406:X406))","v":"."},{"$f":"IF(Y406=\".\",\".\",SUM($S406:Y406))","v":"."},null,".",".",".",".",".",".","."]
[null,null,null,null,null,null,null,null,null,null,null,null,null,null,null,null,null,null,".",".",".",".",".",".",".",null,".",".",".",".",".",".",".",null,{"$f":"IF(S407=\".\",\".\",SUM($S407:S407))","v":"."},{"$f":"IF(T407=\".\",\".\",SUM($S407:T407))","v":"."},{"$f":"IF(U407=\".\",\".\",SUM($S407:U407))","v":"."},{"$f":"IF(V407=\".\",\".\",SUM($S407:V407))","v":"."},{"$f":"IF(W407=\".\",\".\",SUM($S407:W407))","v":"."},{"$f":"IF(X407=\".\",\".\",SUM($S407:X407))","v":"."},{"$f":"IF(Y407=\".\",\".\",SUM($S407:Y407))","v":"."},null,".",".",".",".",".",".","."]
[null,null,null,null,null,null,null,null,null,null,null,null,null,null,null,null,null,null,".",".",".",".",".",".",".",null,".",".",".",".",".",".",".",null,{"$f":"IF(S408=\".\",\".\",SUM($S408:S408))","v":"."},{"$f":"IF(T408=\".\",\".\",SUM($S408:T408))","v":"."},{"$f":"IF(U408=\".\",\".\",SUM($S408:U408))","v":"."},{"$f":"IF(V408=\".\",\".\",SUM($S408:V408))","v":"."},{"$f":"IF(W408=\".\",\".\",SUM($S408:W408))","v":"."},{"$f":"IF(X408=\".\",\".\",SUM($S408:X408))","v":"."},{"$f":"IF(Y408=\".\",\".\",SUM($S408:Y408))","v":"."},null,".",".",".",".",".",".","."]
[null,null,null,null,null,null,null,null,null,null,null,null,null,null,null,null,null,null,".",".",".",".",".",".",".",null,".",".",".",".",".",".",".",null,{"$f":"IF(S409=\".\",\".\",SUM($S409:S409))","v":"."},{"$f":"IF(T409=\".\",\".\",SUM($S409:T409))","v":"."},{"$f":"IF(U409=\".\",\".\",SUM($S409:U409))","v":"."},{"$f":"IF(V409=\".\",\".\",SUM($S409:V409))","v":"."},{"$f":"IF(W409=\".\",\".\",SUM($S409:W409))","v":"."},{"$f":"IF(X409=\".\",\".\",SUM($S409:X409))","v":"."},{"$f":"IF(Y409=\".\",\".\",SUM($S409:Y409))","v":"."},null,".",".",".",".",".",".","."]
[null,null,null,null,null,null,null,null,null,null,null,null,null,null,null,null,null,null,".",".",".",".",".",".",".",null,".",".",".",".",".",".",".",null,{"$f":"IF(S410=\".\",\".\",SUM($S410:S410))","v":"."},{"$f":"IF(T410=\".\",\".\",SUM($S410:T410))","v":"."},{"$f":"IF(U410=\".\",\".\",SUM($S410:U410))","v":"."},{"$f":"IF(V410=\".\",\".\",SUM($S410:V410))","v":"."},{"$f":"IF(W410=\".\",\".\",SUM($S410:W410))","v":"."},{"$f":"IF(X410=\".\",\".\",SUM($S410:X410))","v":"."},{"$f":"IF(Y410=\".\",\".\",SUM($S410:Y410))","v":"."},null,".",".",".",".",".",".","."]
[null,null,null,null,null,null,null,null,null,null,null,null,null,null,null,null,null,null,".",".",".",".",".",".",".",null,".",".",".",".",".",".",".",null,{"$f":"IF(S411=\".\",\".\",SUM($S411:S411))","v":"."},{"$f":"IF(T411=\".\",\".\",SUM($S411:T411))","v":"."},{"$f":"IF(U411=\".\",\".\",SUM($S411:U411))","v":"."},{"$f":"IF(V411=\".\",\".\",SUM($S411:V411))","v":"."},{"$f":"IF(W411=\".\",\".\",SUM($S411:W411))","v":"."},{"$f":"IF(X411=\".\",\".\",SUM($S411:X411))","v":"."},{"$f":"IF(Y411=\".\",\".\",SUM($S411:Y411))","v":"."},null,".",".",".",".",".",".","."]
[null,null,null,null,null,null,null,null,null,null,null,null,null,null,null,null,null,null,".",".",".",".",".",".",".",null,".",".",".",".",".",".",".",null,{"$f":"IF(S412=\".\",\".\",SUM($S412:S412))","v":"."},{"$f":"IF(T412=\".\",\".\",SUM($S412:T412))","v":"."},{"$f":"IF(U412=\".\",\".\",SUM($S412:U412))","v":"."},{"$f":"IF(V412=\".\",\".\",SUM($S412:V412))","v":"."},{"$f":"IF(W412=\".\",\".\",SUM($S412:W412))","v":"."},{"$f":"IF(X412=\".\",\".\",SUM($S412:X412))","v":"."},{"$f":"IF(Y412=\".\",\".\",SUM($S412:Y412))","v":"."},null,".",".",".",".",".",".","."]

{"sheet":"WK5b - Impact on Rates","index":10,"n_rows":140,"n_cols":48,"rows_kept":140,"cut":false,"hidden":false,"merged":[]}
[]
[]
[null,null,{"$f":"'WK2 - Notional General Income'!$C$3","v":"Burwood Council"}]
[]
[null,null,null,null,null,"WORKSHEET 5b"]
[]
[null,null,null,null,null,"IMPACT ON RATES BY LAND VALUE"]
[null,null,null,null,null,"  All dollars in nominal terms"]
[]
[null,null,"         The aim of this sheet is to show the impact of the proposed special variation on Ordinary Rates by land value for the residential, business"]
[null,null,"         and farmland categories - as applicable."]
[]
[null,null,"         1. Enter the number of property assessments within each of the specified land value ranges."]
[]
[null,null,"         2. Include the estimated rate levels for the specified land values (eg $50,000) over the period of the proposed special variation - both with and without the variation."]
[]
[null,null,"         Rate estimates should reflect expected actual rates, inclusive of any expiring variations. Figures should not include special rates."]
[]
[null,null,null,null,"Has the council had a general land revaluation in Year 0?  ","No",null,null,null,null,null,null,null,null,null,null,"Annual and cumulative increases"]
[]
[]
[null,null,"Ordinary Residential Rates - with proposed special variation",null,null,null,{"$f":"'WK0 - Input data'!$C$63","v":"$ nominal per year"},null,null,null,null,null,null,null,null,null,null,"Annual increases (nominal $ per year)",null,null,null,null,null,null,null,"Annual increases (%)",null,null,null,null,null,null,null,"Cumulative increases (nominal $ per year)",null,null,null,null,null,null,null,"Cumulative increases (%)"]
[null,null,"Land Value","Number of property assessments in this valuation range as per Worksheet 3","Land value (for calculation of rates)","Year 0 (Current Rate)","Rate Year 1","Rate Year 2","Rate Year 3","Rate Year 4","Rate Year 5","Rate Year 6","Rate Year 7",null,null,null,{"$f":"C23","v":"Land Value"},{"$f":"C22","v":"Ordinary Residential Rates - with proposed special variation"},null,null,null,null,null,null,null,{"$f":"$R23","v":"Ordinary Residential Rates - with proposed special variation"},null,null,null,null,null,null,null,{"$f":"$R23","v":"Ordinary Residential Rates - with proposed special variation"},null,null,null,null,null,null,null,{"$f":"$R23","v":"Ordinary Residential Rates - with proposed special variation"}]
[null,null,null,null,"$",{"$f":"'WK5a - Impact on Rates'!E59","v":"2018-19"},{"$f":"'WK5a - Impact on Rates'!F59","v":"2019-20"},{"$f":"'WK5a - Impact on Rates'!G59","v":"2020-21"},{"$f":"'WK5a - Impact on Rates'!H59","v":"2021-22"},{"$f":"'WK5a - Impact on Rates'!I59","v":"2022-23"},{"$f":"'WK5a - Impact on Rates'!J59","v":"2023-24"},{"$f":"'WK5a - Impact on Rates'!K59","v":"2024-25"},{"$f":"'WK5a - Impact on Rates'!L59","v":"2025-26"},null,null,null,{"$f":"$E24","v":"$"},{"$f":"'WK0 - Input data'!G55","v":"Year 1"},{"$f":"'WK0 - Input data'!H55","v":"Year 2"},{"$f":"'WK0 - Input data'!I55","v":"Year 3"},{"$f":"'WK0 - Input data'!J55","v":"Year 4"},{"$f":"'WK0 - Input data'!K55","v":"Year 5"},{"$f":"'WK0 - Input data'!L55","v":"Year 6"},{"$f":"'WK0 - Input data'!M55","v":"Year 7"},null,{"$f":"R24","v":"Year 1"},{"$f":"S24","v":"Year 2"},"Year 3","Year 4","Year 5","Year 6","Year 7",null,{"$f":"R24","v":"Year 1"},{"$f":"S24","v":"Year 2"},"Year 3","Year 4","Year 5","Year 6","Year 7",null,{"$f":"R24","v":"Year 1"},{"$f":"S24","v":"Year 2"},"Year 3","Year 4","Year 5",{"$f":"W24","v":"Year 6"},{"$f":"X24","v":"Year 7"}]
[null,null,"$0 to $99,999",689,50000,1130.71,1183.8499999999999,1237.1300000000001,1292.8,1350.97,1384.75,1419.37,1454.85,null,null,null,{"$f":"$E25","v":50000},{"$f":"IF(G25=\".\",\".\",IF(F25=0,\".\",G25-F25))","v":53.139999999999873},{"$f":"IF(H25=\".\",\".\",IF(G25=0,\".\",H25-G25))","v":53.2800000000002},{"$f":"IF(I25=\".\",\".\",IF(H25=0,\".\",I25-H25))","v":55.669999999999845},{"$f":"IF(J25=\".\",\".\",IF(I25=0,\".\",J25-I25))","v":58.170000000000073},{"$f":"IF(K25=\".\",\".\",IF(J25=0,\".\",K25-J25))","v":33.779999999999973},{"$f":"IF(L25=\".\",\".\",IF(K25=0,\".\",L25-K25))","v":34.619999999999891},{"$f":"IF(M25=\".\",\".\",IF(L25=0,\".\",M25-L25))","v":35.480000000000018},null,{"$f":"IF(G25=\".\",\".\",IF(F25=0,\".\",G25/F25-1))","v":4.6997019571773269E-2},{"$f":"IF(H25=\".\",\".\",IF(G25=0,\".\",H25/G25-1))","v":4.5005701735862047E-2},{"$f":"IF(I25=\".\",\".\",IF(H25=0,\".\",I25/H25-1))","v":4.4999312925884771E-2},{"$f":"IF(J25=\".\",\".\",IF(I25=0,\".\",J25/I25-1))","v":4.4995358910891126E-2},{"$f":"IF(K25=\".\",\".\",IF(J25=0,\".\",K25/J25-1))","v":2.5004256201099917E-2},{"$f":"IF(L25=\".\",\".\",IF(K25=0,\".\",L25/K25-1))","v":2.5000902690016202E-2},{"$f":"IF(M25=\".\",\".\",IF(L25=0,\".\",M25/L25-1))","v":2.49970057138027E-2},null,{"$f":"IF(G25=\".\",\".\",IF($F25=0,\".\",G25-$F25))","v":53.139999999999873},{"$f":"IF(H25=\".\",\".\",IF($F25=0,\".\",H25-$F25))","v":106.42000000000007},{"$f":"IF(I25=\".\",\".\",IF($F25=0,\".\",I25-$F25))","v":162.08999999999992},{"$f":"IF(J25=\".\",\".\",IF($F25=0,\".\",J25-$F25))","v":220.26},{"$f":"IF(K25=\".\",\".\",IF($F25=0,\".\",K25-$F25))","v":254.03999999999996},{"$f":"IF(L25=\".\",\".\",IF($F25=0,\".\",L25-$F25))","v":288.65999999999985},{"$f":"IF(M25=\".\",\".\",IF($F25=0,\".\",M25-$F25))","v":324.13999999999987},null,{"$f":"IF(G25=\".\",\".\",IF($F25=0,\".\",G25/$F25-1))","v":4.6997019571773269E-2},{"$f":"IF(H25=\".\",\".\",IF($F25=0,\".\",H25/$F25-1))","v":9.4117855152957119E-2},{"$f":"IF(I25=\".\",\".\",IF($F25=0,\".\",I25/$F25-1))","v":0.1433524068947829},{"$f":"IF(J25=\".\",\".\",IF($F25=0,\".\",J25/$F25-1))","v":0.1947979588046449},{"$f":"IF(K25=\".\",\".\",IF($F25=0,\".\",K25/$F25-1))","v":0.22467299307514743},{"$f":"IF(L25=\".\",\".\",IF($F25=0,\".\",L25/$F25-1))","v":0.25529092340211013},{"$f":"IF(M25=\".\",\".\",IF($F25=0,\".\",M25/$F25-1))","v":0.28666943778687726}]
[null,null,"$100,000 to $199,999",1454,150000,1072.79,1123.21,1173.76,1226.57,1281.77,1313.81,1346.66,1380.33,null,null,null,150000,50.420000000000073,50.549999999999955,52.809999999999945,55.200000000000045,32.039999999999964,32.850000000000136,33.669999999999845,null,4.6998946671762409E-2,4.5004941195324166E-2,4.4992161941112219E-2,4.5003546475129941E-2,2.4996684272529324E-2,2.5003615439066706E-2,2.5002599022767358E-2,null,50.420000000000073,100.97000000000003,153.77999999999997,208.98000000000002,241.01999999999998,273.87000000000012,307.53999999999996,null,4.6998946671762409E-2,9.4119072698291451E-2,0.14334585519999243,0.19480047353163243,0.22466652373717122,0.25528761453779403,0.28667306742232856]
[null,null,"$200,000 to $299,999",1696,250000,1031.8900000000001,1080.3900000000001,1129.01,1179.81,1232.9000000000001,1263.73,1295.32,1327.7,null,null,null,250000,48.5,48.619999999999891,50.799999999999955,53.090000000000146,30.829999999999927,31.589999999999918,32.380000000000109,null,4.7001133841785503E-2,4.5002267699626897E-2,4.4995172761977287E-2,4.4998770988549097E-2,2.500608321842801E-2,2.4997428248122455E-2,2.4997683969984363E-2,null,48.5,97.119999999999891,147.91999999999985,201.01,231.83999999999992,263.42999999999984,295.80999999999995,null,4.7001133841785503E-2,9.4118559148746339E-2,0.14334861273972987,0.1947978951244802,0.22467511071916579,0.25528883892662968,0.28666815261316603]
[null,null,"$300,000 to $399,999",1202,350000,990.06,1036.5899999999999,1083.24,1131.99,1182.92,1212.5,1242.81,1273.8800000000001,null,null,null,350000,46.529999999999973,46.650000000000091,48.75,50.930000000000064,29.579999999999927,30.309999999999945,31.070000000000164,null,4.6997151687776517E-2,4.5003328220415195E-2,4.5003877257117519E-2,4.4991563529713119E-2,2.5005917559936419E-2,2.4997938144329934E-2,2.4999798842944676E-2,null,46.529999999999973,93.180000000000064,141.93000000000006,192.86000000000013,222.44000000000005,252.75,283.82000000000016,null,4.6997151687776517E-2,9.411550815102121E-2,0.14335494818495853,0.19479627497323415,0.22467325212613387,0.25528755832979821,0.28666949477809434]
[null,null,"$400,000 to $499,999",428,450000,1023.91,1072.03,1120.28,1170.69,1223.3699999999999,1253.95,1285.3,1317.43,null,null,null,450000,48.120000000000005,48.25,50.410000000000082,52.679999999999836,30.580000000000155,31.349999999999909,32.130000000000109,null,4.6996318035764872E-2,4.5008068804044621E-2,4.4997679151640657E-2,4.4999103093047443E-2,2.4996525989684271E-2,2.5000996849954049E-2,2.4998054928810465E-2,null,48.120000000000005,96.37,146.78000000000009,199.45999999999992,230.04000000000008,261.39,293.5200000000001,null,4.6996318035764872E-2,9.4119600355500044E-2,0.14335244308581818,0.19480227754392465,0.22466818372708541,0.25528610913068528,0.28666582023810694]
[null,null,"$500,000 to $599,999",491,550000,1042.6199999999999,1091.6199999999999,1140.75,1192.08,1245.72,1276.8699999999999,1308.79,1341.51,null,null,null,550000,49,49.130000000000109,51.329999999999927,53.6400000000001,31.149999999999864,31.920000000000073,32.720000000000027,null,4.6996988356256431E-2,4.5006504094831534E-2,4.499671268902028E-2,4.4996980068451764E-2,2.5005619240278554E-2,2.4998629461104205E-2,2.5000191016129492E-2,null,49,98.130000000000109,149.46000000000004,203.10000000000014,234.25,266.17000000000007,298.8900000000001,null,4.6996988356256431E-2,9.4118662599988578E-2,0.14335040570869539,0.19479772112562599,0.22467437800924595,0.25528955899560724,0.28667203775105032]
[null,null,"$600,000 to $699,999",523,650000,972.1,1017.79,1063.5899999999999,1111.45,1161.47,1190.5,1220.27,1250.77,null,null,null,650000,45.689999999999941,45.799999999999955,47.860000000000127,50.019999999999982,29.029999999999973,29.769999999999982,30.5,null,4.700133731097611E-2,4.4999459613476178E-2,4.499854267151826E-2,4.5004273696522601E-2,2.499418839918377E-2,2.5006299874002602E-2,2.4994468437313122E-2,null,45.689999999999941,91.489999999999895,139.35000000000002,189.37,218.39999999999998,248.16999999999996,278.66999999999996,null,4.700133731097611E-2,9.4115831704556951E-2,0.14334944964509821,0.19480506120769459,0.22466824400781804,0.25529266536364559,0.28666803826766785]
[null,null,"$700,000 to $799,999",505,750000,983.34,1029.56,1075.8900000000001,1124.3,1174.9000000000001,1204.27,1234.3699999999999,1265.23,null,null,null,750000,46.219999999999914,46.330000000000155,48.409999999999854,50.600000000000136,29.369999999999891,30.099999999999909,30.860000000000127,null,4.7003071165619081E-2,4.4999805742258925E-2,4.4995306211601527E-2,4.5005781375077936E-2,2.499787215933269E-2,2.4994394944655163E-2,2.5000607597397861E-2,null,46.219999999999914,92.550000000000068,140.95999999999992,191.56000000000006,220.92999999999995,251.02999999999986,281.89,null,4.7003071165619081E-2,9.41180059796205E-2,0.14334818069030031,0.19480545894604107,0.22467305306404706,0.2552830150304064,0.2866658531128603]
[null,null,"$800,000 to $899,999",771,850000,1055.98,1105.6099999999999,1155.3599999999999,1207.3499999999999,1261.69,1293.23,1325.56,1358.7,null,null,null,850000,49.629999999999882,49.75,51.990000000000009,54.340000000000146,31.539999999999964,32.329999999999927,33.1400000000001,null,4.6998996193109654E-2,4.4997784028726118E-2,4.4998961362692214E-2,4.500766140721435E-2,2.4998216677630802E-2,2.4999420056757149E-2,2.5000754398141201E-2,null,49.629999999999882,99.379999999999882,151.36999999999989,205.71000000000004,237.25,269.57999999999993,302.72000000000003,null,4.6998996193109654E-2,9.4111630902100396E-2,0.14334551790753602,0.19480482584897452,0.224672815773026,0.25528892592662733,0.28667209606242539]
[null,null,"$900,000 to $999,999",804,950000,1165.07,1219.83,1274.72,1332.08,1392.03,1426.83,1462.5,1499.06,null,null,null,950000,54.759999999999991,54.8900000000001,57.3599999999999,59.950000000000045,34.799999999999955,35.670000000000073,36.559999999999945,null,4.7001467722969537E-2,4.4998073502045433E-2,4.4998117233588486E-2,4.5004804516245223E-2,2.4999461218508268E-2,2.4999474359243878E-2,2.4998290598290618E-2,null,54.759999999999991,109.65000000000009,167.01,226.96000000000004,261.76,297.43000000000006,333.99,null,4.7001467722969537E-2,9.4114516724317143E-2,0.14334761001484897,0.19480374569768344,0.22467319560198096,0.25528938175388616,0.28666947050391833]
[null,null,"$1,000,000 to $1,499,999",2625,1250000,1497.53,1567.91,1638.47,1712.2,1789.25,1833.98,1879.83,1926.83,null,null,null,1250000,70.380000000000109,70.559999999999945,73.730000000000018,77.049999999999955,44.730000000000018,45.849999999999909,47,null,4.6997389033942572E-2,4.5002583056425349E-2,4.4999298125690368E-2,4.5000584043920044E-2,2.499930138326123E-2,2.5000272631108267E-2,2.5002260842735824E-2,null,70.380000000000109,140.94000000000005,214.67000000000007,291.72000000000003,336.45000000000005,382.29999999999995,429.29999999999995,null,4.6997389033942572E-2,9.411497599380314E-2,0.14334938198233105,0.19480077193779088,0.22466995652841693,0.25528703932475483,0.28667205331445778]
[null,null,"$1,500,000 to $1,999,999",1072,1750000,2067.08,2164.23,2261.62,2363.4,2469.75,2531.4899999999998,2594.7800000000002,2659.65,null,null,null,1750000,97.150000000000091,97.389999999999873,101.7800000000002,106.34999999999991,61.739999999999782,63.290000000000418,64.869999999999891,null,4.6998664783172384E-2,4.499983827966525E-2,4.5003139342595144E-2,4.4998730642294982E-2,2.4998481627694913E-2,2.500108631675424E-2,2.500019269456355E-2,null,97.150000000000091,194.53999999999996,296.32000000000016,402.67000000000007,464.40999999999985,527.70000000000027,592.57000000000016,null,4.6998664783172384E-2,9.4113435377440657E-2,0.14335197476633721,0.19480136230818346,0.2246695822125897,0.25528765214699001,0.28667008533777127]
[null,null,"$2,000,000 to $2,999,999",427,2500000,2807.89,2939.86,3072.15,3210.4,3354.87,3438.74,3524.71,3612.83,null,null,null,2500000,131.97000000000025,132.28999999999996,138.25,144.4699999999998,83.869999999999891,85.970000000000255,88.119999999999891,null,4.6999704404374842E-2,4.4998741436667045E-2,4.5001057891053575E-2,4.500062297533014E-2,2.499947837024985E-2,2.5000436206285004E-2,2.5000638350389126E-2,null,131.97000000000025,264.26000000000022,402.51000000000022,546.98,630.84999999999991,716.82000000000016,804.94,null,4.6999704404374842E-2,9.4113373387134214E-2,0.14334963264230449,0.19480107838982308,0.22467048210578056,0.25528777836738636,0.28667077414001274]
[null,null,"$3,000,000 and greater",111,3000000,6317.5,6614.42,6912.07,7223.11,7548.15,7736.86,7930.28,8128.54,null,null,null,3000000,296.92000000000007,297.64999999999964,311.03999999999996,325.03999999999996,188.71000000000004,193.42000000000007,198.26000000000022,null,4.6999604273842532E-2,4.5000166303319045E-2,4.49995442754485E-2,4.5000006922226055E-2,2.5000828017461174E-2,2.4999806122897317E-2,2.5000378296857084E-2,null,296.92000000000007,594.56999999999971,905.60999999999967,1230.6499999999996,1419.3599999999997,1612.7799999999997,1811.04,null,4.6999604273842532E-2,9.4114760585674695E-2,0.14334942619707158,0.19480015829046304,0.22467115156311834,0.25528769291650177,0.28667036011080338]
[]
[]
[]
[null,null,"Ordinary Residential Rates - without proposed special variation",null,null,null,{"$f":"$G$22","v":"$ nominal per year"},null,null,null,null,null,null,null,null,null,null,{"$f":"R$22","v":"Annual increases (nominal $ per year)"},null,null,null,null,null,null,null,"Annual increases (%)",null,null,null,null,null,null,null,"Cumulative increases (nominal $ per year)",null,null,null,null,null,null,null,"Cumulative increases (%)"]
[null,null,"Land Value","Number of property assessments in this valuation range as per Worksheet 3","Land value (for calculation of rates)","Year 0 (Current Rate)","Rate Year 1","Rate Year 2","Rate Year 3","Rate Year 4","Rate Year 5","Rate Year 6","Rate Year 7",null,null,null,{"$f":"Q$23","v":"Land Value"},{"$f":"C42","v":"Ordinary Residential Rates - without proposed special variation"},null,null,null,null,null,null,null,{"$f":"$R43","v":"Ordinary Residential Rates - without proposed special variation"},null,null,null,null,null,null,null,{"$f":"$R43","v":"Ordinary Residential Rates - without proposed special variation"},null,null,null,null,null,null,null,{"$f":"$R43","v":"Ordinary Residential Rates - without proposed special variation"}]
[null,null,null,null,null,{"$f":"F24","v":"2018-19"},{"$f":"G24","v":"2019-20"},"2020-21","2021-22","2022-23","2023-24","2024-25","2025-26",null,null,null,null,{"$f":"R$24","v":"Year 1"},"Year 2","Year 3","Year 4","Year 5","Year 6","Year 7",null,{"$f":"R44","v":"Year 1"},{"$f":"S44","v":"Year 2"},{"$f":"T44","v":"Year 3"},{"$f":"U44","v":"Year 4"},{"$f":"V44","v":"Year 5"},{"$f":"W44","v":"Year 6"},{"$f":"X44","v":"Year 7"},null,{"$f":"R44","v":"Year 1"},{"$f":"S44","v":"Year 2"},{"$f":"T44","v":"Year 3"},{"$f":"U44","v":"Year 4"},{"$f":"V44","v":"Year 5"},{"$f":"W44","v":"Year 6"},{"$f":"X44","v":"Year 7"},null,{"$f":"R44","v":"Year 1"},{"$f":"S44","v":"Year 2"},{"$f":"T44","v":"Year 3"},{"$f":"U44","v":"Year 4"},{"$f":"V44","v":"Year 5"},{"$f":"W44","v":"Year 6"},{"$f":"X44","v":"Year 7"}]
[null,null,{"$f":"C25","v":"$0 to $99,999"},{"$f":"IF(D25=\".\",\".\",D25)","v":689},{"$f":"E25","v":50000},1130.71,1161.24,1190.27,1220.03,1250.53,1281.79,1313.84,1346.68,null,null,null,{"$f":"$E45","v":50000},{"$f":"IF(G45=\".\",\".\",IF(F45=0,\".\",G45-F45))","v":30.529999999999973},{"$f":"IF(H45=\".\",\".\",IF(G45=0,\".\",H45-G45))","v":29.029999999999973},{"$f":"IF(I45=\".\",\".\",IF(H45=0,\".\",I45-H45))","v":29.759999999999991},{"$f":"IF(J45=\".\",\".\",IF(I45=0,\".\",J45-I45))","v":30.5},{"$f":"IF(K45=\".\",\".\",IF(J45=0,\".\",K45-J45))","v":31.259999999999991},{"$f":"IF(L45=\".\",\".\",IF(K45=0,\".\",L45-K45))","v":32.049999999999955},{"$f":"IF(M45=\".\",\".\",IF(L45=0,\".\",M45-L45))","v":32.840000000000146},null,{"$f":"IF(G45=\".\",\".\",IF(F45=0,\".\",G45/F45-1))","v":2.7000734052055719E-2},{"$f":"IF(H45=\".\",\".\",IF(G45=0,\".\",H45/G45-1))","v":2.4999138851572456E-2},{"$f":"IF(I45=\".\",\".\",IF(H45=0,\".\",I45/H45-1))","v":2.50027304729179E-2},{"$f":"IF(J45=\".\",\".\",IF(I45=0,\".\",J45/I45-1))","v":2.4999385261018192E-2},{"$f":"IF(K45=\".\",\".\",IF(J45=0,\".\",K45/J45-1))","v":2.4997401101932715E-2},{"$f":"IF(L45=\".\",\".\",IF(K45=0,\".\",L45/K45-1))","v":2.5004095834731066E-2},{"$f":"IF(M45=\".\",\".\",IF(L45=0,\".\",M45/L45-1))","v":2.4995433233879538E-2},null,{"$f":"IF(G45=\".\",\".\",IF($F45=0,\".\",G45-$F45))","v":30.529999999999973},{"$f":"IF(H45=\".\",\".\",IF($F45=0,\".\",H45-$F45))","v":59.559999999999945},{"$f":"IF(I45=\".\",\".\",IF($F45=0,\".\",I45-$F45))","v":89.319999999999936},{"$f":"IF(J45=\".\",\".\",IF($F45=0,\".\",J45-$F45))","v":119.81999999999994},{"$f":"IF(K45=\".\",\".\",IF($F45=0,\".\",K45-$F45))","v":151.07999999999993},{"$f":"IF(L45=\".\",\".\",IF($F45=0,\".\",L45-$F45))","v":183.12999999999988},{"$f":"IF(M45=\".\",\".\",IF($F45=0,\".\",M45-$F45))","v":215.97000000000003},null,{"$f":"IF(G45=\".\",\".\",IF($F45=0,\".\",G45/$F45-1))","v":2.7000734052055719E-2},{"$f":"IF(H45=\".\",\".\",IF($F45=0,\".\",H45/$F45-1))","v":5.2674868003290021E-2},{"$f":"IF(I45=\".\",\".\",IF($F45=0,\".\",I45/$F45-1))","v":7.8994614003590646E-2},{"$f":"IF(J45=\".\",\".\",IF($F45=0,\".\",J45/$F45-1))","v":0.10596881605363007},{"$f":"IF(K45=\".\",\".\",IF($F45=0,\".\",K45/$F45-1))","v":0.13361516215475233},{"$f":"IF(L45=\".\",\".\",IF($F45=0,\".\",L45/$F45-1))","v":0.16196018430897396},{"$f":"IF(M45=\".\",\".\",IF($F45=0,\".\",M45/$F45-1))","v":0.19100388251629519}]
[null,null,{"$f":"C26","v":"$100,000 to $199,999"},1454,{"$f":"E26","v":150000},1072.79,1101.76,1129.3,1157.53,1186.47,1216.1300000000001,1246.54,1277.7,null,null,null,150000,28.970000000000027,27.539999999999964,28.230000000000018,28.940000000000055,29.660000000000082,30.409999999999854,31.160000000000082,null,2.7004353135282821E-2,2.4996369445251299E-2,2.4997786239263187E-2,2.5001511839865875E-2,2.4998525036452834E-2,2.5005550393461196E-2,2.4997192228087384E-2,null,28.970000000000027,56.509999999999991,84.740000000000009,113.68000000000006,143.34000000000015,173.75,204.91000000000008,null,2.7004353135282821E-2,5.2675733368133582E-2,7.8990296330129883E-2,0.10596668499892803,0.13361422086335639,0.1619608683898992,0.19100662757855691]
[null,null,"$200,000 to $299,999",1696,250000,1031.8900000000001,1059.75,1086.24,1113.4000000000001,1141.24,1169.77,1199.01,1228.99,null,null,null,250000,27.8599999999999,26.490000000000009,27.160000000000082,27.839999999999918,28.529999999999973,29.240000000000009,29.980000000000018,null,2.699900183159043E-2,2.4996461429582562E-2,2.5003682427456209E-2,2.5004490749056973E-2,2.499912376012059E-2,2.4996366807150228E-2,2.5003961601654634E-2,null,27.8599999999999,54.349999999999909,81.509999999999991,109.34999999999991,137.87999999999988,167.11999999999989,197.09999999999991,null,2.699900183159043E-2,5.2670342769093548E-2,7.8990977720493349E-2,0.1059705976412213,0.13361889348670863,0.16195524716781806,0.19100873155084352]
[null,null,"$300,000 to $399,999",1202,350000,990.06,1016.79,1042.21,1068.27,1094.97,1122.3499999999999,1150.4100000000001,1179.17,null,null,null,350000,26.730000000000018,25.420000000000073,26.059999999999945,26.700000000000045,27.379999999999882,28.060000000000173,28.759999999999991,null,2.6998363735531106E-2,2.5000245871812377E-2,2.5004557622744006E-2,2.499368137268676E-2,2.5005251285423302E-2,2.500111373457492E-2,2.4999782686172756E-2,null,26.730000000000018,52.150000000000091,78.210000000000036,104.91000000000008,132.28999999999996,160.35000000000014,189.11000000000013,null,2.6998363735531106E-2,5.2673575338868517E-2,7.8995212411369087E-2,0.10596327495303326,0.13361816455568354,0.16195988121932015,0.19100862573985422]
[null,null,"$400,000 to $499,999",428,450000,1023.91,1051.56,1077.8399999999999,1104.79,1132.4100000000001,1160.72,1189.74,1219.48,null,null,null,450000,27.649999999999977,26.279999999999973,26.950000000000045,27.620000000000118,28.309999999999945,29.019999999999982,29.740000000000009,null,2.7004326552138247E-2,2.4991441287230298E-2,2.5003711125955563E-2,2.500022628734877E-2,2.4999779231903663E-2,2.5001723068440285E-2,2.4997058180779019E-2,null,27.649999999999977,53.92999999999995,80.88,108.50000000000011,136.81000000000006,165.83000000000004,195.57000000000005,null,2.7004326552138247E-2,5.2670644880897788E-2,7.8991317596273092E-2,0.1059663446982646,0.13361525915363659,0.16195759392915399,0.19100311550819904]
[null,null,"$500,000 to $599,999",491,550000,1042.6199999999999,1070.77,1097.54,1124.98,1153.0999999999999,1181.93,1211.48,1241.77,null,null,null,550000,28.150000000000091,26.769999999999982,27.440000000000055,28.119999999999891,28.830000000000155,29.549999999999955,30.289999999999964,null,2.6999290249563712E-2,2.5000700430531264E-2,2.5001366692785743E-2,2.4995999928887569E-2,2.5002168068684494E-2,2.5001480629140538E-2,2.500247630996788E-2,null,28.150000000000091,54.920000000000073,82.360000000000127,110.48000000000002,139.31000000000017,168.86000000000013,199.15000000000009,null,2.6999290249563712E-2,5.2674991847461383E-2,7.8993305326964913E-2,0.10596382191018772,0.13361531526347115,0.16195737660892773,0.19100918839078496]
[null,null,"$600,000 to $699,999",523,650000,972.1,998.35,1023.31,1048.8900000000001,1075.1099999999999,1101.99,1129.54,1157.78,null,null,null,650000,26.25,24.959999999999923,25.580000000000155,26.2199999999998,26.880000000000109,27.549999999999955,28.240000000000009,null,2.7003394712478146E-2,2.5001252065908641E-2,2.4997312642307978E-2,2.4997854875153491E-2,2.5002092809107923E-2,2.5000226862312624E-2,2.5001327974219612E-2,null,26.25,51.209999999999923,76.790000000000077,103.00999999999988,129.88999999999999,157.43999999999994,185.67999999999995,null,2.7003394712478146E-2,5.2679765456228766E-2,7.8993930665569367E-2,0.10596646435551893,0.13361794054109666,0.16195864622981171,0.19100915543668351]
[null,null,"$700,000 to $799,999",505,750000,983.34,1009.89,1035.1400000000001,1061.02,1087.54,1114.73,1142.5999999999999,1171.1600000000001,null,null,null,750000,26.549999999999955,25.250000000000114,25.879999999999882,26.519999999999982,27.190000000000055,27.869999999999891,28.560000000000173,null,2.6999816950393551E-2,2.5002723068849209E-2,2.5001449079351534E-2,2.4994816308834933E-2,2.5001379259613543E-2,2.5001569886878405E-2,2.4995624015403672E-2,null,26.549999999999955,51.800000000000068,77.67999999999995,104.19999999999993,131.38999999999999,159.25999999999988,187.82000000000005,null,2.6999816950393551E-2,5.267760896536311E-2,7.8996074602883937E-2,0.10596538328553695,0.13361604328106247,0.16195822401204052,0.19100209490105158]
[null,null,"$800,000 to $899,999",771,850000,1055.98,1084.49,1111.5999999999999,1139.3900000000001,1167.8800000000001,1197.08,1227,1257.68,null,null,null,850000,28.509999999999991,27.1099999999999,27.790000000000191,28.490000000000009,29.199999999999818,29.920000000000073,30.680000000000064,null,2.6998617398056757E-2,2.4997925292072676E-2,2.5000000000000133E-2,2.5004607728696948E-2,2.5002568757063859E-2,2.4994152437598283E-2,2.5004074979625202E-2,null,28.509999999999991,55.619999999999891,83.410000000000082,111.90000000000009,141.09999999999991,171.01999999999998,201.70000000000005,null,2.6998617398056757E-2,5.2671452110835348E-2,7.8988238413606471E-2,0.10596791605901634,0.13361995492338852,0.16195382488304699,0.19100740544328487]
[null,null,"$900,000 to $999,999",804,950000,1165.07,1196.53,1226.44,1257.0999999999999,1288.53,1320.74,1353.76,1387.6,null,null,null,950000,31.460000000000036,29.910000000000082,30.659999999999854,31.430000000000064,32.210000000000036,33.019999999999982,33.839999999999918,null,2.7002669367505838E-2,2.4997283812357551E-2,2.4999184631942839E-2,2.5001988704160372E-2,2.4997477745958507E-2,2.5001135726940849E-2,2.4997045266516915E-2,null,31.460000000000036,61.370000000000118,92.029999999999973,123.46000000000004,155.67000000000007,188.69000000000005,222.52999999999997,null,2.7002669367505838E-2,5.2674946569734038E-2,7.8990961916451274E-2,0.10596788175817773,0.1336142892701726,0.16195593397821595,0.19100139905756741]
[null,null,"$1,000,000 to $1,499,999",2625,1250000,1497.53,1537.96,1576.41,1615.82,1656.22,1697.62,1740.06,1783.57,null,null,null,1250000,40.430000000000064,38.450000000000045,39.409999999999854,40.400000000000091,41.399999999999864,42.440000000000055,43.509999999999991,null,2.6997789693695706E-2,2.5000650211969067E-2,2.4999841411815327E-2,2.5002784963671809E-2,2.4996679185132376E-2,2.4999705470011069E-2,2.5004884889026746E-2,null,40.430000000000064,78.880000000000109,118.28999999999996,158.69000000000005,200.08999999999992,242.52999999999997,286.03999999999996,null,2.6997789693695706E-2,5.2673402202293218E-2,7.8990070315786642E-2,0.10596782702182939,0.13361334998297192,0.16195334984941878,0.19100785960882249]
[null,null,"$1,500,000 to $1,999,999",1072,1750000,2067.08,2122.89,2175.96,2230.36,2286.12,2343.27,2401.86,2461.9,null,null,null,1750000,55.809999999999945,53.070000000000164,54.400000000000091,55.759999999999764,57.150000000000091,58.590000000000146,60.039999999999964,null,2.6999438821913024E-2,2.4998940124076219E-2,2.5000459567271482E-2,2.5000448358112548E-2,2.4998687732927349E-2,2.5003520721043726E-2,2.4997293763999506E-2,null,55.809999999999945,108.88000000000011,163.2800000000002,219.03999999999996,276.19000000000005,334.7800000000002,394.82000000000016,null,2.6999438821913024E-2,5.2673336300481877E-2,7.8990653482206907E-2,0.1059659035934748,0.13361359986067312,0.16195793099444633,0.19100373473692356]
[null,null,"$2,000,000 to $2,999,999",427,2500000,2807.89,2883.7,2955.8,3029.69,3105.43,3183.07,3262.65,3344.21,null,null,null,2500000,75.809999999999945,72.100000000000364,73.889999999999873,75.739999999999782,77.640000000000327,79.579999999999927,81.559999999999945,null,2.699892089789846E-2,2.5002600825328791E-2,2.4998308410582482E-2,2.4999257349761717E-2,2.5001368570536142E-2,2.5001021026870296E-2,2.499808437926232E-2,null,75.809999999999945,147.91000000000031,221.80000000000018,297.53999999999996,375.18000000000029,454.76000000000022,536.32000000000016,null,2.699892089789846E-2,5.267656496515194E-2,7.8991698392743448E-2,0.10596568953912011,0.13361634536965483,0.1619579114566454,0.19100463337239004]
[null,null,"$3,000,000 and greater",111,3000000,6317.5,6488.07,6650.27,6816.53,6986.94,7161.62,7340.66,7524.17,null,null,null,3000000,170.56999999999971,162.20000000000073,166.25999999999931,170.40999999999985,174.68000000000029,179.03999999999996,183.51000000000022,null,2.6999604273842515E-2,2.4999730274180232E-2,2.5000488701962365E-2,2.4999523217824837E-2,2.5000930307115921E-2,2.4999930183394303E-2,2.4999114521037757E-2,null,170.56999999999971,332.77000000000044,499.02999999999975,669.4399999999996,844.11999999999989,1023.1599999999999,1206.67,null,2.6999604273842515E-2,5.2674317372378487E-2,7.8991689750692373E-2,0.10596596755045495,0.13361614562722601,0.161956470122675,0.19100435298773255]
[]
[]
[]
[]
[null,null,"Ordinary Business Rates - with proposed special variation",null,null,null,{"$f":"$G$22","v":"$ nominal per year"},null,null,null,null,null,null,null,null,null,null,{"$f":"R$22","v":"Annual increases (nominal $ per year)"},null,null,null,null,null,null,null,"Annual increases (%)",null,null,null,null,null,null,null,"Cumulative increases (nominal $ per year)",null,null,null,null,null,null,null,"Cumulative increases (%)"]
[null,null,"Land Value","Number of property assessments in this valuation range as per Worksheet 3","Land value (for calculation of rates)","Year 0 (Current Rate)","Rate Year 1","Rate Year 2","Rate Year 3","Rate Year 4","Rate Year 5","Rate Year 6","Rate Year 7",null,null,null,{"$f":"Q$23","v":"Land Value"},{"$f":"C63","v":"Ordinary Business Rates - with proposed special variation"},null,null,null,null,null,null,null,{"$f":"$R64","v":"Ordinary Business Rates - with proposed special variation"},null,null,null,null,null,null,null,{"$f":"$R64","v":"Ordinary Business Rates - with proposed special variation"},null,null,null,null,null,null,null,{"$f":"$R64","v":"Ordinary Business Rates - with proposed special variation"}]
[null,null,null,null,null,{"$f":"'WK5a - Impact on Rates'!E59","v":"2018-19"},{"$f":"'WK5a - Impact on Rates'!F59","v":"2019-20"},{"$f":"'WK5a - Impact on Rates'!G59","v":"2020-21"},{"$f":"'WK5a - Impact on Rates'!H59","v":"2021-22"},{"$f":"'WK5a - Impact on Rates'!I59","v":"2022-23"},{"$f":"'WK5a - Impact on Rates'!J59","v":"2023-24"},{"$f":"'WK5a - Impact on Rates'!K59","v":"2024-25"},{"$f":"'WK5a - Impact on Rates'!L59","v":"2025-26"},null,null,null,null,{"$f":"R$24","v":"Year 1"},"Year 2","Year 3","Year 4","Year 5","Year 6","Year 7",null,{"$f":"R65","v":"Year 1"},{"$f":"S65","v":"Year 2"},{"$f":"T65","v":"Year 3"},{"$f":"U65","v":"Year 4"},{"$f":"V65","v":"Year 5"},{"$f":"W65","v":"Year 6"},{"$f":"X65","v":"Year 7"},null,{"$f":"R65","v":"Year 1"},{"$f":"S65","v":"Year 2"},{"$f":"T65","v":"Year 3"},{"$f":"U65","v":"Year 4"},{"$f":"V65","v":"Year 5"},{"$f":"W65","v":"Year 6"},{"$f":"X65","v":"Year 7"},null,{"$f":"R65","v":"Year 1"},{"$f":"S65","v":"Year 2"},{"$f":"T65","v":"Year 3"},{"$f":"U65","v":"Year 4"},{"$f":"V65","v":"Year 5"},{"$f":"W65","v":"Year 6"},{"$f":"X65","v":"Year 7"}]
[null,null,{"$f":"C25","v":"$0 to $99,999"},141,{"$f":"E25","v":50000},1226.48,1284.1199999999999,1341.91,1402.3,1465.4,1502.03,1539.59,1578.07,null,null,null,{"$f":"$E66","v":50000},{"$f":"IF(G66=\".\",\".\",IF(F66=0,\".\",G66-F66))","v":57.639999999999873},{"$f":"IF(H66=\".\",\".\",IF(G66=0,\".\",H66-G66))","v":57.790000000000191},{"$f":"IF(I66=\".\",\".\",IF(H66=0,\".\",I66-H66))","v":60.389999999999873},{"$f":"IF(J66=\".\",\".\",IF(I66=0,\".\",J66-I66))","v":63.100000000000136},{"$f":"IF(K66=\".\",\".\",IF(J66=0,\".\",K66-J66))","v":36.629999999999882},{"$f":"IF(L66=\".\",\".\",IF(K66=0,\".\",L66-K66))","v":37.559999999999945},{"$f":"IF(M66=\".\",\".\",IF(L66=0,\".\",M66-L66))","v":38.480000000000018},null,{"$f":"IF(G66=\".\",\".\",IF(F66=0,\".\",G66/F66-1))","v":4.6996282042919502E-2},{"$f":"IF(H66=\".\",\".\",IF(G66=0,\".\",H66/G66-1))","v":4.5003582219730331E-2},{"$f":"IF(I66=\".\",\".\",IF(H66=0,\".\",I66/H66-1))","v":4.5003018086160695E-2},{"$f":"IF(J66=\".\",\".\",IF(I66=0,\".\",J66/I66-1))","v":4.4997504100406482E-2},{"$f":"IF(K66=\".\",\".\",IF(J66=0,\".\",K66/J66-1))","v":2.4996587962331063E-2},{"$f":"IF(L66=\".\",\".\",IF(K66=0,\".\",L66/K66-1))","v":2.5006158332390171E-2},{"$f":"IF(M66=\".\",\".\",IF(L66=0,\".\",M66/L66-1))","v":2.4993667145148946E-2},null,{"$f":"IF(G66=\".\",\".\",IF($F66=0,\".\",G66-$F66))","v":57.639999999999873},{"$f":"IF(H66=\".\",\".\",IF($F66=0,\".\",H66-$F66))","v":115.43000000000006},{"$f":"IF(I66=\".\",\".\",IF($F66=0,\".\",I66-$F66))","v":175.81999999999994},{"$f":"IF(J66=\".\",\".\",IF($F66=0,\".\",J66-$F66))","v":238.92000000000007},{"$f":"IF(K66=\".\",\".\",IF($F66=0,\".\",K66-$F66))","v":275.54999999999995},{"$f":"IF(L66=\".\",\".\",IF($F66=0,\".\",L66-$F66))","v":313.1099999999999},{"$f":"IF(M66=\".\",\".\",IF($F66=0,\".\",M66-$F66))","v":351.58999999999992},null,{"$f":"IF(G66=\".\",\".\",IF($F66=0,\".\",G66/$F66-1))","v":4.6996282042919502E-2},{"$f":"IF(H66=\".\",\".\",IF($F66=0,\".\",H66/$F66-1))","v":9.4114865305590101E-2},{"$f":"IF(I66=\".\",\".\",IF($F66=0,\".\",I66/$F66-1))","v":0.14335333637727476},{"$f":"IF(J66=\".\",\".\",IF($F66=0,\".\",J66/$F66-1))","v":0.19480138281912462},{"$f":"IF(K66=\".\",\".\",IF($F66=0,\".\",K66/$F66-1))","v":0.22466734068227767},{"$f":"IF(L66=\".\",\".\",IF($F66=0,\".\",L66/$F66-1))","v":0.25529156610788584},{"$f":"IF(M66=\".\",\".\",IF($F66=0,\".\",M66/$F66-1))","v":0.28666590568129924}]
[null,null,{"$f":"C26","v":"$100,000 to $199,999"},61,150000,1217.2,1274.4100000000001,1331.76,1391.69,1454.31,1490.67,1527.94,1566.13,null,null,null,150000,57.210000000000036,57.349999999999909,59.930000000000064,62.619999999999891,36.360000000000127,37.269999999999982,38.190000000000055,null,4.7001314492277402E-2,4.5001216249087816E-2,4.500060070883638E-2,4.4995652767498395E-2,2.5001547125441004E-2,2.5002180227682747E-2,2.4994436954330679E-2,null,57.210000000000036,114.55999999999995,174.49,237.1099999999999,273.47000000000003,310.74,348.93000000000006,null,4.7001314492277402E-2,9.4117647058823417E-2,0.14335359842260931,0.19479953992770294,0.22467137693066053,0.25529083141636533,0.28666611896155114]
[null,null,"$200,000 to $299,999",101,250000,1211.3699999999999,1268.3,1325.38,1385.02,1447.35,1483.53,1520.62,1558.63,null,null,null,250000,56.930000000000064,57.080000000000155,59.639999999999873,62.329999999999927,36.180000000000064,37.089999999999918,38.010000000000218,null,4.6996376004028617E-2,4.5005124970433075E-2,4.4998415548748172E-2,4.5002960246061319E-2,2.4997409057933462E-2,2.5001179618882041E-2,2.4996383054280535E-2,null,56.930000000000064,114.01000000000022,173.65000000000009,235.98000000000002,272.16000000000008,309.25,347.26000000000022,null,4.6996376004028617E-2,9.4116578749680269E-2,0.14335009121903308,0.19480422992149382,0.2246712400009907,0.25528946564633426,0.2866671619736334]
[null,null,"$300,000 to $399,999",54,350000,1298.6500000000001,1359.69,1420.87,1484.81,1551.63,1590.42,1630.18,1670.93,null,null,null,350000,61.039999999999964,61.179999999999836,63.940000000000055,66.820000000000164,38.789999999999964,39.759999999999991,40.75,null,4.7002656604935966E-2,4.499555045635395E-2,4.5000598225031219E-2,4.5002390878294385E-2,2.4999516637342678E-2,2.4999685617635548E-2,2.4997239568636642E-2,null,61.039999999999964,122.2199999999998,186.15999999999985,252.98000000000002,291.77,331.53,372.28,null,4.7002656604935966E-2,9.4113117468139773E-2,0.14334886228005983,0.19480229469064025,0.22467177453509413,0.25528818388326324,0.28666692334347199]
[null,null,"$400,000 to $499,999",48,450000,1548.72,1621.51,1694.48,1770.73,1850.41,1896.67,1944.09,1992.69,null,null,null,450000,72.789999999999964,72.970000000000027,76.25,79.680000000000064,46.259999999999991,47.419999999999845,48.600000000000136,null,4.7000103311121366E-2,4.5001264253689444E-2,4.4999055757518613E-2,4.4998390494315865E-2,2.49998648948071E-2,2.5001713529501535E-2,2.4998842646173802E-2,null,72.789999999999964,145.76,222.01,301.69000000000005,347.95000000000005,395.36999999999989,443.97,null,4.7000103311121366E-2,9.4116431633865405E-2,0.14335063794617486,0.19479957642440215,0.22466940441138483,0.25528823802882372,0.28666899116689915]
[null,null,"$500,000 to $599,999",36,550000,1483.47,1553.19,1623.09,1696.13,1772.45,1816.76,1862.18,1908.74,null,null,null,550000,69.720000000000027,69.899999999999864,73.040000000000191,76.319999999999936,44.309999999999945,45.420000000000073,46.559999999999945,null,4.6997917045845217E-2,4.5004152743707948E-2,4.5000585303341278E-2,4.4996550971918348E-2,2.4999294761488322E-2,2.5000550430436697E-2,2.5002953527585969E-2,null,69.720000000000027,139.61999999999989,212.66000000000008,288.98,333.28999999999996,378.71000000000004,425.27,null,4.6997917045845217E-2,9.4117171226920648E-2,0.1433530843225681,0.19480002966018861,0.22466918778269873,0.25528659157246181,0.28667246388534995]
[null,null,"$600,000 to $699,999",41,650000,1610.28,1685.96,1761.83,1841.11,1923.96,1972.06,2021.36,2071.9,null,null,null,650000,75.680000000000064,75.869999999999891,79.279999999999973,82.850000000000136,48.099999999999909,49.299999999999955,50.540000000000191,null,4.6998037608366294E-2,4.5001067640987769E-2,4.4998666159618006E-2,4.5000027157530154E-2,2.5000519761325446E-2,2.499923937405546E-2,2.5002968298571293E-2,null,75.680000000000064,151.54999999999995,230.82999999999993,313.68000000000006,361.78,411.07999999999993,461.62000000000012,null,4.6998037608366294E-2,9.4114067118761913E-2,0.14334774076558099,0.19479842015053284,0.22466900166430692,0.25528479519089853,0.28667064113073515]
[null,null,"$700,000 to $799,999",43,750000,1530.4,1602.33,1674.43,1749.78,1828.52,1874.24,1921.09,1969.12,null,null,null,750000,71.929999999999836,72.100000000000136,75.349999999999909,78.740000000000009,45.720000000000027,46.849999999999909,48.029999999999973,null,4.7000784108729654E-2,4.4996973157839015E-2,4.5000388191802632E-2,4.4999942849958341E-2,2.5003828232669001E-2,2.4996798702407341E-2,2.5001431479004133E-2,null,71.929999999999836,144.02999999999997,219.37999999999988,298.11999999999989,343.83999999999992,390.68999999999983,438.7199999999998,null,4.7000784108729654E-2,9.4112650287506483E-2,0.14334814427600628,0.19479874542603226,0.22467328802927322,0.25528619968635646,0.28667015159435416]
[null,null,"$800,000 to $899,999",25,850000,1885.69,1974.32,2063.16,2156,2253.02,2309.35,2367.08,2426.2600000000002,null,null,null,850000,88.629999999999882,88.839999999999918,92.840000000000146,97.019999999999982,56.329999999999927,57.730000000000018,59.180000000000291,null,4.700136289634016E-2,4.4997771384577945E-2,4.499893367455754E-2,4.4999999999999929E-2,2.5001997319153757E-2,2.499837616645384E-2,2.5001267384287873E-2,null,88.629999999999882,177.4699999999998,270.30999999999995,367.32999999999993,423.65999999999985,481.38999999999987,540.57000000000016,null,4.700136289634016E-2,9.4114090863291366E-2,0.14334805827044739,0.19479872089261741,0.22467107530930308,0.25528586353006055,0.28666960104789241]
[null,null,"$900,000 to $999,999",34,950000,1982.8,2075.9899999999998,2169.41,2267.0300000000002,2369.0500000000002,2428.2800000000002,2488.98,2551.21,null,null,null,950000,93.189999999999827,93.420000000000073,97.620000000000346,102.01999999999998,59.230000000000018,60.699999999999818,62.230000000000018,null,4.6999193060318634E-2,4.5000216764049972E-2,4.4998409705864884E-2,4.500161003603842E-2,2.5001582912981934E-2,2.4997117301134963E-2,2.5002209740536241E-2,null,93.189999999999827,186.6099999999999,284.23000000000025,386.25000000000023,445.48000000000025,506.18000000000006,568.41000000000008,null,4.6999193060318634E-2,9.4114383699818394E-2,0.14334779100262263,0.19480028242888858,0.22467218075448869,0.25528545491224541,0.28667036514020583]
[null,null,"$1,000,000 to $1,499,999",71,1250000,2919.37,3056.58,3194.13,3337.86,3488.07,3575.27,3664.65,3756.27,null,null,null,1250000,137.21000000000004,137.55000000000018,143.73000000000002,150.21000000000004,87.199999999999818,89.380000000000109,91.619999999999891,null,4.6999866409533686E-2,4.5001275935850016E-2,4.4998168515370418E-2,4.5001887436860732E-2,2.4999498289885125E-2,2.4999510526477753E-2,2.5001023290082136E-2,null,137.21000000000004,274.76000000000022,418.49000000000024,568.70000000000027,655.90000000000009,745.2800000000002,836.90000000000009,null,4.6999866409533686E-2,9.4116196302626909E-2,0.14334942127924877,0.19480230323665726,0.22467176137317302,0.25528795596310161,0.2866714393858949]
[null,null,"$1,500,000 to $1,999,999",48,1750000,4428.9399999999996,4637.1000000000004,4845.7700000000004,5063.83,5291.7,5423.99,5559.59,5698.58,null,null,null,1750000,208.16000000000076,208.67000000000007,218.05999999999949,227.86999999999989,132.28999999999996,135.60000000000036,138.98999999999978,null,4.6999959358221322E-2,4.5000107826012048E-2,4.5000072227943111E-2,4.4999535924389322E-2,2.4999527562031165E-2,2.5000046091530503E-2,2.5000044967344648E-2,null,208.16000000000076,416.83000000000084,634.89000000000033,862.76000000000022,995.05000000000018,1130.6500000000005,1269.6400000000003,null,4.6999959358221322E-2,9.4115070423171465E-2,0.14335032761789512,0.19480056175969884,0.22467001133454056,0.25528681806481934,0.28666904496335466]
[null,null,"$2,000,000 to $2,999,999",90,2500000,5548.86,5809.66,6071.09,6344.29,6629.78,6795.53,6965.42,7139.55,null,null,null,2500000,260.80000000000018,261.43000000000029,273.19999999999982,285.48999999999978,165.75,169.89000000000033,174.13000000000011,null,4.7000645177567968E-2,4.4999191002571548E-2,4.5000156479314324E-2,4.4999519252745257E-2,2.5000829590122065E-2,2.5000257522224123E-2,2.4999210385016291E-2,null,260.80000000000018,522.23000000000047,795.43000000000029,1080.92,1246.67,1416.5600000000004,1590.6900000000005,null,4.7000645177567968E-2,9.4114827189729189E-2,0.14335016561960479,0.19480037341003387,0.22467137393987247,0.2552884736684653,0.28666969431558931]
[null,null,"$3,000,000 and greater",169,3000000,22807.8,23879.77,24954.36,26077.3,27250.78,27932.05,28630.35,29346.11,null,null,null,3000000,1071.9700000000012,1074.5900000000001,1122.9399999999987,1173.4799999999996,681.27000000000044,698.29999999999927,715.76000000000204,null,4.7000149071808828E-2,4.5000014656757514E-2,4.4999751546423106E-2,4.5000057521292547E-2,2.5000018348098729E-2,2.4999955248540706E-2,2.5000043659962223E-2,null,1071.9700000000012,2146.5600000000013,3269.5,4442.9799999999996,5124.25,5822.5499999999993,6538.3100000000013,null,4.7000149071808828E-2,9.4115171125667585E-2,0.14335008198949484,0.1948009014459966,0.22467094590447134,0.25528766474627096,0.28666991117073981]
[]
[]
[]
[null,null,"Ordinary Business Rates - without proposed special variation",null,null,null,{"$f":"$G$22","v":"$ nominal per year"},null,null,null,null,null,null,null,null,null,null,{"$f":"R$22","v":"Annual increases (nominal $ per year)"},null,null,null,null,null,null,null,"Annual increases (%)",null,null,null,null,null,null,null,"Cumulative increases (nominal $ per year)",null,null,null,null,null,null,null,"Cumulative increases (%)"]
[null,null,"Land Value","Number of property assessments in this valuation range as per Worksheet 3","Land value (for calculation of rates)","Year 0 (Current Rate)","Rate Year 1","Rate Year 2","Rate Year 3","Rate Year 4","Rate Year 5","Rate Year 6","Rate Year 7",null,null,null,{"$f":"Q$23","v":"Land Value"},{"$f":"C83","v":"Ordinary Business Rates - without proposed special variation"},null,null,null,null,null,null,null,{"$f":"$R84","v":"Ordinary Business Rates - without proposed special variation"},null,null,null,null,null,null,null,{"$f":"$R84","v":"Ordinary Business Rates - without proposed special variation"},null,null,null,null,null,null,null,{"$f":"$R84","v":"Ordinary Business Rates - without proposed special variation"}]
[null,null,null,null,null,{"$f":"F65","v":"2018-19"},{"$f":"G65","v":"2019-20"},"2020-21","2021-22","2022-23","2023-24","2024-25","2025-26",null,null,null,null,{"$f":"R$24","v":"Year 1"},"Year 2","Year 3","Year 4","Year 5","Year 6","Year 7",null,{"$f":"R85","v":"Year 1"},{"$f":"S85","v":"Year 2"},{"$f":"T85","v":"Year 3"},{"$f":"U85","v":"Year 4"},{"$f":"V85","v":"Year 5"},{"$f":"W85","v":"Year 6"},{"$f":"X85","v":"Year 7"},null,{"$f":"R85","v":"Year 1"},{"$f":"S85","v":"Year 2"},{"$f":"T85","v":"Year 3"},{"$f":"U85","v":"Year 4"},{"$f":"V85","v":"Year 5"},{"$f":"W85","v":"Year 6"},{"$f":"X85","v":"Year 7"},null,{"$f":"R85","v":"Year 1"},{"$f":"S85","v":"Year 2"},{"$f":"T85","v":"Year 3"},{"$f":"U85","v":"Year 4"},{"$f":"V85","v":"Year 5"},{"$f":"W85","v":"Year 6"},{"$f":"X85","v":"Year 7"}]
[null,null,{"$f":"C25","v":"$0 to $99,999"},{"$f":"IF(D66=\".\",\".\",D66)","v":141},{"$f":"E25","v":50000},1226.48,1259.5899999999999,1291.08,1323.36,1356.45,1390.36,1425.12,1460.74,null,null,null,{"$f":"$E86","v":50000},{"$f":"IF(G86=\".\",\".\",IF(F86=0,\".\",G86-F86))","v":33.1099999999999},{"$f":"IF(H86=\".\",\".\",IF(G86=0,\".\",H86-G86))","v":31.490000000000009},{"$f":"IF(I86=\".\",\".\",IF(H86=0,\".\",I86-H86))","v":32.279999999999973},{"$f":"IF(J86=\".\",\".\",IF(I86=0,\".\",J86-I86))","v":33.090000000000146},{"$f":"IF(K86=\".\",\".\",IF(J86=0,\".\",K86-J86))","v":33.909999999999854},{"$f":"IF(L86=\".\",\".\",IF(K86=0,\".\",L86-K86))","v":34.759999999999991},{"$f":"IF(M86=\".\",\".\",IF(L86=0,\".\",M86-L86))","v":35.620000000000118},null,{"$f":"IF(G86=\".\",\".\",IF(F86=0,\".\",G86/F86-1))","v":2.6995955906333524E-2},{"$f":"IF(H86=\".\",\".\",IF(G86=0,\".\",H86/G86-1))","v":2.5000198477282298E-2},{"$f":"IF(I86=\".\",\".\",IF(H86=0,\".\",I86/H86-1))","v":2.5002323636025725E-2},{"$f":"IF(J86=\".\",\".\",IF(I86=0,\".\",J86/I86-1))","v":2.5004533913674409E-2},{"$f":"IF(K86=\".\",\".\",IF(J86=0,\".\",K86/J86-1))","v":2.4999078476906522E-2},{"$f":"IF(L86=\".\",\".\",IF(K86=0,\".\",L86/K86-1))","v":2.5000719238182922E-2},{"$f":"IF(M86=\".\",\".\",IF(L86=0,\".\",M86/L86-1))","v":2.4994386437633409E-2},null,{"$f":"IF(G86=\".\",\".\",IF($F86=0,\".\",G86-$F86))","v":33.1099999999999},{"$f":"IF(H86=\".\",\".\",IF($F86=0,\".\",H86-$F86))","v":64.599999999999909},{"$f":"IF(I86=\".\",\".\",IF($F86=0,\".\",I86-$F86))","v":96.879999999999882},{"$f":"IF(J86=\".\",\".\",IF($F86=0,\".\",J86-$F86))","v":129.97000000000003},{"$f":"IF(K86=\".\",\".\",IF($F86=0,\".\",K86-$F86))","v":163.87999999999988},{"$f":"IF(L86=\".\",\".\",IF($F86=0,\".\",L86-$F86))","v":198.63999999999987},{"$f":"IF(M86=\".\",\".\",IF($F86=0,\".\",M86-$F86))","v":234.26},null,{"$f":"IF(G86=\".\",\".\",IF($F86=0,\".\",G86/$F86-1))","v":2.6995955906333524E-2},{"$f":"IF(H86=\".\",\".\",IF($F86=0,\".\",H86/$F86-1))","v":5.267105863935817E-2},{"$f":"IF(I86=\".\",\".\",IF($F86=0,\".\",I86/$F86-1))","v":7.8990281129736939E-2},{"$f":"IF(J86=\".\",\".\",IF($F86=0,\".\",J86/$F86-1))","v":0.1059699302067707},{"$f":"IF(K86=\".\",\".\",IF($F86=0,\".\",K86/$F86-1))","v":0.13361815928510845},{"$f":"IF(L86=\".\",\".\",IF($F86=0,\".\",L86/$F86-1))","v":0.16195942860870116},{"$f":"IF(M86=\".\",\".\",IF($F86=0,\".\",M86/$F86-1))","v":0.19100189159219871}]
[null,null,{"$f":"C26","v":"$100,000 to $199,999"},61,150000,1217.2,1250.06,1281.32,1313.35,1346.18,1379.84,1414.33,1449.69,null,null,null,150000,32.8599999999999,31.259999999999991,32.029999999999973,32.830000000000155,33.659999999999854,34.490000000000009,35.360000000000127,null,2.6996385146237145E-2,2.5006799673615632E-2,2.4997658664502209E-2,2.4997144706285557E-2,2.5004085634907636E-2,2.4995651669758923E-2,2.5001237334992599E-2,null,32.8599999999999,64.119999999999891,96.149999999999864,128.98000000000002,162.63999999999987,197.12999999999988,232.49,null,2.6996385146237145E-2,5.2678278015116486E-2,7.8992770292474423E-2,0.10596450870851126,0.13361813999342753,0.16195366414722301,0.19100394347683203]
[null,null,"$200,000 to $299,999",101,250000,1211.3699999999999,1244.08,1275.18,1307.06,1339.73,1373.23,1407.56,1442.75,null,null,null,250000,32.710000000000036,31.100000000000136,31.879999999999882,32.670000000000073,33.5,34.329999999999927,35.190000000000055,null,2.70024847899486E-2,2.4998392386341717E-2,2.5000392101507174E-2,2.4995027007176374E-2,2.5005038328618445E-2,2.4999453842400765E-2,2.5000710449288199E-2,null,32.710000000000036,63.810000000000173,95.690000000000055,128.36000000000013,161.86000000000013,196.19000000000005,231.38000000000011,null,2.70024847899486E-2,5.2675895886475699E-2,7.8993206039442931E-2,0.10596267036495877,0.13361730932745575,0.16195712292693409,0.19100687651171833]
[null,null,"$300,000 to $399,999",54,350000,1298.6500000000001,1333.71,1367.06,1401.23,1436.26,1472.17,1508.97,1546.7,null,null,null,350000,35.059999999999945,33.349999999999909,34.170000000000073,35.029999999999973,35.910000000000082,36.799999999999955,37.730000000000018,null,2.6997266392022379E-2,2.5005435964339906E-2,2.4995245270873268E-2,2.4999464755964373E-2,2.5002436884686619E-2,2.4997113105144075E-2,2.5003810546266658E-2,null,35.059999999999945,68.409999999999854,102.57999999999993,137.6099999999999,173.51999999999998,210.31999999999994,248.04999999999995,null,2.6997266392022379E-2,5.2677780772340421E-2,7.8989720093943561E-2,0.10596388557348013,0.13361567781927386,0.16195279713548683,0.19100604473876714]
[null,null,"$400,000 to $499,999",48,450000,1548.72,1590.54,1630.3,1671.06,1712.83,1755.65,1799.54,1844.53,null,null,null,450000,41.819999999999936,39.759999999999991,40.759999999999991,41.769999999999982,42.820000000000164,43.889999999999873,44.990000000000009,null,2.7002944366961046E-2,2.4997799489481665E-2,2.5001533460099257E-2,2.4996110253372006E-2,2.4999562128174002E-2,2.4999288012986565E-2,2.5000833546350743E-2,null,41.819999999999936,81.579999999999927,122.33999999999992,164.1099999999999,206.93000000000006,250.81999999999994,295.80999999999995,null,2.7002944366961046E-2,5.2675758045353627E-2,7.8994266232759847E-2,0.10596492587427031,0.13361356475024544,0.16195309675086511,0.19100289271140025]
[null,null,"$500,000 to $599,999",36,550000,1483.47,1523.52,1561.61,1600.65,1640.67,1681.69,1723.73,1766.82,null,null,null,550000,40.049999999999955,38.089999999999918,39.040000000000191,40.019999999999982,41.019999999999982,42.039999999999964,43.089999999999918,null,2.6997512588727846E-2,2.5001312749422411E-2,2.4999839908812271E-2,2.5002342798238208E-2,2.5001980898047726E-2,2.4998662060189414E-2,2.4998114553903328E-2,null,40.049999999999955,78.139999999999873,117.18000000000006,157.20000000000005,198.22000000000003,240.26,283.34999999999991,null,2.6997512588727846E-2,5.2673798593837251E-2,7.8990475034884433E-2,0.10596776476774061,0.13361914969632016,0.16195811172453767,0.19100487370826502]
[null,null,"$600,000 to $699,999",41,650000,1610.28,1653.76,1695.1,1737.48,1780.92,1825.44,1871.07,1917.85,null,null,null,650000,43.480000000000018,41.339999999999918,42.380000000000109,43.440000000000055,44.519999999999982,45.629999999999882,46.779999999999973,null,2.7001515264426068E-2,2.49975812693497E-2,2.5001474839242643E-2,2.5001726638580024E-2,2.4998315477393618E-2,2.4996713121220093E-2,2.5001736974030964E-2,null,43.480000000000018,84.819999999999936,127.20000000000005,170.6400000000001,215.16000000000008,260.78999999999996,307.56999999999994,null,2.7001515264426068E-2,5.2674069105993926E-2,7.8992473358670656E-2,0.10596914822266945,0.13361651389820417,0.16195320068559504,0.19100404898526957]
[null,null,"$700,000 to $799,999",43,750000,1530.4,1571.72,1611.01,1651.29,1692.57,1734.89,1778.26,1822.71,null,null,null,750000,41.319999999999936,39.289999999999964,40.279999999999973,41.279999999999973,42.320000000000164,43.369999999999891,44.450000000000045,null,2.6999477260846838E-2,2.4998091263074729E-2,2.500294846090334E-2,2.4998637428919279E-2,2.5003397200706656E-2,2.4998703087803831E-2,2.4996344741488929E-2,null,41.319999999999936,80.6099999999999,120.88999999999987,162.16999999999985,204.49,247.8599999999999,292.30999999999995,null,2.6999477260846838E-2,5.2672503920543567E-2,7.8992420282279152E-2,0.10596576058546781,0.13361866178776793,0.16195765812859375,0.19100235232618923]
[null,null,"$800,000 to $899,999",25,850000,1885.69,1936.6,1985.02,2034.64,2085.5100000000002,2137.65,2191.09,2245.87,null,null,null,850000,50.909999999999854,48.420000000000073,49.620000000000118,50.870000000000118,52.139999999999873,53.440000000000055,54.779999999999745,null,2.6998074975207897E-2,2.5002581844469685E-2,2.4997229247060604E-2,2.500196594975046E-2,2.5001078872793681E-2,2.4999415245713807E-2,2.5001255083086482E-2,null,50.909999999999854,99.329999999999927,148.95000000000005,199.82000000000016,251.96000000000004,305.40000000000009,360.17999999999984,null,2.6998074975207897E-2,5.2675678398888426E-2,7.8989653654630398E-2,0.1059665162354364,0.13361687233850739,0.16195663125964499,0.19100700539325111]
[null,null,"$900,000 to $999,999",34,950000,1982.8,2036.34,2087.2399999999998,2139.4299999999998,2192.91,2247.73,2303.9299999999998,2361.52,null,null,null,950000,53.539999999999964,50.899999999999864,52.190000000000055,53.480000000000018,54.820000000000164,56.199999999999818,57.590000000000146,null,2.700221908412348E-2,2.499582584440696E-2,2.5004311914298416E-2,2.4997312368247648E-2,2.4998745958566548E-2,2.5003003029723248E-2,2.4996419162040651E-2,null,53.539999999999964,104.43999999999983,156.62999999999988,210.1099999999999,264.93000000000006,321.12999999999988,378.72,null,2.700221908412348E-2,5.2672987694169837E-2,7.8994351422231102E-2,0.1059663102683075,0.133614081097438,0.16195783740165415,0.19100262255396405]
[null,null,"$1,000,000 to $1,499,999",71,1250000,2919.37,2998.19,3073.15,3149.98,3228.73,3309.44,3392.18,3476.98,null,null,null,1250000,78.820000000000164,74.960000000000036,76.829999999999927,78.75,80.710000000000036,82.739999999999782,84.800000000000182,null,2.6998975806423964E-2,2.5001751056470845E-2,2.5000406748775683E-2,2.5000158731166566E-2,2.4997444815763492E-2,2.5001208663701258E-2,2.4998673419452944E-2,null,78.820000000000164,153.7800000000002,230.61000000000013,309.36000000000013,390.07000000000016,472.80999999999995,557.61000000000013,null,2.6998975806423964E-2,5.2675748534786626E-2,7.8993070422728184E-2,0.10596806845312523,0.13361444421227864,0.16195617547621577,0.19100353843466222]
[null,null,"$1,500,000 to $1,999,999",48,1750000,4428.9399999999996,4548.5200000000004,4662.2299999999996,4778.79,4898.26,5020.72,5146.2299999999996,5274.89,null,null,null,1750000,119.58000000000084,113.70999999999913,116.5600000000004,119.47000000000025,122.46000000000004,125.50999999999931,128.66000000000076,null,2.6999688413029022E-2,2.4999340444803897E-2,2.5000911580938867E-2,2.5000052314497978E-2,2.5000714539448632E-2,2.4998406603036871E-2,2.5000825847270924E-2,null,119.58000000000084,233.28999999999996,349.85000000000036,469.32000000000062,591.78000000000065,717.29,845.95000000000073,null,2.6999688413029022E-2,5.2674003260373858E-2,7.8991812939439354E-2,0.10596666470984051,0.13361662158439724,0.161955230822725,0.19100507119084953]
[null,null,"$2,000,000 to $2,999,999",90,2500000,5548.86,5698.68,5841.15,5987.17,6136.85,6290.28,6447.53,6608.72,null,null,null,2500000,149.82000000000062,142.46999999999935,146.02000000000044,149.68000000000029,153.42999999999938,157.25,161.19000000000051,null,2.7000140569414466E-2,2.5000526437701343E-2,2.4998502007310242E-2,2.5000125267864437E-2,2.5001425812916978E-2,2.4998887171954198E-2,2.5000271421769416E-2,null,149.82000000000062,292.28999999999996,438.3100000000004,587.99000000000069,741.42000000000007,898.67000000000007,1059.8600000000006,null,2.7000140569414466E-2,5.2675684735242978E-2,7.8990999953143515E-2,0.10596591011487067,0.13361663476822261,0.16195578911704378,0.1910049992250662]
[null,null,"$3,000,000 and greater",169,3000000,22807.8,23423.61,24009.200000000001,24609.43,25224.67,25855.279999999999,26501.67,27164.21,null,null,null,3000000,615.81000000000131,585.59000000000015,600.22999999999956,615.23999999999796,630.61000000000058,646.38999999999942,662.54000000000087,null,2.6999973693210277E-2,2.4999989327008088E-2,2.4999999999999911E-2,2.5000172698026679E-2,2.4999732404824337E-2,2.5000309414556776E-2,2.4999933966425525E-2,null,615.81000000000131,1201.4000000000015,1801.630000000001,2416.869999999999,3047.4799999999996,3693.869999999999,4356.41,null,2.6999973693210277E-2,5.2674962074378051E-2,7.8991836126237613E-2,0.10596681836915445,0.13361569287699826,0.1619564359561203,0.19100527012688651]
[]
[]
[]
[]
[null,null,"Ordinary Farmland Rates - with proposed special variation",null,null,null,{"$f":"$G$22","v":"$ nominal per year"},null,null,null,null,null,null,null,null,null,null,{"$f":"R$22","v":"Annual increases (nominal $ per year)"},null,null,null,null,null,null,null,"Annual increases (%)",null,null,null,null,null,null,null,"Cumulative increases (nominal $ per year)",null,null,null,null,null,null,null,"Cumulative increases (%)"]
[null,null,"Land Value","Number of property assessments in this valuation range as per Worksheet 3","Land value (for calculation of rates)","Year 0 (Current Rate)","Rate Year 1","Rate Year 2","Rate Year 3","Rate Year 4","Rate Year 5","Rate Year 6","Rate Year 7",null,null,null,{"$f":"Q$23","v":"Land Value"},{"$f":"C104","v":"Ordinary Farmland Rates - with proposed special variation"},null,null,null,null,null,null,null,{"$f":"$R105","v":"Ordinary Farmland Rates - with proposed special variation"},null,null,null,null,null,null,null,{"$f":"$R105","v":"Ordinary Farmland Rates - with proposed special variation"},null,null,null,null,null,null,null,{"$f":"$R105","v":"Ordinary Farmland Rates - with proposed special variation"}]
[null,null,null,null,null,{"$f":"'WK5a - Impact on Rates'!E59","v":"2018-19"},{"$f":"'WK5a - Impact on Rates'!F59","v":"2019-20"},{"$f":"'WK5a - Impact on Rates'!G59","v":"2020-21"},{"$f":"'WK5a - Impact on Rates'!H59","v":"2021-22"},{"$f":"'WK5a - Impact on Rates'!I59","v":"2022-23"},{"$f":"'WK5a - Impact on Rates'!J59","v":"2023-24"},{"$f":"'WK5a - Impact on Rates'!K59","v":"2024-25"},{"$f":"'WK5a - Impact on Rates'!L59","v":"2025-26"},null,null,null,null,{"$f":"R$24","v":"Year 1"},"Year 2","Year 3","Year 4","Year 5","Year 6","Year 7",null,{"$f":"R106","v":"Year 1"},{"$f":"S106","v":"Year 2"},{"$f":"T106","v":"Year 3"},{"$f":"U106","v":"Year 4"},{"$f":"V106","v":"Year 5"},{"$f":"W106","v":"Year 6"},{"$f":"X106","v":"Year 7"},null,{"$f":"R106","v":"Year 1"},{"$f":"S106","v":"Year 2"},{"$f":"T106","v":"Year 3"},{"$f":"U106","v":"Year 4"},{"$f":"V106","v":"Year 5"},{"$f":"W106","v":"Year 6"},{"$f":"X106","v":"Year 7"},null,{"$f":"R106","v":"Year 1"},{"$f":"S106","v":"Year 2"},{"$f":"T106","v":"Year 3"},{"$f":"U106","v":"Year 4"},{"$f":"V106","v":"Year 5"},{"$f":"W106","v":"Year 6"},{"$f":"X106","v":"Year 7"}]
[null,null,{"$f":"C25","v":"$0 to $99,999"},"Not Applicable",{"$f":"E25","v":50000},null,null,null,null,null,null,null,null,null,null,null,{"$f":"$E107","v":50000},{"$f":"IF(G107=\".\",\".\",IF(F107=0,\".\",G107-F107))","v":"."},{"$f":"IF(H107=\".\",\".\",IF(G107=0,\".\",H107-G107))","v":"."},{"$f":"IF(I107=\".\",\".\",IF(H107=0,\".\",I107-H107))","v":"."},{"$f":"IF(J107=\".\",\".\",IF(I107=0,\".\",J107-I107))","v":"."},{"$f":"IF(K107=\".\",\".\",IF(J107=0,\".\",K107-J107))","v":"."},{"$f":"IF(L107=\".\",\".\",IF(K107=0,\".\",L107-K107))","v":"."},{"$f":"IF(M107=\".\",\".\",IF(L107=0,\".\",M107-L107))","v":"."},null,{"$f":"IF(G107=\".\",\".\",IF(F107=0,\".\",G107/F107-1))","v":"."},{"$f":"IF(H107=\".\",\".\",IF(G107=0,\".\",H107/G107-1))","v":"."},{"$f":"IF(I107=\".\",\".\",IF(H107=0,\".\",I107/H107-1))","v":"."},{"$f":"IF(J107=\".\",\".\",IF(I107=0,\".\",J107/I107-1))","v":"."},{"$f":"IF(K107=\".\",\".\",IF(J107=0,\".\",K107/J107-1))","v":"."},{"$f":"IF(L107=\".\",\".\",IF(K107=0,\".\",L107/K107-1))","v":"."},{"$f":"IF(M107=\".\",\".\",IF(L107=0,\".\",M107/L107-1))","v":"."},null,{"$f":"IF(G107=\".\",\".\",IF($F107=0,\".\",G107-$F107))","v":"."},{"$f":"IF(H107=\".\",\".\",IF($F107=0,\".\",H107-$F107))","v":"."},{"$f":"IF(I107=\".\",\".\",IF($F107=0,\".\",I107-$F107))","v":"."},{"$f":"IF(J107=\".\",\".\",IF($F107=0,\".\",J107-$F107))","v":"."},{"$f":"IF(K107=\".\",\".\",IF($F107=0,\".\",K107-$F107))","v":"."},{"$f":"IF(L107=\".\",\".\",IF($F107=0,\".\",L107-$F107))","v":"."},{"$f":"IF(M107=\".\",\".\",IF($F107=0,\".\",M107-$F107))","v":"."},null,{"$f":"IF(G107=\".\",\".\",IF($F107=0,\".\",G107/$F107-1))","v":"."},{"$f":"IF(H107=\".\",\".\",IF($F107=0,\".\",H107/$F107-1))","v":"."},{"$f":"IF(I107=\".\",\".\",IF($F107=0,\".\",I107/$F107-1))","v":"."},{"$f":"IF(J107=\".\",\".\",IF($F107=0,\".\",J107/$F107-1))","v":"."},{"$f":"IF(K107=\".\",\".\",IF($F107=0,\".\",K107/$F107-1))","v":"."},{"$f":"IF(L107=\".\",\".\",IF($F107=0,\".\",L107/$F107-1))","v":"."},{"$f":"IF(M107=\".\",\".\",IF($F107=0,\".\",M107/$F107-1))","v":"."}]
[null,null,{"$f":"C26","v":"$100,000 to $199,999"},null,150000,null,null,null,null,null,null,null,null,null,null,null,150000,".",".",".",".",".",".",".",null,".",".",".",".",".",".",".",null,".",".",".",".",".",".",".",null,".",".",".",".",".",".","."]
[null,null,"$200,000 to $299,999",null,250000,null,null,null,null,null,null,null,null,null,null,null,250000,".",".",".",".",".",".",".",null,".",".",".",".",".",".",".",null,".",".",".",".",".",".",".",null,".",".",".",".",".",".","."]
[null,null,"$300,000 to $399,999",null,350000,null,null,null,null,null,null,null,null,null,null,null,350000,".",".",".",".",".",".",".",null,".",".",".",".",".",".",".",null,".",".",".",".",".",".",".",null,".",".",".",".",".",".","."]
[null,null,"$400,000 to $499,999",null,450000,null,null,null,null,null,null,null,null,null,null,null,450000,".",".",".",".",".",".",".",null,".",".",".",".",".",".",".",null,".",".",".",".",".",".",".",null,".",".",".",".",".",".","."]
[null,null,"$500,000 to $599,999",null,550000,null,null,null,null,null,null,null,null,null,null,null,550000,".",".",".",".",".",".",".",null,".",".",".",".",".",".",".",null,".",".",".",".",".",".",".",null,".",".",".",".",".",".","."]
[null,null,"$600,000 to $699,999",null,650000,null,null,null,null,null,null,null,null,null,null,null,650000,".",".",".",".",".",".",".",null,".",".",".",".",".",".",".",null,".",".",".",".",".",".",".",null,".",".",".",".",".",".","."]
[null,null,"$700,000 to $799,999",null,750000,null,null,null,null,null,null,null,null,null,null,null,750000,".",".",".",".",".",".",".",null,".",".",".",".",".",".",".",null,".",".",".",".",".",".",".",null,".",".",".",".",".",".","."]
[null,null,"$800,000 to $899,999",null,850000,null,null,null,null,null,null,null,null,null,null,null,850000,".",".",".",".",".",".",".",null,".",".",".",".",".",".",".",null,".",".",".",".",".",".",".",null,".",".",".",".",".",".","."]
[null,null,"$900,000 to $999,999",null,950000,null,null,null,null,null,null,null,null,null,null,null,950000,".",".",".",".",".",".",".",null,".",".",".",".",".",".",".",null,".",".",".",".",".",".",".",null,".",".",".",".",".",".","."]
[null,null,"$1,000,000 to $1,499,999",null,1250000,null,null,null,null,null,null,null,null,null,null,null,1250000,".",".",".",".",".",".",".",null,".",".",".",".",".",".",".",null,".",".",".",".",".",".",".",null,".",".",".",".",".",".","."]
[null,null,"$1,500,000 to $1,999,999",null,1750000,null,null,null,null,null,null,null,null,null,null,null,1750000,".",".",".",".",".",".",".",null,".",".",".",".",".",".",".",null,".",".",".",".",".",".",".",null,".",".",".",".",".",".","."]
[null,null,"$2,000,000 to $2,999,999",null,2500000,null,null,null,null,null,null,null,null,null,null,null,2500000,".",".",".",".",".",".",".",null,".",".",".",".",".",".",".",null,".",".",".",".",".",".",".",null,".",".",".",".",".",".","."]
[null,null,"$3,000,000 and greater",null,3000000,null,null,null,null,null,null,null,null,null,null,null,3000000,".",".",".",".",".",".",".",null,".",".",".",".",".",".",".",null,".",".",".",".",".",".",".",null,".",".",".",".",".",".","."]
[]
[]
[]
[null,null,"Ordinary Farmland Rates - without proposed special variation",null,null,null,{"$f":"$G$22","v":"$ nominal per year"},null,null,null,null,null,null,null,null,null,null,{"$f":"R$22","v":"Annual increases (nominal $ per year)"},null,null,null,null,null,null,null,"Annual increases (%)",null,null,null,null,null,null,null,"Cumulative increases (nominal $ per year)",null,null,null,null,null,null,null,"Cumulative increases (%)"]
[null,null,"Land Value","Number of property assessments in this valuation range as per Worksheet 3","Land value (for calculation of rates)","Year 0 (Current Rate)","Rate Year 1","Rate Year 2","Rate Year 3","Rate Year 4","Rate Year 5","Rate Year 6","Rate Year 7",null,null,null,{"$f":"Q$23","v":"Land Value"},{"$f":"C124","v":"Ordinary Farmland Rates - without proposed special variation"},null,null,null,null,null,null,null,{"$f":"$R125","v":"Ordinary Farmland Rates - without proposed special variation"},null,null,null,null,null,null,null,{"$f":"$R125","v":"Ordinary Farmland Rates - without proposed special variation"},null,null,null,null,null,null,null,{"$f":"$R125","v":"Ordinary Farmland Rates - without proposed special variation"}]
[null,null,null,null,null,{"$f":"F106","v":"2018-19"},{"$f":"G106","v":"2019-20"},"2020-21","2021-22","2022-23","2023-24","2024-25","2025-26",null,null,null,null,{"$f":"R$24","v":"Year 1"},"Year 2","Year 3","Year 4","Year 5","Year 6","Year 7",null,{"$f":"R126","v":"Year 1"},{"$f":"S126","v":"Year 2"},{"$f":"T126","v":"Year 3"},{"$f":"U126","v":"Year 4"},{"$f":"V126","v":"Year 5"},{"$f":"W126","v":"Year 6"},{"$f":"X126","v":"Year 7"},null,{"$f":"R126","v":"Year 1"},{"$f":"S126","v":"Year 2"},{"$f":"T126","v":"Year 3"},{"$f":"U126","v":"Year 4"},{"$f":"V126","v":"Year 5"},{"$f":"W126","v":"Year 6"},{"$f":"X126","v":"Year 7"},null,{"$f":"R126","v":"Year 1"},{"$f":"S126","v":"Year 2"},{"$f":"T126","v":"Year 3"},{"$f":"U126","v":"Year 4"},{"$f":"V126","v":"Year 5"},{"$f":"W126","v":"Year 6"},{"$f":"X126","v":"Year 7"}]
[null,null,{"$f":"C25","v":"$0 to $99,999"},{"$f":"IF(D107=\".\",\".\",D107)","v":"Not Applicable"},{"$f":"E25","v":50000},null,null,null,null,null,null,null,null,null,null,null,{"$f":"$E127","v":50000},{"$f":"IF(G127=\".\",\".\",IF(F127=0,\".\",G127-F127))","v":"."},{"$f":"IF(H127=\".\",\".\",IF(G127=0,\".\",H127-G127))","v":"."},{"$f":"IF(I127=\".\",\".\",IF(H127=0,\".\",I127-H127))","v":"."},{"$f":"IF(J127=\".\",\".\",IF(I127=0,\".\",J127-I127))","v":"."},{"$f":"IF(K127=\".\",\".\",IF(J127=0,\".\",K127-J127))","v":"."},{"$f":"IF(L127=\".\",\".\",IF(K127=0,\".\",L127-K127))","v":"."},{"$f":"IF(M127=\".\",\".\",IF(L127=0,\".\",M127-L127))","v":"."},null,{"$f":"IF(G127=\".\",\".\",IF(F127=0,\".\",G127/F127-1))","v":"."},{"$f":"IF(H127=\".\",\".\",IF(G127=0,\".\",H127/G127-1))","v":"."},{"$f":"IF(I127=\".\",\".\",IF(H127=0,\".\",I127/H127-1))","v":"."},{"$f":"IF(J127=\".\",\".\",IF(I127=0,\".\",J127/I127-1))","v":"."},{"$f":"IF(K127=\".\",\".\",IF(J127=0,\".\",K127/J127-1))","v":"."},{"$f":"IF(L127=\".\",\".\",IF(K127=0,\".\",L127/K127-1))","v":"."},{"$f":"IF(M127=\".\",\".\",IF(L127=0,\".\",M127/L127-1))","v":"."},null,{"$f":"IF(G127=\".\",\".\",IF($F127=0,\".\",G127-$F127))","v":"."},{"$f":"IF(H127=\".\",\".\",IF($F127=0,\".\",H127-$F127))","v":"."},{"$f":"IF(I127=\".\",\".\",IF($F127=0,\".\",I127-$F127))","v":"."},{"$f":"IF(J127=\".\",\".\",IF($F127=0,\".\",J127-$F127))","v":"."},{"$f":"IF(K127=\".\",\".\",IF($F127=0,\".\",K127-$F127))","v":"."},{"$f":"IF(L127=\".\",\".\",IF($F127=0,\".\",L127-$F127))","v":"."},{"$f":"IF(M127=\".\",\".\",IF($F127=0,\".\",M127-$F127))","v":"."},null,{"$f":"IF(G127=\".\",\".\",IF($F127=0,\".\",G127/$F127-1))","v":"."},{"$f":"IF(H127=\".\",\".\",IF($F127=0,\".\",H127/$F127-1))","v":"."},{"$f":"IF(I127=\".\",\".\",IF($F127=0,\".\",I127/$F127-1))","v":"."},{"$f":"IF(J127=\".\",\".\",IF($F127=0,\".\",J127/$F127-1))","v":"."},{"$f":"IF(K127=\".\",\".\",IF($F127=0,\".\",K127/$F127-1))","v":"."},{"$f":"IF(L127=\".\",\".\",IF($F127=0,\".\",L127/$F127-1))","v":"."},{"$f":"IF(M127=\".\",\".\",IF($F127=0,\".\",M127/$F127-1))","v":"."}]
[null,null,{"$f":"C26","v":"$100,000 to $199,999"},0,150000,null,null,null,null,null,null,null,null,null,null,null,150000,".",".",".",".",".",".",".",null,".",".",".",".",".",".",".",null,".",".",".",".",".",".",".",null,".",".",".",".",".",".","."]
[null,null,"$200,000 to $299,999",0,250000,null,null,null,null,null,null,null,null,null,null,null,250000,".",".",".",".",".",".",".",null,".",".",".",".",".",".",".",null,".",".",".",".",".",".",".",null,".",".",".",".",".",".","."]
[null,null,"$300,000 to $399,999",0,350000,null,null,null,null,null,null,null,null,null,null,null,350000,".",".",".",".",".",".",".",null,".",".",".",".",".",".",".",null,".",".",".",".",".",".",".",null,".",".",".",".",".",".","."]
[null,null,"$400,000 to $499,999",0,450000,null,null,null,null,null,null,null,null,null,null,null,450000,".",".",".",".",".",".",".",null,".",".",".",".",".",".",".",null,".",".",".",".",".",".",".",null,".",".",".",".",".",".","."]
[null,null,"$500,000 to $599,999",0,550000,null,null,null,null,null,null,null,null,null,null,null,550000,".",".",".",".",".",".",".",null,".",".",".",".",".",".",".",null,".",".",".",".",".",".",".",null,".",".",".",".",".",".","."]
[null,null,"$600,000 to $699,999",0,650000,null,null,null,null,null,null,null,null,null,null,null,650000,".",".",".",".",".",".",".",null,".",".",".",".",".",".",".",null,".",".",".",".",".",".",".",null,".",".",".",".",".",".","."]
[null,null,"$700,000 to $799,999",0,750000,null,null,null,null,null,null,null,null,null,null,null,750000,".",".",".",".",".",".",".",null,".",".",".",".",".",".",".",null,".",".",".",".",".",".",".",null,".",".",".",".",".",".","."]
[null,null,"$800,000 to $899,999",0,850000,null,null,null,null,null,null,null,null,null,null,null,850000,".",".",".",".",".",".",".",null,".",".",".",".",".",".",".",null,".",".",".",".",".",".",".",null,".",".",".",".",".",".","."]
[null,null,"$900,000 to $999,999",0,950000,null,null,null,null,null,null,null,null,null,null,null,950000,".",".",".",".",".",".",".",null,".",".",".",".",".",".",".",null,".",".",".",".",".",".",".",null,".",".",".",".",".",".","."]
[null,null,"$1,000,000 to $1,499,999",0,1250000,null,null,null,null,null,null,null,null,null,null,null,1250000,".",".",".",".",".",".",".",null,".",".",".",".",".",".",".",null,".",".",".",".",".",".",".",null,".",".",".",".",".",".","."]
[null,null,"$1,500,000 to $1,999,999",0,1750000,null,null,null,null,null,null,null,null,null,null,null,1750000,".",".",".",".",".",".",".",null,".",".",".",".",".",".",".",null,".",".",".",".",".",".",".",null,".",".",".",".",".",".","."]
[null,null,"$2,000,000 to $2,999,999",0,2500000,null,null,null,null,null,null,null,null,null,null,null,2500000,".",".",".",".",".",".",".",null,".",".",".",".",".",".",".",null,".",".",".",".",".",".",".",null,".",".",".",".",".",".","."]
[null,null,"$3,000,000 and greater",0,3000000,null,null,null,null,null,null,null,null,null,null,null,3000000,".",".",".",".",".",".",".",null,".",".",".",".",".",".",".",null,".",".",".",".",".",".",".",null,".",".",".",".",".",".","."]

{"sheet":"WK6 - Expenditure Program","index":11,"n_rows":115,"n_cols":22,"rows_kept":115,"cut":false,"hidden":false,"merged":[]}
[]
[]
[null,null,{"$f":"'WK2 - Notional General Income'!$C$3","v":"Burwood Council"}]
[]
[null,null,null,null,null,null,null,null,null,"WORKSHEET 6"]
[]
[null,null,null,null,null,null,null,null,null,"PROPOSED ADDITIONAL SPECIAL VARIATION INCOME AND EXPENDITURE"]
[null,null,null,null,null,null,null,null,null,"      All dollars in nominal terms"]
[]
[null,null,null,null,null,null,"This sheet shows how the council proposes to use the additional income from the special variation."]
[null,null,null,null,null,null,{"$f":"\"Enter the proposed spending over \"&IF($G$18='WK0 - Input data'!$B$243,10,G19)&\" years under each of the headings as relevant.\"","v":"Enter the proposed spending over 10 years under each of the headings as relevant."}]
[]
[null,null,null,null,null,null,"For additional SV income in years beyond the period of the proposed special variation, we increase the income after the final year"]
[null,null,null,null,null,null,"of the variation by the assumed rate peg of 2.5% in each of the future years. i.e. multiply by 1.025 each year."]
[]
[null,null,"Note: Columns G to P are formatted black if no data are required for a temporary SV. They will also display black before information has been entered regarding the proposed SV (WK 1 - Identification)"]
[]
[null,null,"Is proposed SV permanent or temporary?",null,null,null,{"$f":"'WK1 - Identification'!$K$30","v":"Permanent"},null,null,null,null,null,null,null,null,null,null,null,null,null,null,"DO NOT DELETE"]
[null,null,"Duration of proposed SV (years)",null,null,null,{"$f":"'WK1 - Identification'!K31","v":0},null,null,null,null,null,null,null,null,null,null,null,null,null,null,"Yes"]
[null,null,"Year ",null,null,null,1,{"$f":"1+G20","v":2},3,4,5,6,7,8,9,10,null,null,null,null,null,"No"]
[null,null,"Is the Temporary SV in place in the year?",null,null,null,{"$f":"IF($G$18='WK0 - Input data'!$B$243,$V$21,(IF($G$19>=G20,$V$19,$V$20)))","v":"na"},{"$f":"IF($G$18='WK0 - Input data'!$B$243,$V$21,(IF($G$19>=H20,$V$19,$V$20)))","v":"na"},{"$f":"IF($G$18='WK0 - Input data'!$B$243,$V$21,(IF($G$19>=I20,$V$19,$V$20)))","v":"na"},{"$f":"IF($G$18='WK0 - Input data'!$B$243,$V$21,(IF($G$19>=J20,$V$19,$V$20)))","v":"na"},{"$f":"IF($G$18='WK0 - Input data'!$B$243,$V$21,(IF($G$19>=K20,$V$19,$V$20)))","v":"na"},{"$f":"IF($G$18='WK0 - Input data'!$B$243,$V$21,(IF($G$19>=L20,$V$19,$V$20)))","v":"na"},{"$f":"IF($G$18='WK0 - Input data'!$B$243,$V$21,(IF($G$19>=M20,$V$19,$V$20)))","v":"na"},{"$f":"IF($G$18='WK0 - Input data'!$B$243,$V$21,(IF($G$19>=N20,$V$19,$V$20)))","v":"na"},{"$f":"IF($G$18='WK0 - Input data'!$B$243,$V$21,(IF($G$19>=O20,$V$19,$V$20)))","v":"na"},{"$f":"IF($G$18='WK0 - Input data'!$B$243,$V$21,(IF($G$19>=P20,$V$19,$V$20)))","v":"na"},null,null,null,null,null,"na"]
[]
[]
[null,null,null,null,null,null,{"$f":"'WK0 - Input data'!G55","v":"Year 1"},{"$f":"'WK0 - Input data'!H55","v":"Year 2"},{"$f":"'WK0 - Input data'!I55","v":"Year 3"},{"$f":"'WK0 - Input data'!J55","v":"Year 4"},{"$f":"'WK0 - Input data'!K55","v":"Year 5"},{"$f":"'WK0 - Input data'!L55","v":"Year 6"},{"$f":"'WK0 - Input data'!M55","v":"Year 7"},{"$f":"'WK0 - Input data'!N55","v":"Year 8"},{"$f":"'WK0 - Input data'!O55","v":"Year 9"},{"$f":"'WK0 - Input data'!P55","v":"Year 10"},{"$f":"IF(P21=V20,\"Sum of \"&G19&\" years\",\"Sum of 10 years\")","v":"Sum of 10 years"}]
[null,null,null,null,null,null,{"$f":"'WK0 - Input data'!G58","v":"2019-20"},{"$f":"'WK0 - Input data'!H58","v":"2020-21"},{"$f":"'WK0 - Input data'!I58","v":"2021-22"},{"$f":"'WK0 - Input data'!J58","v":"2022-23"},{"$f":"'WK0 - Input data'!K58","v":"2023-24"},{"$f":"'WK0 - Input data'!L58","v":"2024-25"},{"$f":"'WK0 - Input data'!M58","v":"2025-26"},{"$f":"'WK0 - Input data'!N58","v":"2026-27"},{"$f":"'WK0 - Input data'!O58","v":"2027-28"},{"$f":"'WK0 - Input data'!P58","v":"2028-29"}]
[null,null,"Income",null,null,null,{"$f":"'WK0 - Input data'!$C$63","v":"$ nominal per year"}]
[null,null,{"$f":"CHOOSE('WK1 - Identification'!$R$24,\"Proposed SV income above existing SV/rate peg\",\"Proposed SV income above rate peg\")","v":"Proposed SV income above rate peg"},null,null,null,{"$f":"IF('WK4 - PGI summary'!F52=0,\".\",'WK4 - PGI summary'!G52-'WK4 - PGI summary'!G61)","v":453012.99531478807},{"$f":"IF(H21=$V$20,\".\",(IF('WK4 - PGI summary'!H52=\".\",G27*(1+'WK0 - Input data'!$D$48),'WK4 - PGI summary'!H52-'WK4 - PGI summary'!H61)))","v":937262.58629224077},{"$f":"IF(I21=$V$20,\".\",(IF('WK4 - PGI summary'!I52=\".\",H27*(1+'WK0 - Input data'!$D$48),'WK4 - PGI summary'!I52-'WK4 - PGI summary'!I61)))","v":1454900.0090183839},{"$f":"IF(J21=$V$20,\".\",(IF('WK4 - PGI summary'!J52=\".\",I27*(1+'WK0 - Input data'!$D$48),'WK4 - PGI summary'!J52-'WK4 - PGI summary'!J61)))","v":2007717.630925782},{"$f":"IF(K21=$V$20,\".\",(IF('WK4 - PGI summary'!K52=\".\",J27*(1+'WK0 - Input data'!$D$48),'WK4 - PGI summary'!K52-'WK4 - PGI summary'!K61)))","v":2057910.5716989264},{"$f":"IF(L21=$V$20,\".\",(IF('WK4 - PGI summary'!L52=\".\",K27*(1+'WK0 - Input data'!$D$48),'WK4 - PGI summary'!L52-'WK4 - PGI summary'!L61)))","v":2109358.3359913994},{"$f":"IF(M21=$V$20,\".\",(IF('WK4 - PGI summary'!M52=\".\",L27*(1+'WK0 - Input data'!$D$48),'WK4 - PGI summary'!M52-'WK4 - PGI summary'!M61)))","v":2162092.2943911841},{"$f":"IF(N21=$V$20,\".\",M27*(1+'WK0 - Input data'!$D$48))","v":2216144.6017509634},{"$f":"IF(O21=$V$20,\".\",N27*(1+'WK0 - Input data'!$D$48))","v":2271548.2167947371},{"$f":"IF(P21=$V$20,\".\",O27*(1+'WK0 - Input data'!$D$48))","v":2328336.9222146054},{"$f":"SUM(G27:P27)","v":17998284.164393008}]
[]
[null,null,"Operating balance",null,null,null,{"$f":"$G$26","v":"$ nominal per year"}]
[null,null,"Change in Operating Balance due to proposed SV",null,null,null,{"$f":"IF(G21=$V$20,\".\",G27-G65)","v":453012.99531478807},937262.58629224077,1454900.0090183839,2007717.630925782,2057910.5716989264,2109358.3359913994,2162092.2943911841,2216144.6017509634,2271548.2167947371,2328336.9222146054,{"$f":"SUM(G30:P30)","v":17998284.164393008}]
[]
[null,null,"Operating expenses (including loan interest costs)",null,null,null,null,null,{"$f":"$G$26","v":"$ nominal per year"}]
[null,null,"Fund existing service levels (eg, libraries)",null,null,null,{"$f":"IF(G21=$V$20,\"leave blank\",\".\")","v":"."},".",".",".",".",".",".",".",".","."]
[null,null,null,null,null,null,null,null,null,null,null,null,null,null,null,null,{"$f":"SUM(G34:P34)-SUMIF($G$21:$P$21,$V$20,G34:P34)","v":0}]
[null,null,null,null,null,null,null,null,null,null,null,null,null,null,null,null,0]
[null,null,null,null,null,null,null,null,null,null,null,null,null,null,null,null,0]
[null,null,null,null,null,null,null,null,null,null,null,null,null,null,null,null,0]
[null,null,null,null,null,null,null,null,null,null,null,null,null,null,null,null,0]
[null,null,null,null,null,null,null,null,null,null,null,null,null,null,null,null,0]
[null,null,null,null,null,null,null,null,null,null,null,null,null,null,null,null,0]
[null,null,null,null,null,null,null,null,null,null,null,null,null,null,null,null,0]
[null,null,null,null,null,null,null,null,null,null,null,null,null,null,null,null,0]
[null,null,null,null,null,null,null,null,null,null,null,null,null,null,null,null,0]
[null,null,null,null,null,null,null,null,null,null,null,null,null,null,null,null,0]
[null,null,null,null,null,null,null,null,null,null,null,null,null,null,null,null,0]
[null,null,null,null,null,null,null,null,null,null,null,null,null,null,null,null,0]
[null,null,null,null,null,null,null,null,null,null,null,null,null,null,null,null,0]
[null,null,null,null,null,null,null,null,null,null,null,null,null,null,null,null,0]
[null,null,"Fund new/enhanced service levels (eg, sustainability program)",null,null,null,null,null,null,null,null,null,null,null,null,null,0]
[null,null,null,null,null,null,null,null,null,null,null,null,null,null,null,null,0]
[null,null,null,null,null,null,null,null,null,null,null,null,null,null,null,null,0]
[null,null,null,null,null,null,null,null,null,null,null,null,null,null,null,null,0]
[null,null,null,null,null,null,null,null,null,null,null,null,null,null,null,null,0]
[null,null,null,null,null,null,null,null,null,null,null,null,null,null,null,null,0]
[null,null,null,null,null,null,null,null,null,null,null,null,null,null,null,null,0]
[null,null,null,null,null,null,null,null,null,null,null,null,null,null,null,null,0]
[null,null,null,null,null,null,null,null,null,null,null,null,null,null,null,null,0]
[null,null,null,null,null,null,null,null,null,null,null,null,null,null,null,null,0]
[null,null,null,null,null,null,null,null,null,null,null,null,null,null,null,null,0]
[null,null,null,null,null,null,null,null,null,null,null,null,null,null,null,null,0]
[null,null,null,null,null,null,null,null,null,null,null,null,null,null,null,null,0]
[null,null,null,null,null,null,null,null,null,null,null,null,null,null,null,null,0]
[null,null,null,null,null,null,null,null,null,null,null,null,null,null,null,null,0]
[null,null,null,null,null,null,null,null,null,null,null,null,null,null,null,null,0]
[null,null,"Annual total",null,null,null,{"$f":"IF(G$27=\".\",\".\",SUM(G34:G48,G50:G64))","v":0},{"$f":"IF(H$27=\".\",\".\",SUM(H34:H48,H50:H64))","v":0},0,0,0,0,0,0,0,0,0,{"$f":"SUM(Q34:Q64)-Q65","v":0}]
[null,null,"Cumulative totals by year",null,null,null,{"$f":"IF(G$27=\".\",\".\",SUM($G65:G65))","v":0},{"$f":"IF(H$27=\".\",\".\",SUM($G65:H65))","v":0},{"$f":"IF(I$27=\".\",\".\",SUM($G65:I65))","v":0},{"$f":"IF(J$27=\".\",\".\",SUM($G65:J65))","v":0},{"$f":"IF(K$27=\".\",\".\",SUM($G65:K65))","v":0},{"$f":"IF(L$27=\".\",\".\",SUM($G65:L65))","v":0},{"$f":"IF(M$27=\".\",\".\",SUM($G65:M65))","v":0},{"$f":"IF(N$27=\".\",\".\",SUM($G65:N65))","v":0},{"$f":"IF(O$27=\".\",\".\",SUM($G65:O65))","v":0},{"$f":"IF(P$27=\".\",\".\",SUM($G65:P65))","v":0}]
[]
[null,null,"Capital expenditure",null,null,null,{"$f":"$G$26","v":"$ nominal per year"}]
[null,null,null,null,null,null,{"$f":"G$33","v":"."},".",".",{"$f":"J$33","v":"."},{"$f":"K$33","v":"."},".",".",".",".","."]
[null,null,"Renewals:"]
[null,null,"Drainage Works (Kerb & Gutter and Road restoration)",null,null,null,453013,937263,1454900,2007718,2057911,2109358,2162092,2216145,2271548,2328337,{"$f":"SUM(G71:P71)-SUMIF($G$21:$P$21,$V$20,G71:P71)","v":17998285}]
[null,null,null,null,null,null,null,null,null,null,null,null,null,null,null,null,0]
[null,null,null,null,null,null,null,null,null,null,null,null,null,null,null,null,0]
[null,null,null,null,null,null,null,null,null,null,null,null,null,null,null,null,0]
[null,null,null,null,null,null,null,null,null,null,null,null,null,null,null,null,0]
[null,null,null,null,null,null,null,null,null,null,null,null,null,null,null,null,0]
[null,null,null,null,null,null,null,null,null,null,null,null,null,null,null,null,0]
[null,null,null,null,null,null,null,null,null,null,null,null,null,null,null,null,0]
[null,null,null,null,null,null,null,null,null,null,null,null,null,null,null,null,0]
[null,null,null,null,null,null,null,null,null,null,null,null,null,null,null,null,0]
[null,null,null,null,null,null,null,null,null,null,null,null,null,null,null,null,0]
[null,null,null,null,null,null,null,null,null,null,null,null,null,null,null,null,0]
[null,null,"New assets"]
[null,null,null,null,null,null,null,null,null,null,null,null,null,null,null,null,{"$f":"SUM(G84:P84)-SUMIF($G$21:$P$21,$V$20,G84:P84)","v":0}]
[null,null,null,null,null,null,null,null,null,null,null,null,null,null,null,null,0]
[null,null,null,null,null,null,null,null,null,null,null,null,null,null,null,null,0]
[null,null,null,null,null,null,null,null,null,null,null,null,null,null,null,null,0]
[null,null,null,null,null,null,null,null,null,null,null,null,null,null,null,null,0]
[null,null,null,null,null,null,null,null,null,null,null,null,null,null,null,null,0]
[null,null,null,null,null,null,null,null,null,null,null,null,null,null,null,null,0]
[null,null,null,null,null,null,null,null,null,null,null,null,null,null,null,null,0]
[null,null,null,null,null,null,null,null,null,null,null,null,null,null,null,null,0]
[null,null,null,null,null,null,null,null,null,null,null,null,null,null,null,null,0]
[null,null,null,null,null,null,null,null,null,null,null,null,null,null,null,null,0]
[null,null,{"$f":"C$65","v":"Annual total"},null,null,null,{"$f":"IF(G$27=\".\",\".\",SUM(G71:G82,G84:G94))","v":453013},{"$f":"IF(H$27=\".\",\".\",SUM(H71:H82,H84:H94))","v":937263},1454900,2007718,2057911,2109358,2162092,2216145,2271548,2328337,17998285,{"$f":"SUM(Q70:Q94)-Q95","v":0}]
[null,null,{"$f":"C$66","v":"Cumulative totals by year"},null,null,null,{"$f":"IF(G$27=\".\",\".\",SUM($G95:G95))","v":453013},{"$f":"IF(H$27=\".\",\".\",SUM($G95:H95))","v":1390276},{"$f":"IF(I$27=\".\",\".\",SUM($G95:I95))","v":2845176},{"$f":"IF(J$27=\".\",\".\",SUM($G95:J95))","v":4852894},{"$f":"IF(K$27=\".\",\".\",SUM($G95:K95))","v":6910805},{"$f":"IF(L$27=\".\",\".\",SUM($G95:L95))","v":9020163},{"$f":"IF(M$27=\".\",\".\",SUM($G95:M95))","v":11182255},{"$f":"IF(N$27=\".\",\".\",SUM($G95:N95))","v":13398400},{"$f":"IF(O$27=\".\",\".\",SUM($G95:O95))","v":15669948},{"$f":"IF(P$27=\".\",\".\",SUM($G95:P95))","v":17998285}]
[]
[null,null,"Other uses of proposed SV income (eg, loan principal repayments, transfers to reserves)",null,null,null,null,null,null,null,null,{"$f":"$G$26","v":"$ nominal per year"}]
[null,null,null,null,null,null,{"$f":"G$33","v":"."},".",".",{"$f":"J$33","v":"."},{"$f":"K$33","v":"."},".",".",".",".","."]
[null,null,null,null,null,null,null,null,null,null,null,null,null,null,null,null,{"$f":"SUM(G100:P100)-SUMIF($G$21:$P$21,$V$20,G100:P100)","v":0}]
[null,null,null,null,null,null,null,null,null,null,null,null,null,null,null,null,0]
[null,null,null,null,null,null,null,null,null,null,null,null,null,null,null,null,0]
[null,null,null,null,null,null,null,null,null,null,null,null,null,null,null,null,0]
[null,null,null,null,null,null,null,null,null,null,null,null,null,null,null,null,0]
[null,null,null,null,null,null,null,null,null,null,null,null,null,null,null,null,0]
[null,null,null,null,null,null,null,null,null,null,null,null,null,null,null,null,0]
[null,null,null,null,null,null,null,null,null,null,null,null,null,null,null,null,0]
[null,null,null,null,null,null,null,null,null,null,null,null,null,null,null,null,0]
[null,null,null,null,null,null,null,null,null,null,null,null,null,null,null,null,0]
[null,null,{"$f":"C$65","v":"Annual total"},null,null,null,{"$f":"IF(G$27=\".\",\".\",SUM(G100:G109))","v":0},0,0,0,0,0,0,0,0,0,0,{"$f":"SUM(Q100:Q109)-Q110","v":0}]
[null,null,{"$f":"C$66","v":"Cumulative totals by year"},null,null,null,{"$f":"IF(G$27=\".\",\".\",SUM($G110:G110))","v":0},{"$f":"IF(H$27=\".\",\".\",SUM($G110:H110))","v":0},{"$f":"IF(I$27=\".\",\".\",SUM($G110:I110))","v":0},{"$f":"IF(J$27=\".\",\".\",SUM($G110:J110))","v":0},{"$f":"IF(K$27=\".\",\".\",SUM($G110:K110))","v":0},{"$f":"IF(L$27=\".\",\".\",SUM($G110:L110))","v":0},{"$f":"IF(M$27=\".\",\".\",SUM($G110:M110))","v":0},{"$f":"IF(N$27=\".\",\".\",SUM($G110:N110))","v":0},{"$f":"IF(O$27=\".\",\".\",SUM($G110:O110))","v":0},{"$f":"IF(P$27=\".\",\".\",SUM($G110:P110))","v":0}]
[]
[null,null,"Total   ",null,null,null,{"$f":"$G$26","v":"$ nominal per year"}]
[null,null,"Total use of proposed SV income",null,null,null,{"$f":"IF(G$21=$V$20,\".\",G65+G95+G110)","v":453013},937263,1454900,2007718,2057911,2109358,2162092,2216145,2271548,2328337,{"$f":"Q65+Q95+Q110","v":17998285}]
[null,null,"Difference between additional SRV income and its uses",null,null,null,{"$f":"IF(G$21=$V$20,\".\",G27-G114)","v":-4.6852119266986847E-3},-0.41370775923132896,9.0183839201927185E-3,-0.36907421797513962,-0.42830107361078262,0.3359913993626833,0.29439118411391973,-0.39824903663247824,0.21679473714902997,-7.7785394620150328E-2,{"$f":"SUM(G115:P115)","v":-0.83560698945075274}]

{"sheet":"WK7 - Historical financials","index":12,"n_rows":112,"n_cols":9,"rows_kept":112,"cut":false,"hidden":false,"merged":[]}
[]
[]
[null,null,{"$f":"'WK2 - Notional General Income'!$C$3","v":"Burwood Council"}]
[]
[null,null,null,null,null,"WORKSHEET 7"]
[]
[null,null,null,null,null,"HISTORICAL FINANCIAL INFORMATION"]
[null,null,null,null,null,"      All dollars in nominal terms ($'000)"]
[]
[null,null,null,null,null,"This sheet captures the council's historical financial information as reported in its financial statements."]
[]
[]
[null,null,"Income statement",null,null,null,null,"$'000 nominal per year"]
[null,null,null,null,null,null,{"$f":"'WK0 - Input data'!C$58","v":"2015-16"},{"$f":"'WK0 - Input data'!D$58","v":"2016-17"},{"$f":"'WK0 - Input data'!E$58","v":"2017-18"}]
[null,null,"Income"]
[null,null,"Rates and Annual Charges",null,null,null,22888,24927,26708]
[null,null,"User Charges & Fees",null,null,null,9563,10235,11622]
[null,null,"Interest and Investment Revenues",null,null,null,2048,1215,1392]
[null,null,"Other Revenues",null,null,null,4642,4810,5620]
[null,null,"Grants & Contributions Op purposes",null,null,null,3628,3901,3465]
[null,null,"Grants & Contributions Capital purposes",null,null,null,8156,3954,14164]
[null,null,"Net gains asset sales",null,null,null,37,124,0]
[null,null,"Joint Ventures and Associated Entities",null,null,null,0,53,104]
[null,null,"Total Income",null,null,null,{"$f":"SUM(G16:G23)","v":50962},{"$f":"SUM(H16:H23)","v":49219},63075]
[null,null,"Income excluding Cap. Grants & Contrib.",null,null,null,{"$f":"G24-G21","v":42806},{"$f":"H24-H21","v":45265},48911]
[null,null,"Income excluding Cap. Grants & Contrib. and net gains from asset sales",null,null,null,{"$f":"G25-G22","v":42769},{"$f":"H25-H22","v":45141},{"$f":"I25-I22","v":48911}]
[]
[null,null,"Expenses"]
[null,null,"Employee Benefits & On-costs",null,null,null,17634,17462,17885]
[null,null,"Borrowing Costs (i.e. interest costs)",null,null,null,354,335,325]
[null,null,"Materials & Contracts",null,null,null,10956,10201,11796]
[null,null,"Depreciation & Amortisation",null,null,null,6392,6719,6969]
[null,null,"Impairment",null,null,null,0,96,0]
[null,null,"Other Expenses",null,null,null,7390,7666,8232]
[null,null,"Net loss from disposal of assets",null,null,null,0,0,1386]
[null,null,"Interest & Investment losses",null,null,null,0,0,0]
[null,null,"Joint Ventures and Associated Entities",null,null,null,89,0,0]
[null,null,"Total Expenses",null,null,null,{"$f":"SUM(G29:G37)","v":42815},{"$f":"SUM(H29:H37)","v":42479},46593]
[null,null,"Expenses excluding investment losses",null,null,null,{"$f":"G38-G36","v":42815},{"$f":"H38-H36","v":42479},46593]
[null,null,"Expenses excluding net losses on asset disposals",null,null,null,{"$f":"G39-G35","v":42815},{"$f":"H39-H35","v":42479},45207]
[]
[null,null,"Operating result from continuing operations",null,null,null,{"$f":"G24-G38","v":8147},{"$f":"H24-H38","v":6740},{"$f":"I24-I38","v":16482}]
[null,null,"Net operating result before Cap. Grants & Contrib",null,null,null,{"$f":"G25-G38","v":-9},{"$f":"H25-H38","v":2786},2318]
[null,null,"Net operating result before Cap. Grants & Contrib and net gains from asset sales",null,null,null,{"$f":"G26-G40","v":-46},{"$f":"H26-H40","v":2662},{"$f":"I26-I40","v":3704}]
[null,null,"Operating Performance Ratioa",null,null,null,{"$f":"IF(G26=0,0,G44/G26)","v":-1.0755453716476888E-3},{"$f":"IF(H26=0,0,H44/H26)","v":5.8970780443499259E-2},7.5729386027682935E-2]
[]
[null,null,"a. Net Operating Balance (excl Cap. Grants & Contrib. and net gains from asset sales) as % income (excl Cap. Grants & Contrib. and net gains from asset sales)"]
[]
[]
[null,null,"Borrowing costs and  repayments",null,null,null,null,"$'000 nominal per year"]
[null,null,"Source: Cash flow statement"]
[null,null,null,null,null,null,{"$f":"G$14","v":"2015-16"},{"$f":"H$14","v":"2016-17"},{"$f":"I$14","v":"2017-18"}]
[]
[null,null,"Borrowing costs",null,null,null,355,336,320]
[null,null,"Repayment of borrowings and advances",null,null,null,422,444,466]
[]
[]
[]
[]
[null,null,"Infrastructure asset performance indicators by fund      %"]
[null,null,"Source:","Special Schedule 7 (General fund)"]
[null,null,null,null,null,null,{"$f":"G$14","v":"2015-16"},{"$f":"H$14","v":"2016-17"},{"$f":"I$14","v":"2017-18"}]
[]
[null,null,"1. Infrastructure renewals ratio",null,null,null,1.3973,1.1771,1.7062999999999999]
[null,null,"2. Infrastructure backlog ratio",null,null,null,7.6399999999999996E-2,7.2800000000000004E-2,7.0900000000000005E-2]
[null,null,"3. Asset maintenance ratio",null,null,null,0.90859999999999996,1.0259,1.2041999999999999]
[]
[]
[]
[]
[null,null,"Cash and investments",null,null,null,null,null,"$'000 nominal"]
[null,null,"Source:","Note 6a, 6b, 6c"]
[null,null,null,null,null,null,null,null,{"$f":"I$14","v":"2017-18"}]
[]
[null,null,"6a - Cash and cash equivalents"]
[null,null,"Cash on hand and at bank",null,null,null,null,null,4064]
[null,null,"Cash-equivalent assets",null,null,null,null,null,3123]
[null,null,"Total",null,null,null,null,null,{"$f":"SUM(I76:I77)","v":7187}]
[]
[null,null,"6b - Investments"]
[null,null,"Current",null,null,null,null,null,40000]
[null,null,"Non-current",null,null,null,null,null,10000]
[null,null,"Total",null,null,null,null,null,{"$f":"SUM(I81:I82)","v":50000}]
[]
[null,null,"Total cash, cash equivalents, and investments",null,null,null,null,null,{"$f":"I78+I83","v":57187}]
[]
[null,null,"6c Restricted cash, cash equivalents, and investments"]
[null,null,"External restrictions",null,null,null,null,null,22673]
[null,null,"Internal restrictions",null,null,null,null,null,28701]
[null,null,"Unrestricted",null,null,null,null,null,5813]
[null,null,"Total",null,null,null,null,null,{"$f":"SUM(I88:I90)","v":57187}]
[null,null,"check = 0",null,null,null,null,null,{"$f":"I91-I85","v":0}]
[]
[]
[]
[]
[null,null,"Balance sheet extract (General fund)",null,null,null,null,null,{"$f":"I71","v":"$'000 nominal"}]
[null,null,"Source:","Notes to financial statements"]
[null,null,null,null,null,null,null,null,{"$f":"I$14","v":"2017-18"}]
[]
[null,null,"Assets"]
[null,null,"Cash and cash equivalents",null,null,null,null,null,47187]
[null,null,"Receivables - current",null,null,null,null,null,4724]
[null,null,"Receivables - non current"]
[null,null,"Total ",null,null,null,null,null,{"$f":"SUM(I102:I104)","v":51911}]
[]
[null,null,"Liabilities"]
[null,null,"Payables - current",null,null,null,null,null,9713]
[null,null,"Payables - non current",null,null,null,null,null,0]
[null,null,"Borrowings - current",null,null,null,null,null,574]
[null,null,"Borrowings - non current",null,null,null,null,null,5920]
[null,null,"Total ",null,null,null,null,null,{"$f":"SUM(I108:I111)","v":16207}]

{"sheet":"WK8 - Long Term Financial Plan","index":13,"n_rows":214,"n_cols":20,"rows_kept":214,"cut":false,"hidden":false,"merged":[]}
[]
[]
[null,null,{"$f":"'WK2 - Notional General Income'!$C$3","v":"Burwood Council"}]
[]
[null,null,null,null,null,null,null,null,"WORKSHEET 8"]
[]
[null,null,null,null,null,null,null,null,"LONG TERM FINANCIAL PLAN - SV SCENARIO AND BASE CASE"]
[null,null,null,null,null,null,null,null,"      All dollars in nominal terms"]
[]
[null,null,null,null,"This sheet shows how the council's Long Term Financial Plan reflects the impact of the proposed special variation versus its base case (no special variation).  "]
[null,null,null,null,"Enter the figures from the most recent Long Term Financial Plan over 10 years under each of the headings as relevant.  Add rows if necessary."]
[]
[null,null,null,null,"In the last table, please enter the key assumptions relating to the Long Term Financial Plan. Please ensure that these figures match the latest version"]
[null,null,null,null,"of the Long Term Financial Plan provided with the application and that these figures are for the GENERAL FUND ONLY."]
[]
[null,null,"SCENARIO 1: Proposed additional SV income and expenditure"]
[null,null,null,null,null,{"$f":"'WK0 - Input data'!F55","v":"Year 0"},{"$f":"'WK0 - Input data'!G55","v":"Year 1"},{"$f":"'WK0 - Input data'!H55","v":"Year 2"},{"$f":"'WK0 - Input data'!I55","v":"Year 3"},{"$f":"'WK0 - Input data'!J55","v":"Year 4"},{"$f":"'WK0 - Input data'!K55","v":"Year 5"},{"$f":"'WK0 - Input data'!L55","v":"Year 6"},{"$f":"'WK0 - Input data'!M55","v":"Year 7"},{"$f":"'WK0 - Input data'!N55","v":"Year 8"},{"$f":"'WK0 - Input data'!O55","v":"Year 9"},{"$f":"'WK0 - Input data'!P55","v":"Year 10"},"Sum of 10 years",null,"  Change over 10 years"]
[null,null,null,null,null,{"$f":"'WK0 - Input data'!F58","v":"2018-19"},{"$f":"'WK0 - Input data'!G58","v":"2019-20"},{"$f":"'WK0 - Input data'!H58","v":"2020-21"},{"$f":"'WK0 - Input data'!I58","v":"2021-22"},{"$f":"'WK0 - Input data'!J58","v":"2022-23"},{"$f":"'WK0 - Input data'!K58","v":"2023-24"},{"$f":"'WK0 - Input data'!L58","v":"2024-25"},{"$f":"'WK0 - Input data'!M58","v":"2025-26"},{"$f":"'WK0 - Input data'!N58","v":"2026-27"},{"$f":"'WK0 - Input data'!O58","v":"2027-28"},{"$f":"'WK0 - Input data'!P58","v":"2028-29"},null,null,"$","%"]
[null,null,"Income from continuing operations",null,null,{"$f":"'WK6 - Expenditure Program'!$G$26","v":"$ nominal per year"}]
[null,null,"Revenue:"]
[null,null,"Rates & Annual Charges",null,null,27854675,29153993,30663690,32201376,33796285,34972995,36002519,37373517,38474388,39780513,40952971,{"$f":"SUM(G21:P21)","v":353372247},null,{"$f":"P21-F21","v":13098296},{"$f":"IF(F21=0,0,(S21/F21))","v":0.47023689919196687}]
[null,null,"User Charges & Fees",null,null,10843515,10638128,11046659,11452569,11769968,12090518,12480034,12810271,13160038,13519607,13889258,122857050,null,3045743,{"$f":"IF(F22=0,0,(S22/F22))","v":0.28088152227391211}]
[null,null,"Interest & Investment Revenue",null,null,1300000,1430000,1656000,1837000,1988000,2039000,2145000,2170000,2206000,2232000,2233000,19936000,null,933000,0.71769230769230774]
[null,null,"Other Revenues",null,null,4706813,4723116,4817578,4913930,5012208,5112453,5214702,5318996,5425376,5533883,5644561,51716803,null,937748,0.19923204937183611]
[null,null,"Grants & Contributions Op Purposes",null,null,3392042,3517168,3606949,3699256,3798413,3901600,4010685,4123663,4239884,4359442,4482433,39739493,null,1090391,0.32145563056117821]
[null,null,"Grants & Contributions Capital Purposes",null,null,14757088,7530000,7540000,7075920,5617179,5713821,5850830,6038209,5875961,5919120,5962711,63123751,null,-8794377,-0.59594257349417445]
[null,null,"<include additional items here>",null,null,null,null,null,null,null,null,null,null,null,null,null,{"$f":"SUM(G27:P27)","v":0},null,{"$f":"P27-F27","v":0},{"$f":"IF(F27=0,0,(S27/F27))","v":0}]
[null,null,"<include additional items here>",null,null,null,null,null,null,null,null,null,null,null,null,null,0,null,0,0]
[null,null,"Other Income:"]
[null,null,"Net gains from disposal of assets",null,null,null,null,null,null,null,null,null,null,null,null,null,{"$f":"SUM(G30:P30)","v":0},null,{"$f":"P30-F30","v":0},{"$f":"IF(F30=0,0,(S30/F30))","v":0}]
[]
[null,null,"Total Income Continuing Operations",null,null,{"$f":"SUM(F21:F30)","v":62854133},{"$f":"SUM(G21:G30)","v":56992405},59330876,61180051,61982053,63830387,65703770,67834656,69381647,71344565,{"$f":"SUM(P21:P30)","v":73164934},{"$f":"SUM(G32:P32)","v":650745344},null,{"$f":"P32-F32","v":10310801},{"$f":"IF(F32=0,0,(S32/F32))","v":0.16404332552005768}]
[]
[null,null,"Income excluding capital grants and contributions",null,null,{"$f":"F32-F26","v":48097045},49462405,51790876,54104131,56364874,58116566,59852940,61796447,63505686,65425445,67202223,{"$f":"SUM(G34:P34)","v":587621593},null,{"$f":"P34-F34","v":19105178},{"$f":"IF(F34=0,0,(S34/F34))","v":0.39722145092281658}]
[]
[null,null,"Expenses from continuing operations",null,null,{"$f":"$F$19","v":"$ nominal per year"}]
[]
[null,null,"Employee Benefits & On-costs",null,null,19976704,21690552,22181295,22735827,23354223,24028349,24723450,25465153,26229108,27015982,27826461,{"$f":"SUM(G38:P38)","v":245250400},null,{"$f":"P38-F38","v":7849757},{"$f":"IF(F38=0,0,(S38/F38))","v":0.39294555298011125}]
[null,null,"Borrowing Costs (i.e. interest costs)",null,null,330273,331922,307066,280897,259314,238594,223430,217914,208278,206541,219585,{"$f":"SUM(G39:P39)","v":2493541},null,-110688,-0.33514092886793651]
[null,null,"Materials & Contracts",null,null,12626864,11040916,11507405,11555245,11994842,12357046,13077371,13831276,14055277,14507860,14784370,128711608,null,2157506,0.17086633704140633]
[null,null,"Depreciation & Amortisation",null,null,7175000,7335000,7408350,7482434,7557258,7632830,7709159,7786250,7864113,7942754,8022182,76740330,null,847182,0.11807414634146342]
[null,null,"Other Expenses",null,null,9694802,9740252,9985825,10273509,10592089,10826024,11060291,11387572,11645620,11979938,12361274,109852394,null,2666472,0.27504140878792571]
[null,null,"<include additional items here>",null,null,null,null,null,null,null,null,null,null,null,null,null,{"$f":"SUM(G43:P43)","v":0},null,{"$f":"P43-F43","v":0},{"$f":"IF(F43=0,0,(S43/F43))","v":0}]
[null,null,"<include additional items here>",null,null,null,null,null,null,null,null,null,null,null,null,null,0,null,0,0]
[null,null,"Net loss from disposal of assets",null,null,null,null,null,null,null,null,null,null,null,null,null,0,null,0,0]
[]
[null,null,"Total expenses continuing operations",null,null,{"$f":"SUM(F38:F45)","v":49803643},{"$f":"SUM(G38:G45)","v":50138642},51389941,52327912,53757726,55082843,56793701,58688165,60002396,61653075,63213872,563048273,null,13410229,{"$f":"IF(F47=0,0,(S47/F47))","v":0.26926200960841357}]
[]
[null,null,"Operating results",null,null,{"$f":"$F$19","v":"$ nominal per year"}]
[]
[null,null,"Operating result from continuing operations",null,null,{"$f":"F32-F47","v":13050490},6853763,7940935,8852139,8224327,8747544,8910069,9146491,9379251,9691490,9951062,87697071,null,{"$f":"P51-F51","v":-3099428},{"$f":"IF(F51=0,0,(S51/F51))","v":-0.23749514386049872}]
[null,null,"Net operating result before capital grants and contributions",null,null,{"$f":"F34-F47","v":-1706598},-676237,400935,1776219,2607148,3033723,3059239,3108282,3503290,3772370,3988351,24573320,null,{"$f":"P52-F52","v":5694949},{"$f":"IF(F52=0,0,(S52/F52))","v":-3.3370184425388989}]
[]
[null,null,"Increase in rates and annual charges"]
[]
[null,null,"$ Increase in rates and annual charges",null,null,null,{"$f":"G21-F21","v":1299318},1509697,1537686,1594909,1176710,1029524,1370998,1100871,1306125,1172458,{"$f":"SUM(G56:P56)","v":13098296}]
[null,null,"% Increase in rates and annual charges",null,null,null,{"$f":"IF(F21=0,0,G21/F21-1)","v":4.6646317000647031E-2},{"$f":"IF(G21=0,0,H21/G21-1)","v":5.1783541280262968E-2},5.0146802292874826E-2,4.9529218875615788E-2,3.4817732185652872E-2,2.9437684705013067E-2,3.8080613192648993E-2,2.9455911253950307E-2,3.3947908411174677E-2,2.9473174466100982E-2,{"$f":"IF(F21=0,0,P21/F21-1)","v":0.47023689919196698}]
[]
[]
[]
[null,null,"SCENARIO 2: Base case -  no SV income or expenditure"]
[null,null,null,null,null,{"$f":"F$17","v":"Year 0"},"Year 1","Year 2","Year 3","Year 4","Year 5","Year 6","Year 7","Year 8","Year 9","Year 10","Sum of 10 years",0,"  Change over 10 years"]
[null,null,null,null,null,{"$f":"F$18","v":"2018-19"},"2019-20","2020-21","2021-22","2022-23","2023-24","2024-25","2025-26","2026-27","2027-28","2028-29",null,{"$f":"R$18","v":0},{"$f":"S$18","v":"$"},{"$f":"T$18","v":"%"}]
[null,null,{"$f":"C$19","v":"Income from continuing operations"}]
[null,null,{"$f":"C$20","v":"Revenue:"}]
[null,null,{"$f":"C$21","v":"Rates & Annual Charges"},null,null,27854675,28700979,29726427,30746476,31788567,32915084,33893161,35211425,36258243,37508965,38624634,{"$f":"SUM(G66:P66)","v":335373961},null,{"$f":"P66-F66","v":10769959},{"$f":"IF(F66=0,0,(S66/F66))","v":0.38664816588238776}]
[null,null,{"$f":"C$22","v":"User Charges & Fees"},null,null,10843515,10638128,11046659,11452569,11769968,12090518,12480034,12810271,13160038,13519607,13889258,122857050,null,3045743,{"$f":"IF(F67=0,0,(S67/F67))","v":0.28088152227391211}]
[null,null,{"$f":"C$23","v":"Interest & Investment Revenue"},null,null,1300000,1430000,1656000,1837000,1988000,2039000,2145000,2170000,2206000,2232000,2233000,19936000,null,933000,0.71769230769230774]
[null,null,{"$f":"C$24","v":"Other Revenues"},null,null,4706813,4723116,4817578,4913930,5012208,5112453,5214702,5318996,5425376,5533883,5644561,51716803,null,937748,0.19923204937183611]
[null,null,{"$f":"C$25","v":"Grants & Contributions Op Purposes"},null,null,3392042,3517168,3606949,3699256,3798413,3901600,4010685,4123663,4239884,4359442,4482433,39739493,null,1090391,0.32145563056117821]
[null,null,{"$f":"C$26","v":"Grants & Contributions Capital Purposes"},null,null,14757088,7530000,7540000,7075920,5617179,5713821,5850830,6038209,5875961,5919120,5962711,63123751,null,-8794377,-0.59594257349417445]
[null,null,{"$f":"C$27","v":"<include additional items here>"},null,null,null,null,null,null,null,null,null,null,null,null,null,{"$f":"SUM(G72:P72)","v":0},null,{"$f":"P72-F72","v":0},{"$f":"IF(F72=0,0,(S72/F72))","v":0}]
[null,null,{"$f":"C$28","v":"<include additional items here>"},null,null,null,null,null,null,null,null,null,null,null,null,null,0,null,0,0]
[null,null,{"$f":"C$29","v":"Other Income:"}]
[null,null,{"$f":"C$30","v":"Net gains from disposal of assets"},null,null,null,null,null,null,null,null,null,null,null,null,null,{"$f":"SUM(G75:P75)","v":0},null,{"$f":"P75-F75","v":0},{"$f":"IF(F75=0,0,(S75/F75))","v":0}]
[]
[null,null,{"$f":"C$32","v":"Total Income Continuing Operations"},null,null,{"$f":"SUM(F66:F75)","v":62854133},{"$f":"SUM(G66:G75)","v":56539391},58393613,59725151,59974335,61772476,63594412,65672564,67165502,69073017,70836597,{"$f":"SUM(G77:P77)","v":632747058},null,{"$f":"P77-F77","v":7982464},{"$f":"IF(F77=0,0,(S77/F77))","v":0.12699982672579382}]
[]
[null,null,{"$f":"C$34","v":"Income excluding capital grants and contributions"},null,null,{"$f":"F77-F71","v":48097045},49009391,50853613,52649231,54357156,56058655,57743582,59634355,61289541,63153897,64873886,{"$f":"SUM(G79:P79)","v":569623307},null,{"$f":"P79-F79","v":16776841},{"$f":"IF(F79=0,0,(S79/F79))","v":0.34881230229424698}]
[]
[null,null,{"$f":"C$36","v":"Expenses from continuing operations"}]
[]
[null,null,{"$f":"C$38","v":"Employee Benefits & On-costs"},null,null,19976704,21690552,22181295,22735827,23354223,24028349,24723450,25465153,26229108,27015982,27826461,{"$f":"SUM(G83:P83)","v":245250400},null,{"$f":"P83-F83","v":7849757},{"$f":"IF(F83=0,0,(S83/F83))","v":0.39294555298011125}]
[null,null,{"$f":"C$39","v":"Borrowing Costs (i.e. interest costs)"},null,null,330273,331922,307066,280897,259314,238594,223430,217914,208278,206541,219585,{"$f":"SUM(G84:P84)","v":2493541},null,-110688,-0.33514092886793651]
[null,null,{"$f":"C$40","v":"Materials & Contracts"},null,null,12626864,11040916,11507405,11555245,11994842,12357046,13077371,13831276,14055277,14507860,14784370,128711608,null,2157506,0.17086633704140633]
[null,null,{"$f":"C$41","v":"Depreciation & Amortisation"},null,null,7175000,7335000,7408350,7482434,7557258,7632830,7709159,7786250,7864113,7942754,8022182,76740330,null,847182,0.11807414634146342]
[null,null,{"$f":"C$42","v":"Other Expenses"},null,null,9694802,9740252,9985825,10273509,10592089,10826024,11060291,11387572,11645620,11979938,12361274,109852394,null,2666472,0.27504140878792571]
[null,null,{"$f":"C$43","v":"<include additional items here>"},null,null,null,null,null,null,null,null,null,null,null,null,null,{"$f":"SUM(G88:P88)","v":0},null,{"$f":"P88-F88","v":0},{"$f":"IF(F88=0,0,(S88/F88))","v":0}]
[null,null,{"$f":"C$44","v":"<include additional items here>"},null,null,null,null,null,null,null,null,null,null,null,null,null,0,null,0,0]
[null,null,{"$f":"C$45","v":"Net loss from disposal of assets"},null,null,null,null,null,null,null,null,null,null,null,null,null,0,null,0,0]
[]
[null,null,{"$f":"C$47","v":"Total expenses continuing operations"},null,null,{"$f":"SUM(F82:F90)","v":49803643},50138642,51389941,52327912,53757726,55082843,56793701,58688165,60002396,61653075,63213872,563048273,null,{"$f":"P92-F92","v":13410229},{"$f":"IF(F92=0,0,(S92/F92))","v":0.26926200960841357}]
[]
[null,null,{"$f":"C$49","v":"Operating results"}]
[]
[null,null,{"$f":"C$51","v":"Operating result from continuing operations"},null,null,{"$f":"F77-F92","v":13050490},6400749,7003672,7397239,6216609,6689633,6800711,6984399,7163106,7419942,7622725,69698785,null,{"$f":"P96-F96","v":-5427765},{"$f":"IF(F96=0,0,(S96/F96))","v":-0.41590507329609844}]
[null,null,{"$f":"C$52","v":"Net operating result before capital grants and contributions"},null,null,{"$f":"F79-F92","v":-1706598},-1129251,-536328,321319,599430,975812,{"$f":"L79-L92","v":949881},946190,1287145,1500822,1660014,6575034,null,{"$f":"P97-F97","v":3366612},{"$f":"IF(F97=0,0,(S97/F97))","v":-1.9727035892459737}]
[]
[null,null,{"$f":"C$54","v":"Increase in rates and annual charges"}]
[]
[null,null,{"$f":"C$56","v":"$ Increase in rates and annual charges"},null,null,null,{"$f":"G66-F66","v":846304},1025448,1020049,1042091,1126517,978077,1318264,1046818,1250722,1115669,{"$f":"P66-F66","v":10769959}]
[null,null,{"$f":"C$57","v":"% Increase in rates and annual charges"},null,null,null,{"$f":"IF(F66=0,0,G66/F66-1)","v":3.038283519732321E-2},{"$f":"IF(G66=0,0,H66/G66-1)","v":3.5728676711689777E-2},3.4314551156787276E-2,3.389302240686054E-2,3.5437803786499744E-2,2.9715160380572092E-2,3.889469028869863E-2,2.972949830914251E-2,3.4494831975173224E-2,2.9744062519453607E-2,{"$f":"IF(F66=0,0,P66/F66-1)","v":0.38664816588238771}]
[]
[]
[]
[null,null,"SCENARIO 3: Hybrid case  - SV expenditure but no SV income "]
[null,null,null,null,null,{"$f":"F$17","v":"Year 0"},{"$f":"G$17","v":"Year 1"},"Year 2","Year 3","Year 4","Year 5","Year 6","Year 7","Year 8","Year 9","Year 10","Sum of 10 years",0,"  Change over 10 years"]
[null,null,null,null,null,{"$f":"F$18","v":"2018-19"},{"$f":"G$18","v":"2019-20"},"2020-21","2021-22","2022-23","2023-24","2024-25","2025-26","2026-27","2027-28","2028-29",null,0,"$","%"]
[null,null,{"$f":"C$19","v":"Income from continuing operations"}]
[null,null,{"$f":"C$20","v":"Revenue:"}]
[null,null,{"$f":"C$21","v":"Rates & Annual Charges"},null,null,{"$f":"F66","v":27854675},{"$f":"G66","v":28700979},29726427,30746476,31788567,32915084,33893161,35211425,36258243,37508965,38624634,{"$f":"SUM(G111:P111)","v":335373961},null,{"$f":"P111-F111","v":10769959},{"$f":"IF(F111=0,0,(S111/F111))","v":0.38664816588238776}]
[null,null,{"$f":"C$22","v":"User Charges & Fees"},null,null,10843515,{"$f":"G67","v":10638128},11046659,11452569,11769968,12090518,12480034,12810271,13160038,13519607,13889258,122857050,null,3045743,{"$f":"IF(F112=0,0,(S112/F112))","v":0.28088152227391211}]
[null,null,{"$f":"C$23","v":"Interest & Investment Revenue"},null,null,1300000,{"$f":"G68","v":1430000},1656000,1837000,1988000,2039000,2145000,2170000,2206000,2232000,2233000,19936000,null,933000,0.71769230769230774]
[null,null,{"$f":"C$24","v":"Other Revenues"},null,null,4706813,{"$f":"G69","v":4723116},4817578,4913930,5012208,5112453,5214702,5318996,5425376,5533883,5644561,51716803,null,937748,0.19923204937183611]
[null,null,{"$f":"C$25","v":"Grants & Contributions Op Purposes"},null,null,3392042,{"$f":"G70","v":3517168},3606949,3699256,3798413,3901600,4010685,4123663,4239884,4359442,4482433,39739493,null,1090391,0.32145563056117821]
[null,null,{"$f":"C$26","v":"Grants & Contributions Capital Purposes"},null,null,14757088,{"$f":"G71","v":7530000},7540000,7075920,5617179,5713821,5850830,6038209,5875961,5919120,5962711,63123751,null,-8794377,-0.59594257349417445]
[null,null,{"$f":"C$27","v":"<include additional items here>"},null,null,0,0,0,0,0,0,0,0,0,0,0,{"$f":"SUM(G117:P117)","v":0},null,{"$f":"P117-F117","v":0},{"$f":"IF(F117=0,0,(S117/F117))","v":0}]
[null,null,{"$f":"C$28","v":"<include additional items here>"},null,null,0,0,0,0,0,0,0,0,0,0,0,0,null,0,0]
[null,null,{"$f":"C$29","v":"Other Income:"}]
[null,null,{"$f":"C$30","v":"Net gains from disposal of assets"},null,null,{"$f":"F75","v":0},0,0,0,0,0,0,0,0,0,0,{"$f":"SUM(G120:P120)","v":0},null,{"$f":"P120-F120","v":0},{"$f":"IF(F120=0,0,(S120/F120))","v":0}]
[]
[null,null,{"$f":"C$32","v":"Total Income Continuing Operations"},null,null,{"$f":"SUM(F111:F120)","v":62854133},{"$f":"SUM(G111:G120)","v":56539391},{"$f":"SUM(H111:H120)","v":58393613},59725151,59974335,61772476,63594412,65672564,67165502,69073017,70836597,632747058,null,{"$f":"P122-F122","v":7982464},{"$f":"IF(F122=0,0,(S122/F122))","v":0.12699982672579382}]
[]
[null,null,{"$f":"C$34","v":"Income excluding capital grants and contributions"},null,null,{"$f":"F122-F116","v":48097045},49009391,50853613,52649231,54357156,56058655,57743582,59634355,61289541,63153897,64873886,{"$f":"SUM(G124:P124)","v":569623307},null,{"$f":"P124-F124","v":16776841},{"$f":"IF(F124=0,0,(S124/F124))","v":0.34881230229424698}]
[]
[null,null,{"$f":"C$36","v":"Expenses from continuing operations"}]
[]
[null,null,{"$f":"C$38","v":"Employee Benefits & On-costs"},null,null,{"$f":"F38","v":19976704},{"$f":"G38","v":21690552},22181295,22735827,23354223,24028349,24723450,25465153,26229108,27015982,27826461,{"$f":"SUM(G128:P128)","v":245250400},null,{"$f":"P128-F128","v":7849757},{"$f":"IF(F128=0,0,(S128/F128))","v":0.39294555298011125}]
[null,null,{"$f":"C$39","v":"Borrowing Costs (i.e. interest costs)"},null,null,{"$f":"F39","v":330273},{"$f":"G39","v":331922},307066,280897,259314,238594,223430,217914,208278,206541,219585,{"$f":"SUM(G129:P129)","v":2493541},null,-110688,-0.33514092886793651]
[null,null,{"$f":"C$40","v":"Materials & Contracts"},null,null,{"$f":"F40","v":12626864},{"$f":"G40","v":11040916},11507405,11555245,11994842,12357046,13077371,13831276,14055277,14507860,14784370,128711608,null,2157506,0.17086633704140633]
[null,null,{"$f":"C$41","v":"Depreciation & Amortisation"},null,null,{"$f":"F41","v":7175000},{"$f":"G41","v":7335000},7408350,7482434,7557258,7632830,7709159,7786250,7864113,7942754,8022182,76740330,null,847182,0.11807414634146342]
[null,null,{"$f":"C$42","v":"Other Expenses"},null,null,{"$f":"F42","v":9694802},{"$f":"G42","v":9740252},9985825,10273509,10592089,10826024,11060291,11387572,11645620,11979938,12361274,109852394,null,2666472,0.27504140878792571]
[null,null,{"$f":"C$43","v":"<include additional items here>"},null,null,{"$f":"F43","v":0},0,0,0,0,0,0,0,0,0,0,{"$f":"SUM(G133:P133)","v":0},null,{"$f":"P133-F133","v":0},{"$f":"IF(F133=0,0,(S133/F133))","v":0}]
[null,null,{"$f":"C$44","v":"<include additional items here>"},null,null,{"$f":"F44","v":0},0,0,0,0,0,0,0,0,0,0,0,null,0,0]
[null,null,{"$f":"C$45","v":"Net loss from disposal of assets"},null,null,{"$f":"F45","v":0},0,0,0,0,0,0,0,0,0,0,0,null,0,0]
[]
[null,null,{"$f":"C$47","v":"Total expenses continuing operations"},null,null,{"$f":"SUM(F127:F135)","v":49803643},50138642,51389941,52327912,53757726,55082843,56793701,58688165,60002396,61653075,63213872,563048273,null,{"$f":"P137-F137","v":13410229},{"$f":"IF(F137=0,0,(S137/F137))","v":0.26926200960841357}]
[]
[null,null,{"$f":"C$49","v":"Operating results"}]
[]
[null,null,{"$f":"C$51","v":"Operating result from continuing operations"},null,null,{"$f":"F122-F137","v":13050490},6400749,7003672,7397239,6216609,6689633,6800711,6984399,7163106,7419942,7622725,69698785,null,{"$f":"P141-F141","v":-5427765},{"$f":"IF(F141=0,0,(S141/F141))","v":-0.41590507329609844}]
[null,null,{"$f":"C$52","v":"Net operating result before capital grants and contributions"},null,null,{"$f":"F124-F137","v":-1706598},-1129251,-536328,321319,599430,975812,949881,946190,1287145,1500822,1660014,6575034,null,{"$f":"P142-F142","v":3366612},{"$f":"IF(F142=0,0,(S142/F142))","v":-1.9727035892459737}]
[]
[null,null,{"$f":"C$54","v":"Increase in rates and annual charges"}]
[]
[null,null,{"$f":"C$56","v":"$ Increase in rates and annual charges"},null,null,null,{"$f":"G111-F111","v":846304},1025448,1020049,1042091,1126517,978077,1318264,1046818,1250722,1115669,{"$f":"P111-F111","v":10769959}]
[null,null,{"$f":"C$57","v":"% Increase in rates and annual charges"},null,null,null,{"$f":"IF(F111=0,0,G111/F111-1)","v":3.038283519732321E-2},{"$f":"IF(G111=0,0,H111/G111-1)","v":3.5728676711689777E-2},3.4314551156787276E-2,3.389302240686054E-2,3.5437803786499744E-2,2.9715160380572092E-2,3.889469028869863E-2,2.972949830914251E-2,3.4494831975173224E-2,2.9744062519453607E-2,{"$f":"IF(F111=0,0,P111/F111-1)","v":0.38664816588238771}]
[]
[]
[]
[null,null,"Difference between Scenario 1 (with proposed SV income and expenditure) and Scenario 2 (base case - no SV income or expenditure)"]
[null,null,null,null,null,{"$f":"F$17","v":"Year 0"},"Year 1","Year 2","Year 3","Year 4","Year 5","Year 6","Year 7","Year 8","Year 9","Year 10","Sum of 10 years"]
[null,null,null,null,null,{"$f":"F$18","v":"2018-19"},"2019-20","2020-21","2021-22","2022-23","2023-24","2024-25","2025-26","2026-27","2027-28","2028-29"]
[null,null,{"$f":"C$19","v":"Income from continuing operations"}]
[null,null,{"$f":"C$20","v":"Revenue:"}]
[null,null,{"$f":"C$21","v":"Rates & Annual Charges"},null,null,{"$f":"F21-F66","v":0},453014,937263,1454900,2007718,2057911,2109358,2162092,2216145,2271548,2328337,17998286]
[null,null,{"$f":"C$22","v":"User Charges & Fees"},null,null,{"$f":"F22-F67","v":0},0,0,0,0,0,0,0,0,0,0,0]
[null,null,{"$f":"C$23","v":"Interest & Investment Revenue"},null,null,{"$f":"F23-F68","v":0},0,0,0,0,0,0,0,0,0,0,0]
[null,null,{"$f":"C$24","v":"Other Revenues"},null,null,{"$f":"F24-F69","v":0},0,0,0,0,0,0,0,0,0,0,0]
[null,null,{"$f":"C$25","v":"Grants & Contributions Op Purposes"},null,null,{"$f":"F25-F70","v":0},0,0,0,0,0,0,0,0,0,0,0]
[null,null,{"$f":"C$26","v":"Grants & Contributions Capital Purposes"},null,null,{"$f":"F26-F71","v":0},0,0,0,0,0,0,0,0,0,0,0]
[null,null,{"$f":"C$27","v":"<include additional items here>"},null,null,{"$f":"F27-F72","v":0},0,0,0,0,0,0,0,0,0,0,0]
[null,null,{"$f":"C$28","v":"<include additional items here>"},null,null,{"$f":"F28-F73","v":0},0,0,0,0,0,0,0,0,0,0,0]
[null,null,{"$f":"C$29","v":"Other Income:"}]
[null,null,{"$f":"C$30","v":"Net gains from disposal of assets"},null,null,{"$f":"F30-F75","v":0},0,0,0,0,0,0,0,0,0,0,0]
[]
[null,null,{"$f":"C$32","v":"Total Income Continuing Operations"},null,null,{"$f":"F32-F77","v":0},453014,937263,1454900,2007718,2057911,2109358,2162092,2216145,2271548,2328337,17998286]
[]
[null,null,{"$f":"C$34","v":"Income excluding capital grants and contributions"},null,null,{"$f":"F34-F79","v":0},453014,937263,1454900,2007718,2057911,2109358,2162092,2216145,2271548,2328337,17998286]
[]
[null,null,{"$f":"C$36","v":"Expenses from continuing operations"}]
[]
[null,null,{"$f":"C$38","v":"Employee Benefits & On-costs"},null,null,{"$f":"F38-F83","v":0},0,0,0,0,0,0,0,0,0,0,0]
[null,null,{"$f":"C$39","v":"Borrowing Costs (i.e. interest costs)"},null,null,{"$f":"F39-F84","v":0},0,0,0,0,0,0,0,0,0,0,0]
[null,null,{"$f":"C$40","v":"Materials & Contracts"},null,null,{"$f":"F40-F85","v":0},0,0,0,0,0,0,0,0,0,0,0]
[null,null,{"$f":"C$41","v":"Depreciation & Amortisation"},null,null,{"$f":"F41-F86","v":0},0,0,0,0,0,0,0,0,0,0,0]
[null,null,{"$f":"C$42","v":"Other Expenses"},null,null,{"$f":"F42-F87","v":0},0,0,0,0,0,0,0,0,0,0,0]
[null,null,{"$f":"C$43","v":"<include additional items here>"},null,null,{"$f":"F43-F88","v":0},0,0,0,0,0,0,0,0,0,0,0]
[null,null,{"$f":"C$44","v":"<include additional items here>"},null,null,{"$f":"F44-F89","v":0},0,0,0,0,0,0,0,0,0,0,0]
[null,null,{"$f":"C$45","v":"Net loss from disposal of assets"},null,null,{"$f":"F45-F90","v":0},0,0,0,0,0,0,0,0,0,0,0]
[]
[null,null,{"$f":"C$47","v":"Total expenses continuing operations"},null,null,{"$f":"F47-F92","v":0},0,0,0,0,0,0,0,0,0,0,0]
[]
[null,null,{"$f":"C$49","v":"Operating results"}]
[]
[null,null,{"$f":"C$51","v":"Operating result from continuing operations"},null,null,{"$f":"F51-F96","v":0},453014,937263,1454900,2007718,2057911,2109358,2162092,2216145,2271548,2328337,17998286]
[null,null,{"$f":"C$52","v":"Net operating result before capital grants and contributions"},null,null,{"$f":"F52-F97","v":0},453014,937263,1454900,2007718,2057911,2109358,2162092,2216145,2271548,2328337,17998286]
[]
[null,null,{"$f":"C$54","v":"Increase in rates and annual charges"}]
[]
[null,null,{"$f":"C$56","v":"$ Increase in rates and annual charges"},null,null,null,{"$f":"G56-G101","v":453014},484249,517637,552818,50193,51447,52734,54053,55403,56789,2328337]
[null,null,{"$f":"C$57","v":"% Increase in rates and annual charges"},null,null,null,{"$f":"G57-G102","v":1.626348180332382E-2},1.6054864568573191E-2,1.583225113608755E-2,1.5636196468755248E-2,-6.2007160084687207E-4,-2.7747567555902464E-4,-8.1407709604963685E-4,-2.7358705519220372E-4,-5.4692356399854702E-4,-2.7088805335262478E-4,8.3588733309579277E-2]
[]
[]
[]
[null,null,"Key assumptions",null,null,"(please enter assumed % figure for each year)"]
[null,null,null,null,null,null,{"$f":"G$17","v":"Year 1"},"Year 2","Year 3","Year 4","Year 5","Year 6","Year 7","Year 8","Year 9","Year 10"]
[null,null,null,null,null,null,{"$f":"G$18","v":"2019-20"},"2020-21","2021-22","2022-23","2023-24","2024-25","2025-26","2026-27","2027-28","2028-29"]
[]
[null,null,"Growth in labour costs"]
[null,null,"Scenario 1: Proposed (with SV)","% pa",null,null,{"$f":"IF(G38=0,\".\",(G38/F38)-1)","v":8.5792330907040526E-2},{"$f":"IF(H38=0,\".\",(H38/G38)-1)","v":2.2624735414755737E-2},2.4999983093863642E-2,2.7199186552571808E-2,2.8865272032385647E-2,2.8928371233496009E-2,2.9999979776285324E-2,3.0000016100433458E-2,3.0000028975442072E-2,2.9999982973041739E-2]
[null,null,"Scenario 2 - Base case (no SV)",{"$f":"D201","v":"% pa"},null,null,{"$f":"IF(G83=0,\".\",(G83/F83)-1)","v":8.5792330907040526E-2},{"$f":"IF(H83=0,\".\",(H83/G83)-1)","v":2.2624735414755737E-2},2.4999983093863642E-2,2.7199186552571808E-2,2.8865272032385647E-2,2.8928371233496009E-2,2.9999979776285324E-2,3.0000016100433458E-2,3.0000028975442072E-2,2.9999982973041739E-2]
[null,null,"Growth in employee numbers"]
[null,null,{"$f":"$C$201","v":"Scenario 1: Proposed (with SV)"},{"$f":"D$201","v":"% pa"},null,null,0.03,0,0,0,0,0,0,0,0,0]
[null,null,{"$f":"$C$202","v":"Scenario 2 - Base case (no SV)"},{"$f":"D202","v":"% pa"},null,null,0.03,0,0,0,0,0,0,0,0,0]
[null,null,"Growth in assessment numbers"]
[null,null,{"$f":"$C$201","v":"Scenario 1: Proposed (with SV)"},{"$f":"D$201","v":"% pa"},null,null,0,1.4500000000000001E-2,1.61E-2,1.06E-2,7.0000000000000001E-3,0,1.3899999999999999E-2,0,6.8999999999999999E-3,0]
[null,null,{"$f":"$C$202","v":"Scenario 2 - Base case (no SV)"},{"$f":"D205","v":"% pa"},null,null,0,1.4500000000000001E-2,1.61E-2,1.06E-2,7.0000000000000001E-3,0,1.3899999999999999E-2,0,6.8999999999999999E-3,0]
[null,null,"Inflation rate applied to Materials & Contracts"]
[null,null,{"$f":"$C$201","v":"Scenario 1: Proposed (with SV)"},{"$f":"D$201","v":"% pa"},null,null,0.02,0.02,0.02,0.02,0.02,0.02,0.02,0.02,0.02,0.02]
[null,null,{"$f":"$C$202","v":"Scenario 2 - Base case (no SV)"},{"$f":"D208","v":"% pa"},null,null,0.02,0.02,0.02,0.02,0.02,0.02,0.02,0.02,0.02,0.02]
[null,null,"Planned operating cost savings"]
[null,null,{"$f":"$C$201","v":"Scenario 1: Proposed (with SV)"},{"$f":"D$201","v":"% pa"},null,null,0,0,0,0,0,0,0,0,0,0]
[null,null,{"$f":"$C$202","v":"Scenario 2 - Base case (no SV)"},{"$f":"D211","v":"% pa"},null,null,0,0,0,0,0,0,0,0,0,0]

{"sheet":"WK9 - Ratios","index":14,"n_rows":59,"n_cols":20,"rows_kept":59,"cut":false,"hidden":false,"merged":[]}
[]
[]
[null,null,{"$f":"'WK2 - Notional General Income'!$C$3","v":"Burwood Council"}]
[]
[null,null,null,null,null,"WORKSHEET 9"]
[]
[null,null,null,null,null,"FINANCIAL RATIOS"]
[]
[null,null,null,null,null,"This worksheet captures financial ratios for three historical years as well as the current and forecast years (0 to 10)"]
[null,null,null,null,null,"The historical ratios are calculated from information provided in Worksheet 7 and two of the forecast ratios are calculated from information entered in Worksheet 8."]
[null,null,null,null,null,"Please enter the forecast financial ratios in the blue input cells"]
[null,null,null,null,null,{"$f":"\"Enter the two compusory ratios (\"&C33&\" and \"&C39&\")\"","v":"Enter the two compusory ratios (Infrastructure Renewals Ratio and Infrastructure Backlog Ratio)"}]
[null,null,null,null,null,"Enter the two optional ratios (Asset Maintenance Ratio and Debt Service Ratio) only if they are relevant to your Council's application, otherwise leave blank. "]
[]
[null,null,null,null,null,null,null,"Historical ratios",null,null,null,null,null,"Forecast ratios"]
[null,null,null,null,null,null,null,null,null,{"$f":"'WK0 - Input data'!F55","v":"Year 0"},{"$f":"'WK0 - Input data'!G55","v":"Year 1"},{"$f":"'WK0 - Input data'!H55","v":"Year 2"},{"$f":"'WK0 - Input data'!I55","v":"Year 3"},{"$f":"'WK0 - Input data'!J55","v":"Year 4"},{"$f":"'WK0 - Input data'!K55","v":"Year 5"},{"$f":"'WK0 - Input data'!L55","v":"Year 6"},{"$f":"'WK0 - Input data'!M55","v":"Year 7"},{"$f":"'WK0 - Input data'!N55","v":"Year 8"},{"$f":"'WK0 - Input data'!O55","v":"Year 9"},{"$f":"'WK0 - Input data'!P55","v":"Year 10"}]
[null,null,null,null,null,null,{"$f":"'WK0 - Input data'!C58","v":"2015-16"},{"$f":"'WK0 - Input data'!D58","v":"2016-17"},{"$f":"'WK0 - Input data'!E58","v":"2017-18"},{"$f":"'WK0 - Input data'!F58","v":"2018-19"},{"$f":"'WK0 - Input data'!G58","v":"2019-20"},{"$f":"'WK0 - Input data'!H58","v":"2020-21"},{"$f":"'WK0 - Input data'!I58","v":"2021-22"},{"$f":"'WK0 - Input data'!J58","v":"2022-23"},{"$f":"'WK0 - Input data'!K58","v":"2023-24"},{"$f":"'WK0 - Input data'!L58","v":"2024-25"},{"$f":"'WK0 - Input data'!M58","v":"2025-26"},{"$f":"'WK0 - Input data'!N58","v":"2026-27"},{"$f":"'WK0 - Input data'!O58","v":"2027-28"},{"$f":"'WK0 - Input data'!P58","v":"2028-29"}]
[null,null,"Criteria and measure","Definition",null,"Scenario"]
[null,null,"1. Sustainability"]
[]
[null,null,"Operating Performance Ratio","Net continuing operating result"]
[null,null,null,"(excl capital grants and contributions)",null,"Scenario 1: Proposed (with SV)",{"$f":"'WK7 - Historical financials'!G45","v":-1.0755453716476888E-3},{"$f":"'WK7 - Historical financials'!H45","v":5.8970780443499259E-2},{"$f":"'WK7 - Historical financials'!I45","v":7.5729386027682935E-2},{"$f":"IF('WK8 - Long Term Financial Plan'!F34-'WK8 - Long Term Financial Plan'!F30=0,0,('WK8 - Long Term Financial Plan'!F52-'WK8 - Long Term Financial Plan'!F30+'WK8 - Long Term Financial Plan'!F45)/('WK8 - Long Term Financial Plan'!F34-'WK8 - Long Term Financial Plan'!F30))","v":-3.5482387743363444E-2},{"$f":"IF('WK8 - Long Term Financial Plan'!G34-'WK8 - Long Term Financial Plan'!G30=0,0,('WK8 - Long Term Financial Plan'!G52-'WK8 - Long Term Financial Plan'!G30+'WK8 - Long Term Financial Plan'!G45)/('WK8 - Long Term Financial Plan'!G34-'WK8 - Long Term Financial Plan'!G30))","v":-1.3671737150670292E-2},{"$f":"IF('WK8 - Long Term Financial Plan'!H34-'WK8 - Long Term Financial Plan'!H30=0,0,('WK8 - Long Term Financial Plan'!H52-'WK8 - Long Term Financial Plan'!H30+'WK8 - Long Term Financial Plan'!H45)/('WK8 - Long Term Financial Plan'!H34-'WK8 - Long Term Financial Plan'!H30))","v":7.7414214812663142E-3},{"$f":"IF('WK8 - Long Term Financial Plan'!I34-'WK8 - Long Term Financial Plan'!I30=0,0,('WK8 - Long Term Financial Plan'!I52-'WK8 - Long Term Financial Plan'!I30+'WK8 - Long Term Financial Plan'!I45)/('WK8 - Long Term Financial Plan'!I34-'WK8 - Long Term Financial Plan'!I30))","v":3.2829637352460202E-2},{"$f":"IF('WK8 - Long Term Financial Plan'!J34-'WK8 - Long Term Financial Plan'!J30=0,0,('WK8 - Long Term Financial Plan'!J52-'WK8 - Long Term Financial Plan'!J30+'WK8 - Long Term Financial Plan'!J45)/('WK8 - Long Term Financial Plan'!J34-'WK8 - Long Term Financial Plan'!J30))","v":4.6254835946231337E-2},{"$f":"IF('WK8 - Long Term Financial Plan'!K34-'WK8 - Long Term Financial Plan'!K30=0,0,('WK8 - Long Term Financial Plan'!K52-'WK8 - Long Term Financial Plan'!K30+'WK8 - Long Term Financial Plan'!K45)/('WK8 - Long Term Financial Plan'!K34-'WK8 - Long Term Financial Plan'!K30))","v":5.2200658242608486E-2},{"$f":"IF('WK8 - Long Term Financial Plan'!L34-'WK8 - Long Term Financial Plan'!L30=0,0,('WK8 - Long Term Financial Plan'!L52-'WK8 - Long Term Financial Plan'!L30+'WK8 - Long Term Financial Plan'!L45)/('WK8 - Long Term Financial Plan'!L34-'WK8 - Long Term Financial Plan'!L30))","v":5.1112593633662773E-2},{"$f":"IF('WK8 - Long Term Financial Plan'!M34-'WK8 - Long Term Financial Plan'!M30=0,0,('WK8 - Long Term Financial Plan'!M52-'WK8 - Long Term Financial Plan'!M30+'WK8 - Long Term Financial Plan'!M45)/('WK8 - Long Term Financial Plan'!M34-'WK8 - Long Term Financial Plan'!M30))","v":5.0298717011999089E-2},{"$f":"IF('WK8 - Long Term Financial Plan'!N34-'WK8 - Long Term Financial Plan'!N30=0,0,('WK8 - Long Term Financial Plan'!N52-'WK8 - Long Term Financial Plan'!N30+'WK8 - Long Term Financial Plan'!N45)/('WK8 - Long Term Financial Plan'!N34-'WK8 - Long Term Financial Plan'!N30))","v":5.5164981604954241E-2},{"$f":"IF('WK8 - Long Term Financial Plan'!O34-'WK8 - Long Term Financial Plan'!O30=0,0,('WK8 - Long Term Financial Plan'!O52-'WK8 - Long Term Financial Plan'!O30+'WK8 - Long Term Financial Plan'!O45)/('WK8 - Long Term Financial Plan'!O34-'WK8 - Long Term Financial Plan'!O30))","v":5.7659065215376067E-2},{"$f":"IF('WK8 - Long Term Financial Plan'!P34-'WK8 - Long Term Financial Plan'!P30=0,0,('WK8 - Long Term Financial Plan'!P52-'WK8 - Long Term Financial Plan'!P30+'WK8 - Long Term Financial Plan'!P45)/('WK8 - Long Term Financial Plan'!P34-'WK8 - Long Term Financial Plan'!P30))","v":5.9348498040012757E-2}]
[null,null,null,"Total continuing operating revenue",null,"Scenario 2 - Base case (no SV)",{"$f":"G22","v":-1.0755453716476888E-3},{"$f":"H22","v":5.8970780443499259E-2},{"$f":"I22","v":7.5729386027682935E-2},{"$f":"IF('WK8 - Long Term Financial Plan'!F79-'WK8 - Long Term Financial Plan'!F75=0,0,('WK8 - Long Term Financial Plan'!F97-'WK8 - Long Term Financial Plan'!F75+'WK8 - Long Term Financial Plan'!F90)/('WK8 - Long Term Financial Plan'!F79-'WK8 - Long Term Financial Plan'!F75))","v":-3.5482387743363444E-2},{"$f":"IF('WK8 - Long Term Financial Plan'!G79-'WK8 - Long Term Financial Plan'!G75=0,0,('WK8 - Long Term Financial Plan'!G97-'WK8 - Long Term Financial Plan'!G75+'WK8 - Long Term Financial Plan'!G90)/('WK8 - Long Term Financial Plan'!G79-'WK8 - Long Term Financial Plan'!G75))","v":-2.304152279713086E-2},{"$f":"IF('WK8 - Long Term Financial Plan'!H79-'WK8 - Long Term Financial Plan'!H75=0,0,('WK8 - Long Term Financial Plan'!H97-'WK8 - Long Term Financial Plan'!H75+'WK8 - Long Term Financial Plan'!H90)/('WK8 - Long Term Financial Plan'!H79-'WK8 - Long Term Financial Plan'!H75))","v":-1.0546507285529545E-2},{"$f":"IF('WK8 - Long Term Financial Plan'!I79-'WK8 - Long Term Financial Plan'!I75=0,0,('WK8 - Long Term Financial Plan'!I97-'WK8 - Long Term Financial Plan'!I75+'WK8 - Long Term Financial Plan'!I90)/('WK8 - Long Term Financial Plan'!I79-'WK8 - Long Term Financial Plan'!I75))","v":6.1030141161985824E-3},{"$f":"IF('WK8 - Long Term Financial Plan'!J79-'WK8 - Long Term Financial Plan'!J75=0,0,('WK8 - Long Term Financial Plan'!J97-'WK8 - Long Term Financial Plan'!J75+'WK8 - Long Term Financial Plan'!J90)/('WK8 - Long Term Financial Plan'!J79-'WK8 - Long Term Financial Plan'!J75))","v":1.1027618884255092E-2},{"$f":"IF('WK8 - Long Term Financial Plan'!K79-'WK8 - Long Term Financial Plan'!K75=0,0,('WK8 - Long Term Financial Plan'!K97-'WK8 - Long Term Financial Plan'!K75+'WK8 - Long Term Financial Plan'!K90)/('WK8 - Long Term Financial Plan'!K79-'WK8 - Long Term Financial Plan'!K75))","v":1.7406982026236625E-2},{"$f":"IF('WK8 - Long Term Financial Plan'!L79-'WK8 - Long Term Financial Plan'!L75=0,0,('WK8 - Long Term Financial Plan'!L97-'WK8 - Long Term Financial Plan'!L75+'WK8 - Long Term Financial Plan'!L90)/('WK8 - Long Term Financial Plan'!L79-'WK8 - Long Term Financial Plan'!L75))","v":1.6449983999953448E-2},{"$f":"IF('WK8 - Long Term Financial Plan'!M79-'WK8 - Long Term Financial Plan'!M75=0,0,('WK8 - Long Term Financial Plan'!M97-'WK8 - Long Term Financial Plan'!M75+'WK8 - Long Term Financial Plan'!M90)/('WK8 - Long Term Financial Plan'!M79-'WK8 - Long Term Financial Plan'!M75))","v":1.5866525260481143E-2},{"$f":"IF('WK8 - Long Term Financial Plan'!N79-'WK8 - Long Term Financial Plan'!N75=0,0,('WK8 - Long Term Financial Plan'!N97-'WK8 - Long Term Financial Plan'!N75+'WK8 - Long Term Financial Plan'!N90)/('WK8 - Long Term Financial Plan'!N79-'WK8 - Long Term Financial Plan'!N75))","v":2.1001054649764796E-2},{"$f":"IF('WK8 - Long Term Financial Plan'!O79-'WK8 - Long Term Financial Plan'!O75=0,0,('WK8 - Long Term Financial Plan'!O97-'WK8 - Long Term Financial Plan'!O75+'WK8 - Long Term Financial Plan'!O90)/('WK8 - Long Term Financial Plan'!O79-'WK8 - Long Term Financial Plan'!O75))","v":2.3764519234656254E-2},{"$f":"IF('WK8 - Long Term Financial Plan'!P79-'WK8 - Long Term Financial Plan'!P75=0,0,('WK8 - Long Term Financial Plan'!P97-'WK8 - Long Term Financial Plan'!P75+'WK8 - Long Term Financial Plan'!P90)/('WK8 - Long Term Financial Plan'!P79-'WK8 - Long Term Financial Plan'!P75))","v":2.558832378254634E-2}]
[null,null,null,"(excl. capital grants and contributions)",null,"Scenario 3: Hybrid casea",{"$f":"G22","v":-1.0755453716476888E-3},{"$f":"H22","v":5.8970780443499259E-2},{"$f":"I22","v":7.5729386027682935E-2},{"$f":"IF('WK8 - Long Term Financial Plan'!F124-'WK8 - Long Term Financial Plan'!F120=0,0,('WK8 - Long Term Financial Plan'!F142-'WK8 - Long Term Financial Plan'!F120+'WK8 - Long Term Financial Plan'!F135)/('WK8 - Long Term Financial Plan'!F124-'WK8 - Long Term Financial Plan'!F120))","v":-3.5482387743363444E-2},{"$f":"IF('WK8 - Long Term Financial Plan'!G124-'WK8 - Long Term Financial Plan'!G120=0,0,('WK8 - Long Term Financial Plan'!G142-'WK8 - Long Term Financial Plan'!G120+'WK8 - Long Term Financial Plan'!G135)/('WK8 - Long Term Financial Plan'!G124-'WK8 - Long Term Financial Plan'!G120))","v":-2.304152279713086E-2},{"$f":"IF('WK8 - Long Term Financial Plan'!H124-'WK8 - Long Term Financial Plan'!H120=0,0,('WK8 - Long Term Financial Plan'!H142-'WK8 - Long Term Financial Plan'!H120+'WK8 - Long Term Financial Plan'!H135)/('WK8 - Long Term Financial Plan'!H124-'WK8 - Long Term Financial Plan'!H120))","v":-1.0546507285529545E-2},{"$f":"IF('WK8 - Long Term Financial Plan'!I124-'WK8 - Long Term Financial Plan'!I120=0,0,('WK8 - Long Term Financial Plan'!I142-'WK8 - Long Term Financial Plan'!I120+'WK8 - Long Term Financial Plan'!I135)/('WK8 - Long Term Financial Plan'!I124-'WK8 - Long Term Financial Plan'!I120))","v":6.1030141161985824E-3},{"$f":"IF('WK8 - Long Term Financial Plan'!J124-'WK8 - Long Term Financial Plan'!J120=0,0,('WK8 - Long Term Financial Plan'!J142-'WK8 - Long Term Financial Plan'!J120+'WK8 - Long Term Financial Plan'!J135)/('WK8 - Long Term Financial Plan'!J124-'WK8 - Long Term Financial Plan'!J120))","v":1.1027618884255092E-2},{"$f":"IF('WK8 - Long Term Financial Plan'!K124-'WK8 - Long Term Financial Plan'!K120=0,0,('WK8 - Long Term Financial Plan'!K142-'WK8 - Long Term Financial Plan'!K120+'WK8 - Long Term Financial Plan'!K135)/('WK8 - Long Term Financial Plan'!K124-'WK8 - Long Term Financial Plan'!K120))","v":1.7406982026236625E-2},{"$f":"IF('WK8 - Long Term Financial Plan'!L124-'WK8 - Long Term Financial Plan'!L120=0,0,('WK8 - Long Term Financial Plan'!L142-'WK8 - Long Term Financial Plan'!L120+'WK8 - Long Term Financial Plan'!L135)/('WK8 - Long Term Financial Plan'!L124-'WK8 - Long Term Financial Plan'!L120))","v":1.6449983999953448E-2},{"$f":"IF('WK8 - Long Term Financial Plan'!M124-'WK8 - Long Term Financial Plan'!M120=0,0,('WK8 - Long Term Financial Plan'!M142-'WK8 - Long Term Financial Plan'!M120+'WK8 - Long Term Financial Plan'!M135)/('WK8 - Long Term Financial Plan'!M124-'WK8 - Long Term Financial Plan'!M120))","v":1.5866525260481143E-2},{"$f":"IF('WK8 - Long Term Financial Plan'!N124-'WK8 - Long Term Financial Plan'!N120=0,0,('WK8 - Long Term Financial Plan'!N142-'WK8 - Long Term Financial Plan'!N120+'WK8 - Long Term Financial Plan'!N135)/('WK8 - Long Term Financial Plan'!N124-'WK8 - Long Term Financial Plan'!N120))","v":2.1001054649764796E-2},{"$f":"IF('WK8 - Long Term Financial Plan'!O124-'WK8 - Long Term Financial Plan'!O120=0,0,('WK8 - Long Term Financial Plan'!O142-'WK8 - Long Term Financial Plan'!O120+'WK8 - Long Term Financial Plan'!O135)/('WK8 - Long Term Financial Plan'!O124-'WK8 - Long Term Financial Plan'!O120))","v":2.3764519234656254E-2},{"$f":"IF('WK8 - Long Term Financial Plan'!P124-'WK8 - Long Term Financial Plan'!P120=0,0,('WK8 - Long Term Financial Plan'!P142-'WK8 - Long Term Financial Plan'!P120+'WK8 - Long Term Financial Plan'!P135)/('WK8 - Long Term Financial Plan'!P124-'WK8 - Long Term Financial Plan'!P120))","v":2.558832378254634E-2}]
[]
[]
[null,null,"Own Source Revenue Ratio","Total continuing operating revenue"]
[null,null,null,"(excl all grants and contributions)",null,{"$f":"$F$22","v":"Scenario 1: Proposed (with SV)"},{"$f":"IF('WK7 - Historical financials'!G24=0,0,('WK7 - Historical financials'!G25-'WK7 - Historical financials'!G20)/'WK7 - Historical financials'!G24)","v":0.76876888662140419},{"$f":"IF('WK7 - Historical financials'!H24=0,0,('WK7 - Historical financials'!H25-'WK7 - Historical financials'!H20)/'WK7 - Historical financials'!H24)","v":0.84040715983664849},{"$f":"IF('WK7 - Historical financials'!I24=0,0,('WK7 - Historical financials'!I25-'WK7 - Historical financials'!I20)/'WK7 - Historical financials'!I24)","v":0.72050733254062627},{"$f":"IF('WK8 - Long Term Financial Plan'!F32=0,0,('WK8 - Long Term Financial Plan'!F34-'WK8 - Long Term Financial Plan'!F25)/'WK8 - Long Term Financial Plan'!F32)","v":0.71125001437852942},{"$f":"IF('WK8 - Long Term Financial Plan'!G32=0,0,('WK8 - Long Term Financial Plan'!G34-'WK8 - Long Term Financial Plan'!G25)/'WK8 - Long Term Financial Plan'!G32)","v":0.80616420731850147},{"$f":"IF('WK8 - Long Term Financial Plan'!H32=0,0,('WK8 - Long Term Financial Plan'!H34-'WK8 - Long Term Financial Plan'!H25)/'WK8 - Long Term Financial Plan'!H32)","v":0.81212229194121455},{"$f":"IF('WK8 - Long Term Financial Plan'!I32=0,0,('WK8 - Long Term Financial Plan'!I34-'WK8 - Long Term Financial Plan'!I25)/'WK8 - Long Term Financial Plan'!I32)","v":0.82387762311607093},{"$f":"IF('WK8 - Long Term Financial Plan'!J32=0,0,('WK8 - Long Term Financial Plan'!J34-'WK8 - Long Term Financial Plan'!J25)/'WK8 - Long Term Financial Plan'!J32)","v":0.84809164033337203},{"$f":"IF('WK8 - Long Term Financial Plan'!K32=0,0,('WK8 - Long Term Financial Plan'!K34-'WK8 - Long Term Financial Plan'!K25)/'WK8 - Long Term Financial Plan'!K32)","v":0.84935981979867992},{"$f":"IF('WK8 - Long Term Financial Plan'!L32=0,0,('WK8 - Long Term Financial Plan'!L34-'WK8 - Long Term Financial Plan'!L25)/'WK8 - Long Term Financial Plan'!L32)","v":0.84990944964040871},{"$f":"IF('WK8 - Long Term Financial Plan'!M32=0,0,('WK8 - Long Term Financial Plan'!M34-'WK8 - Long Term Financial Plan'!M25)/'WK8 - Long Term Financial Plan'!M32)","v":0.85019645415464329},{"$f":"IF('WK8 - Long Term Financial Plan'!N32=0,0,('WK8 - Long Term Financial Plan'!N34-'WK8 - Long Term Financial Plan'!N25)/'WK8 - Long Term Financial Plan'!N32)","v":0.85419998749813475},{"$f":"IF('WK8 - Long Term Financial Plan'!O32=0,0,('WK8 - Long Term Financial Plan'!O34-'WK8 - Long Term Financial Plan'!O25)/'WK8 - Long Term Financial Plan'!O32)","v":0.85593069352935292},{"$f":"IF('WK8 - Long Term Financial Plan'!P32=0,0,('WK8 - Long Term Financial Plan'!P34-'WK8 - Long Term Financial Plan'!P25)/'WK8 - Long Term Financial Plan'!P32)","v":0.85723838690266574}]
[null,null,null,"Total continuing operating revenue",null,{"$f":"$F$23","v":"Scenario 2 - Base case (no SV)"},{"$f":"G28","v":0.76876888662140419},{"$f":"H28","v":0.84040715983664849},0.72050733254062627,{"$f":"IF('WK8 - Long Term Financial Plan'!F77=0,0,('WK8 - Long Term Financial Plan'!F79-'WK8 - Long Term Financial Plan'!F70)/'WK8 - Long Term Financial Plan'!F77)","v":0.71125001437852942},{"$f":"IF('WK8 - Long Term Financial Plan'!G77=0,0,('WK8 - Long Term Financial Plan'!G79-'WK8 - Long Term Financial Plan'!G70)/'WK8 - Long Term Financial Plan'!G77)","v":0.80461112501194076},{"$f":"IF('WK8 - Long Term Financial Plan'!H77=0,0,('WK8 - Long Term Financial Plan'!H79-'WK8 - Long Term Financial Plan'!H70)/'WK8 - Long Term Financial Plan'!H77)","v":0.8091067082970187},{"$f":"IF('WK8 - Long Term Financial Plan'!I77=0,0,('WK8 - Long Term Financial Plan'!I79-'WK8 - Long Term Financial Plan'!I70)/'WK8 - Long Term Financial Plan'!I77)","v":0.81958729581110645},{"$f":"IF('WK8 - Long Term Financial Plan'!J77=0,0,('WK8 - Long Term Financial Plan'!J79-'WK8 - Long Term Financial Plan'!J70)/'WK8 - Long Term Financial Plan'!J77)","v":0.84300631261688852},{"$f":"IF('WK8 - Long Term Financial Plan'!K77=0,0,('WK8 - Long Term Financial Plan'!K79-'WK8 - Long Term Financial Plan'!K70)/'WK8 - Long Term Financial Plan'!K77)","v":0.84434133739434369},{"$f":"IF('WK8 - Long Term Financial Plan'!L77=0,0,('WK8 - Long Term Financial Plan'!L79-'WK8 - Long Term Financial Plan'!L70)/'WK8 - Long Term Financial Plan'!L77)","v":0.84493110809798821},{"$f":"IF('WK8 - Long Term Financial Plan'!M77=0,0,('WK8 - Long Term Financial Plan'!M79-'WK8 - Long Term Financial Plan'!M70)/'WK8 - Long Term Financial Plan'!M77)","v":0.84526457654371467},{"$f":"IF('WK8 - Long Term Financial Plan'!N77=0,0,('WK8 - Long Term Financial Plan'!N79-'WK8 - Long Term Financial Plan'!N70)/'WK8 - Long Term Financial Plan'!N77)","v":0.84938927427356981},{"$f":"IF('WK8 - Long Term Financial Plan'!O77=0,0,('WK8 - Long Term Financial Plan'!O79-'WK8 - Long Term Financial Plan'!O70)/'WK8 - Long Term Financial Plan'!O77)","v":0.85119280369641304},{"$f":"IF('WK8 - Long Term Financial Plan'!P77=0,0,('WK8 - Long Term Financial Plan'!P79-'WK8 - Long Term Financial Plan'!P70)/'WK8 - Long Term Financial Plan'!P77)","v":0.85254593751870944}]
[null,null,null,"(incl. capital grants and contributions)"]
[]
[null,null,null,null,null,null,null,null,null,"Please enter forecast ratios"]
[null,null,"Infrastructure Renewals Ratio","Asset renewals (building and infrastructure)",null,{"$f":"$F$22","v":"Scenario 1: Proposed (with SV)"},{"$f":"'WK7 - Historical financials'!G64","v":1.3973},{"$f":"'WK7 - Historical financials'!H64","v":1.1771},{"$f":"'WK7 - Historical financials'!I64","v":1.7062999999999999},2.4590999999999998,1.8482000000000001,1.9532,1.5722,1.4021999999999999,1.4511000000000001,1.4641999999999999,1.5154000000000001,1.5321,1.5622,1.5979000000000001]
[null,null,null,"Depreciation, amortisation and impairment",null,{"$f":"$F$23","v":"Scenario 2 - Base case (no SV)"},{"$f":"G33","v":1.3973},{"$f":"H33","v":1.1771},1.7062999999999999,2.4590999999999998,1.7588999999999999,1.7743,1.3024,1.0370999999999999,1.0860000000000001,1.0991,1.151,1.1685000000000001,1.1996,1.2367999999999999]
[null,null,null,"(building and infrastructure)"]
[]
[null,null,"2. Effective infrastructure and service management"]
[]
[null,null,"Infrastructure Backlog Ratio",null,null,null,null,null,null,{"$f":"J32","v":"Please enter forecast ratios"}]
[null,null,null,"Estimated cost to bring assets to satisfactory condition",null,{"$f":"$F$22","v":"Scenario 1: Proposed (with SV)"},{"$f":"'WK7 - Historical financials'!G65","v":7.6399999999999996E-2},{"$f":"'WK7 - Historical financials'!H65","v":7.2800000000000004E-2},{"$f":"'WK7 - Historical financials'!I65","v":7.0900000000000005E-2},7.0000000000000007E-2,0.06,0.06,0.06,0.05,0.05,0.04,0.04,0.03,0.02,0.02]
[null,null,null,"Total (WDV)b of infrastructure, buildings, other",null,{"$f":"$F$23","v":"Scenario 2 - Base case (no SV)"},{"$f":"G40","v":7.6399999999999996E-2},{"$f":"H40","v":7.2800000000000004E-2},{"$f":"I40","v":7.0900000000000005E-2},{"$f":"J40","v":7.0000000000000007E-2},7.0000000000000007E-2,0.06,0.06,0.06,0.06,0.06,0.06,0.06,0.06,0.06]
[null,null,null,"  structures, depreciable land, and improvement assets"]
[]
[]
[null,null,"Asset Maintenance Ratio",null,null,null,null,null,null,"Optional: Enter forecast ratios only if they are relevant to your council's application. Otherwise leave blank"]
[null,null,null,"Actual asset maintenance",null,{"$f":"$F$22","v":"Scenario 1: Proposed (with SV)"},{"$f":"'WK7 - Historical financials'!G66","v":0.90859999999999996},{"$f":"'WK7 - Historical financials'!H66","v":1.0259},{"$f":"'WK7 - Historical financials'!I66","v":1.2041999999999999},0.91,0.92,0.92,0.93,0.93,0.94,0.94,0.95,0.95,0.96,0.96]
[null,null,null,"Required asset maintenance",null,{"$f":"$F$23","v":"Scenario 2 - Base case (no SV)"},{"$f":"G46","v":0.90859999999999996},{"$f":"H46","v":1.0259},{"$f":"I46","v":1.2041999999999999},{"$f":"J46","v":0.91},0.92,0.92,0.92,0.92,0.93,0.93,0.93,0.94,0.94,0.94]
[]
[]
[null,null,"Debt Service Ratio"]
[null,null,null,"Cost of debt service",null,null,null,null,null,"Optional: Enter forecast ratios only if they are relevant to your council's application. Otherwise leave blank"]
[null,null,null,"(interest expense and principal repayments)",null,{"$f":"$F$22","v":"Scenario 1: Proposed (with SV)"},{"$f":"IF('WK7 - Historical financials'!G25=0,0,ABS('WK7 - Historical financials'!G54+'WK7 - Historical financials'!G55)/'WK7 - Historical financials'!G25)","v":1.8151660982105314E-2},{"$f":"IF('WK7 - Historical financials'!H25=0,0,ABS('WK7 - Historical financials'!H54+'WK7 - Historical financials'!H55)/'WK7 - Historical financials'!H25)","v":1.7231856843035458E-2},{"$f":"IF('WK7 - Historical financials'!I25=0,0,ABS('WK7 - Historical financials'!I54+'WK7 - Historical financials'!I55)/'WK7 - Historical financials'!I25)","v":1.6070004702418678E-2},2.0500000000000001E-2,2.1999999999999999E-2,2.1100000000000001E-2,1.9E-2,1.7100000000000001E-2,1.55E-2,1.18E-2,9.4999999999999998E-3,9.1999999999999998E-3,9.1000000000000004E-3,6.7000000000000002E-3]
[null,null,null,"Total continuing operating revenue",null,{"$f":"$F$23","v":"Scenario 2 - Base case (no SV)"},{"$f":"G52","v":1.8151660982105314E-2},{"$f":"H52","v":1.7231856843035458E-2},{"$f":"I52","v":1.6070004702418678E-2},{"$f":"J52","v":2.0500000000000001E-2},2.2200000000000001E-2,2.1600000000000001E-2,1.9599999999999999E-2,1.77E-2,1.61E-2,1.23E-2,9.7999999999999997E-3,9.5999999999999992E-3,9.4999999999999998E-3,6.8999999999999999E-3]
[null,null,null,"(excl capital grants and contributions)"]
[]
[]
[null,"Notes:"]
[null,"a",{"$f":"'WK8 - Long Term Financial Plan'!C106","v":"SCENARIO 3: Hybrid case  - SV expenditure but no SV income "}]
[null,"b","WDV = written down value"]