{"text_format":"1","workbook":"xlsx","n_sheets":15,"sheets":["Examples","WK0 - Input data","Journal","Instructions","Export","WK1 - Identification","WK2 - Notional General Income","WK3 - Notional GI Yr1 YIELD","WK4 - PGI summary","WK5a - Impact on Rates","WK5b - Impact on Rates","WK6 - Expenditure Program","WK7 - Historical financials","WK8 - Long Term Financial Plan","WK9 - Ratios"],"not_rendered":{"charts":15,"images":3,"macros":1,"external_links":0,"defined_names":24,"comments":4,"pivot_tables":0},"unopened":[],"bounds":{"document_bytes":16777216,"sheet_cells":100000,"rows_first":2000,"rows_last":500,"rows_between":2000,"halvings":0,"cell_chars":16384,"cell_head_chars":4096},"cells_cut":0,"cells_raw":0,"read":"whole","date_system":"1900"}

{"sheet":"Examples","index":0,"n_rows":42,"n_cols":27,"rows_kept":42,"cut":false,"hidden":true,"merged":[]}
[]
[null,"IPART colour codes for models, spreadsheets and information requests"]
[null,"NB  ALWAYS DESCRIBE THE COLOUR CODE USED IN YOUR MODEL "]
[null,"Note: If you use the formats for the inputs provided in this template, input cells will always be unprotected even when you protect the worksheet"]
[null,null,null,null,null,null,null,"use this column cell to \"paint\" input cells for numbers (NOT for percentages)"]
[null,null,null,null,null,null,null,null,"use this column cell to \"paint\" input cells for percentages (NOT numbers)"]
[null,"Models and spreadsheets"]
[null,null,null,null,null,null,"numbers","%"]
[null,"Inputs",null,null,null,null,4232,0.08]
[null,"Inputs with default values, default values are shown in italics next to or below ",null,null,null,null,34345,0.08]
[null,"Hard-coded values used that should not be changed, eg credit ratings or '1' at the start of an index series."]
[null,"Key outputs"]
[null,"Links from other files (green)"]
[null,"Error check (check =0)"]
[null,"Error warnings, messages and unusual calculation assumptions"]
{"$rows_left_out":28}
{"sheet":"WK0 - Input data","index":1,"n_rows":270,"n_cols":16,"rows_kept":270,"cut":false,"hidden":true,"merged":[]}
[]
[null,"This worksheet is for IPART Analyst use only. "]
[]
[]
[null,"Instructions:"]
[null,{"$f":"\"1. Enter the required information in the blue input cells in Section \"&B23","v":"1. Enter the required information in the blue input cells in Section 1. Inputs"}]
[null,{"$f":"\"2. Check the list of council names and update if necessary in Section \"&B67","v":"2. Check the list of council names and update if necessary in Section 2. Council Name"}]
[]
[]
[null,"Contents",null,null,null,null,null,null,null,"row"]
[null,{"$f":"B23","v":"1. Inputs"},null,null,null,null,null,null,null,{"$f":"ROW(B23)","v":23}]
[null,{"$f":"B26","v":"Table 1 - Analyst and TSO details"},null,null,null,null,null,null,null,{"$f":"ROW(B26)","v":26}]
[null,{"$f":"B42","v":"Table 2 - SV year and rate peg"},null,null,null,null,null,null,null,{"$f":"ROW(B42)","v":42}]
[null,{"$f":"B52","v":"Table 3 - SV year, rate peg  and units in display format "},null,null,null,null,null,null,null,{"$f":"ROW(B52)","v":52}]
[null,{"$f":"B67","v":"2. Council Name"},null,null,null,null,null,null,null,{"$f":"ROW(B67)","v":67}]
{"$rows_left_out":256}
{"sheet":"Journal","index":2,"n_rows":16,"n_cols":6,"rows_kept":16,"cut":false,"hidden":false,"merged":[]}
[]
[null,"Journal of changes made to Application form Part A - Special Variation 2019-20"]
[]
[null,"Changes since 22 November 2018"]
[]
[null,"Description of changes:","Worksheet:","Made by:","Date","Notes"]
[null,"CORRECTIONS"]
[null,"Corrected formula for 'Total Notional General Income' ","WK3 - Notional GI Yr1 YIELD'!M161","Scott","2018-11-30","Formula now includes Ordinary rates, Special rates and Annual charges"]
[null,"Corrected column headings (years) from column S","WK5a - Impact on Rates'!S23 &","Bee","2018-12-02","Headings now correctly refer to Year 1 to Year 7"]
[null,null,"WK5b - Impact on Rates'!R24"]
[null,"Corrected cell references for Scenario 3 (income - 'additional items')","WK8 - Long Term Financial Plan'!F117:P118","Bee","2018-12-02","Corrects Scenario 3 income, operating results and operating performance ratio."]
[]
[null,"COSMETIC CHANGES"]
[null,"Enter valuation objection as a positive whole number on WK3, consistent with WK1. Changed formula for net total and instructions accordingly","WK3 - Notional GI Yr1 YIELD'!M164 and M166","Bee","2018-12-02","Previously entered as a negative number"]
[null,"Terminology changed for some historical information ","WK7 - Historical financials'!C42:C45","Bee","2018-12-02","Made more consistent with  long term financial plan terminology"]
{"$rows_left_out":2}
{"sheet":"Instructions","index":3,"n_rows":243,"n_cols":17,"rows_kept":243,"cut":false,"hidden":false,"merged":[]}
[]
[]
[]
[]
[]
[null,null,null,null,null,null,null,"  THE INDEPENDENT PRICING AND REGULATORY TRIBUNAL OF NSW"]
[]
[null,null,null,null,null,null,null,"APPLICATION FOR A SPECIAL VARIATION "]
[null,null,null,null,null,null,null,"TO GENERAL INCOME"]
[null,null,null,null,null,null,null,"under Section 508A and 508(2) of the Local Government Act 1993"]
[]
[]
[null,null,null,null,null,null,null,"SECTION 508A & 508(2) APPLICATION FORM"]
[null,null,null,null,null,null,null,{"$f":"\"PART A \"&'WK0 - Input data'!$D$45","v":"PART A 2019-20"}]
[]
{"$rows_left_out":229}
{"sheet":"Export","index":4,"n_rows":304,"n_cols":23,"rows_kept":304,"cut":false,"hidden":true,"merged":[]}
["Hide sheet before publishing"]
[]
[null,"EXPORT SHEET"]
[]
[null,{"$f":"'WK1 - Identification'!$F$5","v":"WORKSHEET 1"}]
[null,{"$f":"'WK1 - Identification'!C13","v":"Council Name:"},null,{"$f":"'WK2 - Notional General Income'!$C$3","v":"Burwood Council"}]
[null,"Type of application",null,{"$f":"'WK1 - Identification'!K28","v":"s508A"}]
[null,"Has existing SV?",null,{"$f":"'WK1 - Identification'!K24","v":"no"}]
[null,"Yrs SV applies",null,{"$f":"'WK1 - Identification'!R31","v":4}]
[null,"Permanent or temporary?",null,{"$f":"'WK1 - Identification'!K30","v":"Permanent"}]
[null,"No yrs if temporary",null,{"$f":"'WK1 - Identification'!K31","v":0}]
[]
[]
[]
[]
{"$rows_left_out":290}
{"sheet":"WK1 - Identification","index":5,"n_rows":72,"n_cols":18,"rows_kept":72,"cut":false,"hidden":false,"merged":[]}
[]
[]
[null,null,null,null,"             APPLICATION FOR SPECIAL VARIATION TO GENERAL INCOME        ",null,null,null,null,null,null,null,{"$f":"'WK0 - Input data'!$D$45","v":"2019-20"}]
[]
[null,null,null,null,null,"WORKSHEET 1"]
[]
[null,null,null,"Step 1: Fill out council details"]
[null,null,null,"Step 2: Fill out any existing variation information"]
[null,null,null,"Step 3: Fill out crown land adjustments, catch up & excess, valuation objections"]
[null,null,null,"Step 4: Fill out proposed special variation amounts"]
[null,null,"                                                                                                          All dollars in nominal terms "]
[]
[null,null,"Council Name:",null,"Burwood Council",null,null,null,{"$f":"\"If your councils' name is not in the list, please enter it in cell E\"&ROW(C14)","v":"If your councils' name is not in the list, please enter it in cell E14"}]
[null,null,"Council Name if not listed:"]
[]
{"$rows_left_out":58}
{"sheet":"WK2 - Notional General Income","index":6,"n_rows":163,"n_cols":13,"rows_kept":163,"cut":false,"hidden":false,"merged":[]}
[]
[]
[null,null,{"$f":"IF(ISBLANK('WK1 - Identification'!$E$13),'WK1 - Identification'!$E$14,'WK1 - Identification'!$E$13)","v":"Burwood Council"}]
[]
[null,null,null,null,null,null,null,"WORKSHEET 2"]
[]
[null,null,null,null,null,null,null,{"$f":"\"CALCULATION OF NOTIONAL GENERAL INCOME \"&'WK0 - Input data'!$F$58","v":"CALCULATION OF NOTIONAL GENERAL INCOME 2018-19"}]
[null,null,null,null,null,null,null,"Applicable to the first year of the application"]
[]
[null,null,null,null,null,null,null,"All dollars in nominal terms "]
[null,null,null,null,null,null,null,"This worksheet must reflect the rating structure levied in the previous year "]
[null,null,null,null,{"$f":"\"NOTE: Valuations used here are to be taken from Council's valuation list on 1 July \"&'WK0 - Input data'!$F$57&\" and are to include:\"","v":"NOTE: Valuations used here are to be taken from Council's valuation list on 1 July 2018 and are to include:"}]
[null,null,null,null,"(i) supplementaries having the same base date and furnished to Council during that year, and"]
[null,null,null,null,"(ii) estimates of increases in valuations provided to the Council under section 513."]
[]
{"$rows_left_out":149}
{"sheet":"WK3 - Notional GI Yr1 YIELD","index":7,"n_rows":168,"n_cols":13,"rows_kept":168,"cut":false,"hidden":false,"merged":[]}
[]
[]
[null,null,{"$f":"'WK2 - Notional General Income'!$C$3","v":"Burwood Council"}]
[]
[null,null,null,null,null,null,null,"WORKSHEET 3"]
[]
[null,null,null,null,null,null,null,{"$f":"\"CALCULATION OF NOTIONAL GENERAL INCOME \"&'WK0 - Input data'!$G$58","v":"CALCULATION OF NOTIONAL GENERAL INCOME 2019-20"}]
[]
[null,null,null,null,null,null,null,"All dollars in nominal terms "]
[]
[null,null,null,null,null,null,null,"This worksheet must contain the rating structure proposed  for the first year of the special variation application. "]
[null,null,null,null,null,null,null,"Note: A rating structure that does not comply with the legislation may not be approved.  It is Council's responsibility to check its rating structure with OLG before submission to IPART."]
[]
[null,null,null,null,null,null,null,"Calculation of Notional General Income - Ordinary Rates"]
[]
{"$rows_left_out":154}
{"sheet":"WK4 - PGI summary","index":8,"n_rows":97,"n_cols":17,"rows_kept":97,"cut":false,"hidden":false,"merged":[]}
[]
[]
[null,null,{"$f":"'WK2 - Notional General Income'!$C$3","v":"Burwood Council"}]
[]
[null,null,null,null,"WORKSHEET 4"]
[]
[null,null,null,null,{"$f":"\"PERMISSIBLE GENERAL INCOME SUMMARY FOR \"&'WK0 - Input data'!$D$45","v":"PERMISSIBLE GENERAL INCOME SUMMARY FOR 2019-20"}]
[null,null,null,null,"  All dollars in nominal terms"]
[null,null,null,null,"Please check all income adjustments and expiring variation amounts with OLG"]
[null,null,null,null,"before submitting the application.",null,null,null,null,"check = 0"]
[null,null,"Prior year Notional General Income",null,null,null,null,{"$f":"'WK2 - Notional General Income'!M161","v":22650649.7657394},null,{"$f":"IF(H11=0,0,H11-G41)","v":0}]
[null,null,"Less:","Expiry of a prior special variation",null,null,null,{"$f":"'WK1 - Identification'!F71","v":0},null,{"$f":"IF(H12=0,0,H12-G42)","v":0}]
[]
[null,null,"Adjusted first year Notional General Income",null,null,null,"$",{"$f":"H11-H12","v":22650649.7657394}]
[]
{"$rows_left_out":83}
{"sheet":"WK5a - Impact on Rates","index":9,"n_rows":412,"n_cols":49,"rows_kept":412,"cut":false,"hidden":false,"merged":[]}
[]
[]
[null,null,{"$f":"'WK2 - Notional General Income'!$C$3","v":"Burwood Council"}]
[]
[null,null,null,null,null,"WORKSHEET 5a"]
[]
[null,null,null,null,null,"IMPACT ON MINIMUM RATES, AVERAGE RATES AND OTHER CHARGES"]
[null,null,null,null,null,"  All dollars in nominal terms"]
[]
[null,null,null,"    The aim of this sheet is to show the minimum rate increase (if applicable), the average rate increase per sub-category"]
[null,null,null,"    (inclusive of all relevant rates) and the proposed annual charges in each year of the proposed special variation."]
[null,null,null,"    It also aims to compare average rates with and without the proposed special variation."]
[null,null,null,"    All ordinary rates and special rates need to be included."]
[null,null,null,"Note: rate estimates should reflect expected minimum or average rates, inclusive of any expiring variations."]
[]
{"$rows_left_out":398}
{"sheet":"WK5b - Impact on Rates","index":10,"n_rows":140,"n_cols":48,"rows_kept":140,"cut":false,"hidden":false,"merged":[]}
[]
[]
[null,null,{"$f":"'WK2 - Notional General Income'!$C$3","v":"Burwood Council"}]
[]
[null,null,null,null,null,"WORKSHEET 5b"]
[]
[null,null,null,null,null,"IMPACT ON RATES BY LAND VALUE"]
[null,null,null,null,null,"  All dollars in nominal terms"]
[]
[null,null,"         The aim of this sheet is to show the impact of the proposed special variation on Ordinary Rates by land value for the residential, business"]
[null,null,"         and farmland categories - as applicable."]
[]
[null,null,"         1. Enter the number of property assessments within each of the specified land value ranges."]
[]
[null,null,"         2. Include the estimated rate levels for the specified land values (eg $50,000) over the period of the proposed special variation - both with and without the variation."]
{"$rows_left_out":126}
{"sheet":"WK6 - Expenditure Program","index":11,"n_rows":115,"n_cols":22,"rows_kept":115,"cut":false,"hidden":false,"merged":[]}
[]
[]
[null,null,{"$f":"'WK2 - Notional General Income'!$C$3","v":"Burwood Council"}]
[]
[null,null,null,null,null,null,null,null,null,"WORKSHEET 6"]
[]
[null,null,null,null,null,null,null,null,null,"PROPOSED ADDITIONAL SPECIAL VARIATION INCOME AND EXPENDITURE"]
[null,null,null,null,null,null,null,null,null,"      All dollars in nominal terms"]
[]
[null,null,null,null,null,null,"This sheet shows how the council proposes to use the additional income from the special variation."]
[null,null,null,null,null,null,{"$f":"\"Enter the proposed spending over \"&IF($G$18='WK0 - Input data'!$B$243,10,G19)&\" years under each of the headings as relevant.\"","v":"Enter the proposed spending over 10 years under each of the headings as relevant."}]
[]
[null,null,null,null,null,null,"For additional SV income in years beyond the period of the proposed special variation, we increase the income after the final year"]
[null,null,null,null,null,null,"of the variation by the assumed rate peg of 2.5% in each of the future years. i.e. multiply by 1.025 each year."]
[]
{"$rows_left_out":101}
{"sheet":"WK7 - Historical financials","index":12,"n_rows":112,"n_cols":9,"rows_kept":112,"cut":false,"hidden":false,"merged":[]}
[]
[]
[null,null,{"$f":"'WK2 - Notional General Income'!$C$3","v":"Burwood Council"}]
[]
[null,null,null,null,null,"WORKSHEET 7"]
[]
[null,null,null,null,null,"HISTORICAL FINANCIAL INFORMATION"]
[null,null,null,null,null,"      All dollars in nominal terms ($'000)"]
[]
[null,null,null,null,null,"This sheet captures the council's historical financial information as reported in its financial statements."]
[]
[]
[null,null,"Income statement",null,null,null,null,"$'000 nominal per year"]
[null,null,null,null,null,null,{"$f":"'WK0 - Input data'!C$58","v":"2015-16"},{"$f":"'WK0 - Input data'!D$58","v":"2016-17"},{"$f":"'WK0 - Input data'!E$58","v":"2017-18"}]
[null,null,"Income"]
{"$rows_left_out":98}
{"sheet":"WK8 - Long Term Financial Plan","index":13,"n_rows":214,"n_cols":20,"rows_kept":214,"cut":false,"hidden":false,"merged":[]}
[]
[]
[null,null,{"$f":"'WK2 - Notional General Income'!$C$3","v":"Burwood Council"}]
[]
[null,null,null,null,null,null,null,null,"WORKSHEET 8"]
[]
[null,null,null,null,null,null,null,null,"LONG TERM FINANCIAL PLAN - SV SCENARIO AND BASE CASE"]
[null,null,null,null,null,null,null,null,"      All dollars in nominal terms"]
[]
[null,null,null,null,"This sheet shows how the council's Long Term Financial Plan reflects the impact of the proposed special variation versus its base case (no special variation).  "]
[null,null,null,null,"Enter the figures from the most recent Long Term Financial Plan over 10 years under each of the headings as relevant.  Add rows if necessary."]
[]
[null,null,null,null,"In the last table, please enter the key assumptions relating to the Long Term Financial Plan. Please ensure that these figures match the latest version"]
[null,null,null,null,"of the Long Term Financial Plan provided with the application and that these figures are for the GENERAL FUND ONLY."]
[]
{"$rows_left_out":200}
{"sheet":"WK9 - Ratios","index":14,"n_rows":59,"n_cols":20,"rows_kept":59,"cut":false,"hidden":false,"merged":[]}
[]
[]
[null,null,{"$f":"'WK2 - Notional General Income'!$C$3","v":"Burwood Council"}]
[]
[null,null,null,null,null,"WORKSHEET 9"]
[]
[null,null,null,null,null,"FINANCIAL RATIOS"]
[]
[null,null,null,null,null,"This worksheet captures financial ratios for three historical years as well as the current and forecast years (0 to 10)"]
[null,null,null,null,null,"The historical ratios are calculated from information provided in Worksheet 7 and two of the forecast ratios are calculated from information entered in Worksheet 8."]
[null,null,null,null,null,"Please enter the forecast financial ratios in the blue input cells"]
[null,null,null,null,null,{"$f":"\"Enter the two compusory ratios (\"&C33&\" and \"&C39&\")\"","v":"Enter the two compusory ratios (Infrastructure Renewals Ratio and Infrastructure Backlog Ratio)"}]
[null,null,null,null,null,"Enter the two optional ratios (Asset Maintenance Ratio and Debt Service Ratio) only if they are relevant to your Council's application, otherwise leave blank. "]
[]
[null,null,null,null,null,null,null,"Historical ratios",null,null,null,null,null,"Forecast ratios"]
{"$rows_left_out":44}