{"text_format":"1","workbook":"xlsx","n_sheets":27,"sheets":["MAIN MENU","INSTRUCTIONS","INFO OP","INFO OSR","INFO BIAR","INFO IB","INFO AM","INFO DS","INFO ROEPC","DATA OP","DATA  OSR","DATA BIAR","DATA IB","DATA AM","DATA DS","DATA ROEPC","CALC OP","CALC OSR","CALC BIAR","CALC IB","CALC AM","CALC DS","CALC ROEPC","RESULTS","POPULATION","Sheet1","Sheet2"],"not_rendered":{"charts":7,"images":10,"macros":1,"external_links":0,"defined_names":26,"comments":0,"pivot_tables":0},"unopened":[],"bounds":{"document_bytes":16777216,"sheet_cells":100000,"rows_first":2000,"rows_last":500,"rows_between":2000,"halvings":0,"cell_chars":16384,"cell_head_chars":4096},"cells_cut":0,"cells_raw":0,"read":"whole","date_system":"1900"}

{"sheet":"MAIN MENU","index":0,"n_rows":39,"n_cols":18,"rows_kept":39,"cut":false,"hidden":false,"merged":[[3,3,3,5],[4,12,5,14],[8,8,11,10],[13,8,16,10],[23,8,26,10],[18,8,21,10],[5,3,8,5],[13,12,16,14],[33,8,36,10],[38,8,41,10],[8,12,11,14],[18,12,21,14],[23,12,26,14],[28,12,31,14],[28,8,31,10],[13,17,16,19],[13,20,16,20],[38,12,41,14],[42,12,43,14],[5,17,8,19],[17,17,17,19],[33,12,36,14],[3,17,3,19],[5,8,5,10],[5,20,8,20],[9,17,10,19],[9,20,10,20]]}
[]
[]
[null,null,null,null,null,null,null,null,null,null,"Self Assessment Tool"]
[null,null,null,"START HERE",null,null,null,null,null,null,null,null,null,null,null,null,null,"END HERE"]
[null,null,null,null,null,null,null,null,null,null,null,null,"RESULTS"]
[null,null,null,"How To Instructions",null,null,null,null,"ENTER DATA HERE",null,null,null,null,null,null,null,null,"Overall Results"]
[]
[]
{"$rows_left_out":32}
{"sheet":"INSTRUCTIONS","index":1,"n_rows":6,"n_cols":4,"rows_kept":6,"cut":false,"hidden":false,"merged":[[2,11,5,13],[7,11,10,13],[4,1,4,2]]}
[]
[null,"INSTRUCTIONS"]
[]
[]
[null,null,null,"The Council of the Shire of Wakool"]
[null,"COUNCILS ARE TO USE ONLY GENERAL FUND DATA FOR THIS PURPOSE"]

{"sheet":"INFO OP","index":2,"n_rows":13,"n_cols":2,"rows_kept":13,"cut":false,"hidden":false,"merged":[[11,1,11,10],[12,1,12,10],[5,1,5,10],[4,1,4,10],[3,1,3,10],[6,1,6,10],[7,1,7,10],[8,1,8,10],[9,1,9,10]]}
[]
[null,"OPERATING PERFORMANCE RATIO"]
[null,{"$f":"INSTRUCTIONS!D5","v":"The Council of the Shire of Wakool"}]
[null,"Total continuing operating revenue (exc. capital grants and contributions) less operating expenses"]
[null,"Total continuing operating revenue (exc. capital grants and contributions) "]
[]
[null,"Description and Rationale for Criteria:"]
[null,"·         TCorp in their review of financial sustainability of local government found that operating performance was a core measure of financial sustainability."]
{"$rows_left_out":6}
{"sheet":"INFO OSR","index":3,"n_rows":13,"n_cols":2,"rows_kept":13,"cut":false,"hidden":false,"merged":[[11,1,11,10],[12,1,12,10],[10,1,10,10],[5,1,5,10],[3,1,3,10],[4,1,4,10],[6,1,6,10],[7,1,7,10],[8,1,8,10]]}
[]
[null,"OWN SOURCE REVENUE RATIO"]
[null,{"$f":"INSTRUCTIONS!D5","v":"The Council of the Shire of Wakool"}]
[null,"Total continuing operating revenue less all grants and contributions"]
[null,"Total continuing operating revenue inclusive of capital grants and contributions"]
[null,"\n\n"]
[null,"Description and Rationale for Criteria:"]
[null,"·         Own source revenue measures the degree of reliance on external funding sources (e.g. grants and contributions). This ratio measures fiscal flexibility and robustness. Financial flexibility increases as the level of own source revenue increases. It also gives councils greater ability to manage external shocks or challenges."]
{"$rows_left_out":6}
{"sheet":"INFO BIAR","index":4,"n_rows":14,"n_cols":2,"rows_kept":14,"cut":false,"hidden":false,"merged":[[8,1,8,10],[9,1,9,10],[12,1,12,10],[13,1,13,10],[11,1,11,10],[6,1,6,10],[1,1,1,10],[3,1,3,10],[4,1,4,10],[7,1,7,10]]}
[]
[null,"BUILDING AND INFRASTRUCTURE ASSET RENEWAL RATIO"]
[null,{"$f":"INSTRUCTIONS!D5","v":"The Council of the Shire of Wakool"}]
[null,"Asset renewals (building and infrastructure)"]
[null,"Depreciation, amortisation and impairment (building and infrastructure)"]
[]
[null,"\n\n"]
[null,"Description and Rationale for Criteria:"]
{"$rows_left_out":7}
{"sheet":"INFO IB","index":5,"n_rows":13,"n_cols":2,"rows_kept":13,"cut":false,"hidden":false,"merged":[[11,1,11,11],[12,1,12,11],[3,1,3,11],[4,1,4,11],[10,1,10,11],[6,1,6,11],[7,1,7,11],[8,1,8,11],[9,1,9,11]]}
[]
[null,"INFRASTRUCTURE BACKLOG RATIO"]
[null,{"$f":"INSTRUCTIONS!D5","v":"The Council of the Shire of Wakool"}]
[null,"Estimated cost to bring assets to a satisfactory condition"]
[null,"Total (WDV) of infrastructure, buildings, other structures and depreciable land improvement assets"]
[]
[null,"Description and Rationale for Criteria:"]
[null,"·         The infrastructure backlog ratio indicates the proportion of backlog against the total value of the Council’s infrastructure assets. It is a measure of the extent to which asset renewal is required to maintain or improve service delivery in a sustainable way.  This measures how councils are managing their infrastructure which is so critical to effective community sustainability."]
{"$rows_left_out":6}
{"sheet":"INFO AM","index":6,"n_rows":13,"n_cols":2,"rows_kept":13,"cut":false,"hidden":false,"merged":[[12,1,12,10],[11,1,11,10],[5,1,5,10],[3,1,3,4],[4,1,4,4],[6,1,6,10],[10,1,10,10],[7,1,7,10],[8,1,8,10]]}
[]
[null,"ASSET MAINTENANCE RATIO"]
[null,{"$f":"INSTRUCTIONS!D5","v":"The Council of the Shire of Wakool"}]
[null,"Actual asset maintenance"]
[null,"Required asset maintenance"]
[null,"\n"]
[null,"Description and Rationale for Criteria:"]
[null,"·         The asset maintenance ratio reflects the actual asset maintenance expenditure relative to the required asset maintenance as measured by an individual council."]
{"$rows_left_out":6}
{"sheet":"INFO DS","index":7,"n_rows":15,"n_cols":2,"rows_kept":15,"cut":false,"hidden":false,"merged":[[13,1,13,10],[14,1,14,10],[5,1,5,10],[3,1,3,10],[4,1,4,10],[6,1,6,10],[12,1,12,10],[7,1,7,10],[8,1,8,10],[9,1,9,10],[10,1,10,10]]}
[]
[null,"DEBT SERVICE RATIO"]
[null,{"$f":"INSTRUCTIONS!D5","v":"The Council of the Shire of Wakool"}]
[null,"Cost of debt service  (interest expense & principal repayments)"]
[null,"Total continuing operating revenue (exc. capital grants and contributions)"]
[null,"\n\n"]
[null,"Description and Rationale for Criteria:"]
[null,"·         Prudent and active debt management is a key part of Councils’ approach to both funding and managing infrastructure and services over the long term."]
{"$rows_left_out":8}
{"sheet":"INFO ROEPC","index":8,"n_rows":15,"n_cols":3,"rows_kept":15,"cut":false,"hidden":false,"merged":[[13,1,13,10],[14,1,14,10],[4,1,4,10],[12,1,12,10],[5,1,5,10],[6,1,6,10],[7,1,7,10],[10,1,10,10],[8,2,8,10],[9,2,9,10]]}
[]
[null,"REAL OPERATING EXPENDITURE PER CAPITA"]
[null,{"$f":"INSTRUCTIONS!D5","v":"The Council of the Shire of Wakool"}]
[]
[null,"Description and Rationale for Criteria:"]
[null,"·         At the outset it is acknowledged the difficulty in measuring public sector efficiency. This is because there is a range of difficulty in reliably and accurately measuring output."]
[null,"·         The capacity to secure economies of scale over time is a key indicator of operating efficiency. The capacity to secure efficiency improvements can be measured with respect to a range of factors, for example population, assets, and financial turnover."]
[null,"·         It is challenging to measure productivity changes over time. To overcome this, changes in real per capita expenditure was considered to assess how effectively Councils:"]
{"$rows_left_out":8}
{"sheet":"DATA OP","index":9,"n_rows":32,"n_cols":7,"rows_kept":32,"cut":false,"hidden":false,"merged":[[4,9,4,11],[31,1,31,6],[29,1,29,6]]}
[]
[null,"GENERAL FUND - OPERATING PERFORMANCE DATA"]
[null,{"$f":"INSTRUCTIONS!D5","v":"The Council of the Shire of Wakool"}]
[null,null,"2011-12                         GENERAL FUND DATA                              $000",null,"2012-13                            GENERAL FUND DATA                                      $000",null,"2013-14                          GENERAL FUND DATA                                       $000"]
[null,"Note 21- Income Statement - Income - Total Income from continuing operations ",16146,null,16906,null,14707]
[]
[null,"Note 21 - Income Statement - Income - Grants & Contributions Provided For Capital Purposes ",3053,null,826,null,1240]
[]
{"$rows_left_out":25}
{"sheet":"DATA  OSR","index":10,"n_rows":24,"n_cols":7,"rows_kept":24,"cut":false,"hidden":false,"merged":[]}
[]
[null,"GENERAL FUND - OWN SOURCE REVENUE DATA"]
[null,{"$f":"INSTRUCTIONS!D5","v":"The Council of the Shire of Wakool"}]
[null,null,"2011-12                                   GENERAL FUND DATA                                      $000",null,"2012-13                 GENERAL FUND DATA                           $000",null,"2013-14                             GENERAL FUND DATA                           $000"]
[null,"Note 21- Income Statement - Income - Total Income from continuing operations ",{"$f":"'DATA OP'!C5","v":16146},null,{"$f":"'DATA OP'!E5","v":16906},null,{"$f":"'DATA OP'!G5","v":14707}]
[]
[null,"Note 21 - Income Statement - Income - Operating Revenues - Grants & Contributions Provided For Operating Purposes ",{"$f":"6811-2480-1701","v":2630},null,{"$f":"9176-1555-1724","v":5897},null,{"$f":"6441-1104-669","v":4668}]
[]
{"$rows_left_out":17}
{"sheet":"DATA BIAR","index":11,"n_rows":9,"n_cols":7,"rows_kept":9,"cut":false,"hidden":false,"merged":[[8,1,8,6],[1,1,1,6]]}
[]
[null,"GENERAL FUND - BUILDING AND INFRASTRUCTURE ASSET RENEWAL DATA"]
[null,{"$f":"INSTRUCTIONS!D5","v":"The Council of the Shire of Wakool"}]
[null,null,"2011-12                              GENERAL FUND  DATA                              $000",null,"2012-13                                 GENERAL FUND DATA                               $000",null,"2013-14                                   GENERAL FUND DATA                                  $000"]
[null,"# Building and Infrastructure Renewals",3789,null,4334,null,5061]
[]
[null,"# Depreciation, Amortisation and Impairment (Building and Infrastructure)",6530,null,5124,null,4837]
[]
{"$rows_left_out":2}
{"sheet":"DATA IB","index":12,"n_rows":12,"n_cols":4,"rows_kept":12,"cut":false,"hidden":false,"merged":[[9,1,9,3],[11,1,11,3],[1,1,1,4]]}
[]
[null,"GENERAL FUND - INFRASTRUCTURE BACKLOG DATA"]
[null,{"$f":"INSTRUCTIONS!D5","v":"The Council of the Shire of Wakool"}]
[null,null,null,"2013-14                                 GENERAL FUND DATA                                $000"]
[null,"# Estimated cost to bring assets to a satisfactory condition",null,43986]
[]
[null,"* Total (written down value) of infrastructure, buildings, other structures & depreciable land improvement assets.",null,159078]
[]
{"$rows_left_out":5}
{"sheet":"DATA AM","index":13,"n_rows":9,"n_cols":7,"rows_kept":9,"cut":false,"hidden":false,"merged":[[8,1,8,6]]}
[]
[null,"GENERAL FUND - ASSET MAINTENANCE DATA"]
[null,{"$f":"INSTRUCTIONS!D5","v":"The Council of the Shire of Wakool"}]
[null,null,"2011-12                                 GENERAL FUND DATA                                $000",null,"2012-13                                 GENERAL FUND DATA                                $000",null,"2013-14                                 GENERAL FUND DATA                                $000"]
[null,"# Actual Annual Maintenance",3193,null,2209,null,2463]
[]
[null,"# Required Annual Maintenance",3517,null,2230,null,2340]
[]
{"$rows_left_out":2}
{"sheet":"DATA DS","index":14,"n_rows":30,"n_cols":11,"rows_kept":30,"cut":false,"hidden":false,"merged":[[26,1,26,6],[28,1,28,6]]}
[]
[null,"GENERAL FUND - DEBT SERVICE DATA "]
[null,{"$f":"INSTRUCTIONS!D5","v":"The Council of the Shire of Wakool"}]
[null,null,"2011-12                             GENERAL FUND DATA            $000",null,"2012-13                                     GENERAL FUND DATA                   $000",null,"2013-14                            GENERAL FUND DATA                     $000"]
[null,"@ Financing Activities - Payments - Borrowings & Advances",545,null,536,null,711]
[]
[null,"* Interest Charges - Interest on Loans",206,null,163,null,240]
[]
{"$rows_left_out":23}
{"sheet":"DATA ROEPC","index":15,"n_rows":18,"n_cols":11,"rows_kept":18,"cut":false,"hidden":false,"merged":[[15,1,15,10]]}
[]
[null,"GENERAL FUND - REAL OPERATING EXPENDITURE PER CAPITA DATA "]
[null,{"$f":"INSTRUCTIONS!D5","v":"The Council of the Shire of Wakool"}]
[]
[null,"# Population Data ",{"$f":"IF(ISERROR(VLOOKUP(B3,POPULATION!B9:Y160,17,FALSE)),\"\",VLOOKUP(B3,POPULATION!B9:Y160,17,FALSE))","v":4174.5},null,{"$f":"IF(ISERROR(VLOOKUP(B3,POPULATION!B9:Y160,19,FALSE)),\"\",VLOOKUP(B3,POPULATION!B9:Y160,19,FALSE))","v":4106.5},null,{"$f":"IF(ISERROR(VLOOKUP(B3,POPULATION!B9:Y160,21,FALSE)),\"\",VLOOKUP(B3,POPULATION!B9:Y160,21,FALSE))","v":4055.5},null,{"$f":"IF(ISERROR(VLOOKUP(B3,POPULATION!B9:Y160,23,FALSE)),\"\",VLOOKUP(B3,POPULATION!B9:Y160,23,FALSE))","v":4008.5},null,{"$f":"IF(ISERROR(VLOOKUP(B3,POPULATION!B9:Y160,24,FALSE)),\"\",VLOOKUP(B3,POPULATION!B9:Y160,24,FALSE))","v":3979}]
[null,null,"2009-10                             GENERAL FUND DATA                    $000",null,"2010-11                               GENERAL FUND DATA                      $000",null,"2011-12                               GENERAL FUND DATA                        $000",null,"2012-13                                   GENERAL FUND DATA                 $000",null,"2013-14                             GENERAL FUND DATA                         $000"]
[null,"Note 21 -  Income Statement - Expenses - Total expenses from continuing operations ",20360,null,15569,null,{"$f":"'DATA OP'!C21","v":15307},null,{"$f":"'DATA OP'!E21","v":15503},null,{"$f":"'DATA OP'!G21","v":15059}]
[]
{"$rows_left_out":11}
{"sheet":"CALC OP","index":16,"n_rows":51,"n_cols":29,"rows_kept":51,"cut":false,"hidden":false,"merged":[[35,10,36,10],[40,8,41,8],[40,10,41,10],[46,8,47,8],[46,10,47,10],[50,1,50,11],[7,6,7,8],[8,6,8,8],[9,6,9,8],[18,9,18,11],[35,8,36,8],[15,9,17,11],[7,1,7,2],[30,1,30,9],[31,1,31,9],[35,11,36,11],[40,11,41,11],[46,11,47,11],[35,1,36,1],[40,1,41,1],[46,1,47,1]]}
[]
[null,"GENERAL FUND - OPERATING PERFORMANCE  RESULT"]
[null,{"$f":"INSTRUCTIONS!D5","v":"The Council of the Shire of Wakool"}]
[]
[null,"BENCHMARK AND RESULT"]
[null,"Benchmark:-","Greater or equal to break-even average over 3 years"]
[]
[null,null,null,"2011-12","2012-13","2013-14","Average over 3 years"]
{"$rows_left_out":44}
{"sheet":"CALC OSR","index":17,"n_rows":43,"n_cols":21,"rows_kept":43,"cut":false,"hidden":false,"merged":[[7,6,7,8],[8,6,8,8],[9,6,9,8],[34,8,35,8],[39,8,40,8],[42,1,42,9],[24,1,24,8],[25,1,25,8],[13,9,13,11],[15,9,15,11],[29,6,30,6],[34,6,35,6],[39,6,40,6],[29,8,30,8],[29,1,30,1],[34,1,35,1],[39,1,40,1],[29,9,30,9],[34,9,35,9],[39,9,40,9]]}
[]
[null,"GENERAL FUND - OWN SOURCE REVENUE RESULT"]
[null,{"$f":"INSTRUCTIONS!D5","v":"The Council of the Shire of Wakool"}]
[]
[null,"BENCHMARK AND RESULT"]
[null,"Benchmark:- ",null,"Greater than 60% average over 3 years"]
[]
[null,null,null,"2011-12","2012-13","2013-14","Average over 3 years"]
{"$rows_left_out":36}
{"sheet":"CALC BIAR","index":18,"n_rows":39,"n_cols":9,"rows_kept":39,"cut":false,"hidden":false,"merged":[[37,1,38,1],[34,4,35,4],[6,5,6,6],[7,5,7,6],[8,5,8,6],[37,4,38,4],[31,3,32,3],[34,3,35,3],[37,3,38,3],[31,4,32,4],[28,1,28,6],[29,1,29,7],[14,8,14,10],[1,1,1,7],[31,1,32,1],[34,1,35,1],[16,8,16,10]]}
[]
[null,"GENERAL FUND - BUILDING AND INFRASTRUCTURE ASSET RENEWAL RESULT"]
[null,{"$f":"INSTRUCTIONS!D5","v":"The Council of the Shire of Wakool"}]
[null,"BENCHMARK AND RESULT"]
[null,"Benchmark:-","Greater than 100% average over 3 years"]
[]
[null,null,"2011-12","2012-13","2013-14","Average over 3 years"]
[null,"Result",{"$f":"IF(ISERR('DATA BIAR'!C5/'DATA BIAR'!C7),\"\",'DATA BIAR'!C5/'DATA BIAR'!C7)","v":0.58024502297090352},{"$f":"IF(ISERR('DATA BIAR'!E5/'DATA BIAR'!E7),\"\",'DATA BIAR'!E5/'DATA BIAR'!E7)","v":0.8458235753317721},{"$f":"IF(ISERR('DATA BIAR'!G5/'DATA BIAR'!G7),\"\",'DATA BIAR'!G5/'DATA BIAR'!G7)","v":1.0463096960926195},{"$f":"IF(ISERR(AVERAGE(SUM(C32,C35,C38)/SUM(C33,C36,C39))),\"\",AVERAGE(SUM(C32,C35,C38)/SUM(C33,C36,C39)))","v":0.79946637559881151}]
{"$rows_left_out":32}
{"sheet":"CALC IB","index":19,"n_rows":32,"n_cols":7,"rows_kept":32,"cut":false,"hidden":false,"merged":[[27,1,27,8],[28,1,28,8],[30,1,31,1],[6,6,6,8],[7,5,7,7],[8,5,8,7],[15,6,15,8],[17,6,17,8],[30,3,31,3],[30,4,31,4]]}
[]
[null,"GENERAL FUND - INFRASTRUCTURE BACKLOG RESULT"]
[null,{"$f":"INSTRUCTIONS!D5","v":"The Council of the Shire of Wakool"}]
[null,"BENCHMARK AND RESULT"]
[null,"Benchmark:-","Less than 2%"]
[]
[null,null,"2013-14"]
[null,"Result",{"$f":"IF(ISERR('DATA IB'!D5/'DATA IB'!D7),\"\",'DATA IB'!D5/'DATA IB'!D7)","v":0.27650586504733526}]
{"$rows_left_out":25}
{"sheet":"CALC AM","index":20,"n_rows":39,"n_cols":10,"rows_kept":39,"cut":false,"hidden":false,"merged":[[15,9,15,11],[17,9,17,11],[31,4,32,4],[34,4,35,4],[37,4,38,4],[31,5,32,5],[34,5,35,5],[37,5,38,5],[31,1,32,1],[34,1,35,1],[37,1,38,1],[6,6,6,8],[7,6,7,8],[8,6,8,8],[28,1,28,4],[29,1,29,4]]}
[]
[null,"GENERAL FUND - ASSET MAINTENANCE RESULT"]
[null,{"$f":"INSTRUCTIONS!D5","v":"The Council of the Shire of Wakool"}]
[null,"BENCHMARK AND RESULT"]
[null,"Benchmark:-",null,"Greater than 100% average over 3 years"]
[]
[null,null,null,"2011-12","2012-13","2013-14","Average over 3 years"]
[null,"Result",null,{"$f":"IF(ISERR('DATA AM'!C5/'DATA AM'!C7),\"\",'DATA AM'!C5/'DATA AM'!C7)","v":0.90787603070798972},{"$f":"IF(ISERR('DATA AM'!E5/'DATA AM'!E7),\"\",'DATA AM'!E5/'DATA AM'!E7)","v":0.99058295964125564},{"$f":"IF(ISERR('DATA AM'!G5/'DATA AM'!G7),\"\",'DATA AM'!G5/'DATA AM'!G7)","v":1.0525641025641026},{"$f":"IF(ISERR(AVERAGE(SUM(D32,D35,D38)/SUM(D33,D36,D39))),\"\",AVERAGE(SUM(D32,D35,D38)/SUM(D33,D36,D39)))","v":0.97254853468529734}]
{"$rows_left_out":32}
{"sheet":"CALC DS","index":21,"n_rows":46,"n_cols":19,"rows_kept":46,"cut":false,"hidden":false,"merged":[[45,1,45,9],[32,1,33,1],[37,1,38,1],[6,7,6,9],[7,7,7,9],[8,7,8,9],[9,7,9,9],[37,8,38,8],[32,9,33,9],[37,9,38,9],[32,8,33,8],[42,1,43,1],[12,10,13,12],[15,10,15,12],[42,2,42,5],[37,2,37,5],[32,2,32,5],[27,1,27,9],[28,1,28,9],[42,8,43,8],[42,9,43,9],[32,6,33,6],[37,6,38,6],[42,6,43,6]]}
[]
[null,"GENERAL FUND - DEBT SERVICE RESULT"]
[null,{"$f":"INSTRUCTIONS!D5","v":"The Council of the Shire of Wakool"}]
[null,"BENCHMARK AND RESULT"]
[null,"Benchmark:-",null,"Greater than 0 and less than or equal to 20% average over 3 years"]
[]
[null,null,null,null,"2011-12","2012-13","2013-14","Average over 3 years"]
[null,"Result",null,null,{"$f":"IF(ISERR(SUM('DATA DS'!C5+'DATA DS'!C7)/SUM('DATA DS'!C9-'DATA DS'!C11-'DATA DS'!C13-'DATA DS'!C15-'DATA DS'!C17-'DATA DS'!C19-'DATA DS'!C21)),\"\",(SUM('DATA DS'!C5+'DATA DS'!C7)/SUM('DATA DS'!C9-'DATA DS'!C11-'DATA DS'!C13-'DATA DS'!C15-'DATA DS'!C17-'DATA DS'!C19-'DATA DS'!C21)))","v":5.7358894065531199E-2},{"$f":"IF(ISERR(SUM('DATA DS'!E5+'DATA DS'!E7)/SUM('DATA DS'!E9-'DATA DS'!E11-'DATA DS'!E13-'DATA DS'!E15-'DATA DS'!E17-'DATA DS'!E19-'DATA DS'!E21)),\"\",SUM('DATA DS'!E5+'DATA DS'!E7)/SUM('DATA DS'!E9-'DATA DS'!E11-'DATA DS'!E13-'DATA DS'!E15-'DATA DS'!E17-'DATA DS'!E19-'DATA DS'!E21))","v":4.3543262941506261E-2},{"$f":"IF(ISERR(SUM('DATA DS'!E5+'DATA DS'!E7)/SUM('DATA DS'!E9-'DATA DS'!E11-'DATA DS'!E13-'DATA DS'!E15-'DATA DS'!E17-'DATA DS'!E19-'DATA DS'!E21)),\"\",SUM('DATA DS'!G5+'DATA DS'!G7)/SUM('DATA DS'!G9-'DATA DS'!G11-'DATA DS'!G13-'DATA DS'!G15-'DATA DS'!G17-'DATA DS'!G19-'DATA DS'!G21))","v":7.0617063934061045E-2},{"$f":"IF(ISERR(AVERAGE(SUM(H33,H38,H43)/SUM(H34,H39,H44))),\"\",AVERAGE(SUM(H33,H38,H43)/SUM(H34,H39,H44)))","v":5.6344308075000585E-2}]
{"$rows_left_out":39}
{"sheet":"CALC ROEPC","index":22,"n_rows":58,"n_cols":13,"rows_kept":58,"cut":false,"hidden":false,"merged":[[1,1,1,8],[12,10,12,12],[34,7,35,7],[39,7,40,7],[44,7,45,7],[14,10,14,12],[34,8,35,8],[39,8,40,8],[44,8,45,8],[44,1,45,1],[44,5,45,5],[49,5,50,5],[54,8,55,8],[49,7,50,7],[57,1,57,8],[28,3,29,3],[28,6,29,6],[28,1,29,2],[34,5,35,5],[39,5,40,5],[34,1,35,1],[39,1,40,1],[49,1,50,1],[54,1,55,1],[49,8,50,8],[54,7,55,7],[54,5,55,5]]}
[]
[null,"GENERAL FUND - REAL OPERATING EXPENDITURE PER CAPITA RESULT"]
[null,{"$f":"INSTRUCTIONS!D5","v":"The Council of the Shire of Wakool"}]
[null,"BENCHMARK AND RESULT"]
[null,"Benchmark:-","A decrease in Real Operating Expenditure per capita over time "]
[]
[null,null,"2009-10","2010-11","2011-12","2012-13","2013-14"]
[null,"Result",{"$f":"IF(ISERROR(SUM('DATA ROEPC'!C7-'DATA ROEPC'!C9-'DATA ROEPC'!C11-'DATA ROEPC'!C13)*(1-E30)/'DATA ROEPC'!C5),\"\",SUM('DATA ROEPC'!C7-'DATA ROEPC'!C9-'DATA ROEPC'!C11-'DATA ROEPC'!C13)*(1-E30)/'DATA ROEPC'!C5)","v":3.0001588214157384},{"$f":"IF(ISERROR(SUM('DATA ROEPC'!E7-'DATA ROEPC'!E9-'DATA ROEPC'!E11-'DATA ROEPC'!E13)*(1-E30)*(1-F30)/'DATA ROEPC'!E5),\"\",SUM('DATA ROEPC'!E7-'DATA ROEPC'!E9-'DATA ROEPC'!E11-'DATA ROEPC'!E13)*(1-E30)*(1-F30)/'DATA ROEPC'!E5)","v":3.5050567928893215},{"$f":"IF(ISERROR(SUM('DATA ROEPC'!G7-'DATA ROEPC'!G9-'DATA ROEPC'!G11-'DATA ROEPC'!G13)*(1-E30)*(1-F30)*(1-H30)/'DATA ROEPC'!G5),\"\",SUM('DATA ROEPC'!G7-'DATA ROEPC'!G9-'DATA ROEPC'!G11-'DATA ROEPC'!G13)*(1-E30)*(1-F30)*(1-H30)/'DATA ROEPC'!G5)","v":3.4218070257181599},{"$f":"(IF(ISERROR(SUM('DATA ROEPC'!I7-'DATA ROEPC'!I9-'DATA ROEPC'!I11-'DATA ROEPC'!I13)*(1-E30)*(1-F30)*(1-H30)*(1-I30)/'DATA ROEPC'!I5),\"\",SUM('DATA ROEPC'!I7-'DATA ROEPC'!I9-'DATA ROEPC'!I11-'DATA ROEPC'!I13)*(1-E30)*(1-F30)*(1-H30)*(1-I30)/'DATA ROEPC'!I5))","v":3.4343853093055756},{"$f":"IF(ISERROR(SUM('DATA ROEPC'!I7-'DATA ROEPC'!I9-'DATA ROEPC'!I11-'DATA ROEPC'!I13)*(1-E30)*(1-F30)*(1-H30)*(1-I30)*(1-J30)/'DATA ROEPC'!I5),\"\",SUM('DATA ROEPC'!I7-'DATA ROEPC'!I9-'DATA ROEPC'!I11-'DATA ROEPC'!I13)*(1-E30)*(1-F30)*(1-H30)*(1-I30)*(1-J30)/'DATA ROEPC'!I5)","v":3.3073130528612693}]
{"$rows_left_out":51}
{"sheet":"RESULTS","index":23,"n_rows":26,"n_cols":14,"rows_kept":26,"cut":false,"hidden":false,"merged":[[11,4,11,10],[19,4,19,10],[9,4,9,10]]}
[]
[]
[]
[null,null,null,null,null,null,null,"Criteria Results"]
[]
[]
[]
[null,null,{"$f":"INSTRUCTIONS!D5","v":"The Council of the Shire of Wakool"}]
{"$rows_left_out":19}
{"sheet":"POPULATION","index":24,"n_rows":164,"n_cols":30,"rows_kept":164,"cut":false,"hidden":true,"merged":[]}
["Australian Bureau of Statistics",null,2,3,4,5,6,7,8,9,10,11,12,13,14,15,16,17,18,19,20,21,22,23,24]
["3218.0  Regional Population Growth, Australia",null,null,null,null,null,"Released 3.4.2014"]
["Table 1. Estimated Resident Population, Local Government Areas, New South Wales"]
[]
[null,null,null,3,null,null,null,null,null,null,null,null,null,null,null,null,null,null,null,null,null,null,null,null,null,"Change"]
[null,null,null,2003,2004,"average population 2003-04",2005,"average population 2004-05",2006,"average population 2005-06",2007,"average population 2006-07",2008,"average population 2007-08",2009,"average population 2008-09",2010,"average population 2009-10",2011,"average population 2010-11","2012r","average population 2011-12","2013p","average population 2012-13","2013-14","2012r-2013p",null,null,"Area","Population density 2013"]
["LGA code","Local Government Area",null,"no.","no.",null,"no.",null,"no.",null,"no.",null,"no.",null,"no.",null,"no.",null,"no.",null,"no.",null,"no.",null,"2013 data","%","no.",null,"km2","persons/km2"]
[null,"Select your Council",2,3,4,5,6,7,8,9,10,11,12,13,14,15,16,17,18,19,20,21,22,23,24]
{"$rows_left_out":157}
{"sheet":"Sheet1","index":25,"n_rows":0,"n_cols":0,"rows_kept":0,"cut":false,"hidden":true,"merged":[]}

{"sheet":"Sheet2","index":26,"n_rows":0,"n_cols":0,"rows_kept":0,"cut":false,"hidden":false,"merged":[]}