{"text_format":"1","workbook":"xlsx","n_sheets":14,"sheets":["Examples","Export","WK0 - Input data","Analysis","Instructions","WK1 - Identification","WK2 - Notional General Income","WK3 - Notional GI Yr1 YIELD","WK4 - PGI summary","WK5a - Impact on Rates","WK6 - Expenditure Program","WK7 - Financials","WK8 - LTFP","WK9 - Ratios"],"not_rendered":{"charts":15,"images":1,"macros":1,"external_links":1,"defined_names":23,"comments":4,"pivot_tables":0},"unopened":[],"bounds":{"document_bytes":16777216,"sheet_cells":100000,"rows_first":2000,"rows_last":500,"rows_between":2000,"halvings":0,"cell_chars":16384,"cell_head_chars":4096},"cells_cut":0,"cells_raw":0,"read":"whole","date_system":"1900"}

{"sheet":"Examples","index":0,"n_rows":42,"n_cols":27,"rows_kept":42,"cut":false,"hidden":true,"merged":[]}
[]
[null,"IPART colour codes for models, spreadsheets and information requests"]
[null,"NB  ALWAYS DESCRIBE THE COLOUR CODE USED IN YOUR MODEL "]
[null,"Note: If you use the formats for the inputs provided in this template, input cells will always be unprotected even when you protect the worksheet"]
[null,null,null,null,null,null,null,"use this column cell to \"paint\" input cells for numbers (NOT for percentages)"]
[null,null,null,null,null,null,null,null,"use this column cell to \"paint\" input cells for percentages (NOT numbers)"]
[null,"Models and spreadsheets"]
[null,null,null,null,null,null,"numbers","%"]
[null,"Inputs",null,null,null,null,4232,0.08]
[null,"Inputs with default values, default values are shown in italics next to or below ",null,null,null,null,34345,0.08]
[null,"Hard-coded values used that should not be changed, eg credit ratings or '1' at the start of an index series."]
[null,"Key outputs"]
[null,"Links from other files (green)"]
[null,"Error check (check =0)"]
[null,"Error warnings, messages and unusual calculation assumptions"]
{"$rows_left_out":28}
{"sheet":"Export","index":1,"n_rows":289,"n_cols":19,"rows_kept":289,"cut":false,"hidden":true,"merged":[]}
["WK1","THIS WORKSHEET IS TO BE HIDDEN BEFORE PUBLICATION"]
[null,null,{"$f":"'WK1 - Identification'!C13","v":"Council Name:"},null,{"$f":"'WK1 - Identification'!E13","v":"City of Parramatta Council"},null,null,null,{"$f":"'WK1 - Identification'!I13","v":"If your councils' name is not in the list, please enter it in cell E14"}]
[null,null,{"$f":"'WK1 - Identification'!C14","v":"Council Name if not listed:"},null,{"$f":"'WK1 - Identification'!E14","v":0}]
[]
[null,null,{"$f":"'WK1 - Identification'!C16","v":"Contact Details:"},null,{"$f":"'WK1 - Identification'!E16","v":0}]
[null,null,{"$f":"'WK1 - Identification'!C17","v":"  Name:"},null,{"$f":"'WK1 - Identification'!E17","v":"Todd Cowan"}]
[null,null,{"$f":"'WK1 - Identification'!C18","v":"  Position:"},null,{"$f":"'WK1 - Identification'!E18","v":"Rates & Receivables Manager"}]
[null,null,{"$f":"'WK1 - Identification'!C19","v":" Telephone:"},null,{"$f":"'WK1 - Identification'!E19","v":0}]
[null,null,{"$f":"'WK1 - Identification'!C20","v":"  Email:"},null,{"$f":"'WK1 - Identification'!E20","v":0}]
[]
[]
[null,null,{"$f":"'WK1 - Identification'!C23","v":"A. Existing special variations (SVs)"},null,null,null,null,null,null,null,null,null,null,null,null,null,null,null,{"$f":"'WK1 - Identification'!S23","v":"DO NOT DELETE"}]
[null,null,{"$f":"'WK1 - Identification'!C24","v":"1. Does the council have any existing SV(s) that means it has an increase above the rate peg for any year from 2022-23 (Year 1) onwards?"},null,null,null,null,null,null,null,{"$f":"'WK1 - Identification'!K24","v":"no"},null,null,null,null,null,null,null,{"$f":"'WK1 - Identification'!S24","v":2}]
[]
[null,null,{"$f":"'WK1 - Identification'!C26","v":"B. Council's Notional General Income"}]
{"$rows_left_out":275}
{"sheet":"WK0 - Input data","index":2,"n_rows":405,"n_cols":18,"rows_kept":405,"cut":false,"hidden":true,"merged":[]}
["Hide sheet before publishing"]
[null,"This worksheet is for IPART Analyst use only. "]
[]
[]
[null,"Instructions:"]
[null,{"$f":"\"1. Enter the required information in the blue input cells in Section \"&B23","v":"1. Enter the required information in the blue input cells in Section 1. Inputs"}]
[null,{"$f":"\"2. Check the list of council names and update if necessary in Section \"&B67","v":"2. Check the list of council names and update if necessary in Section 2. Council Name"}]
[]
[]
[null,"Contents",null,null,null,null,null,null,null,"row"]
[null,{"$f":"B23","v":"1. Inputs"},null,null,null,null,null,null,null,{"$f":"ROW(B23)","v":23}]
[null,{"$f":"B26","v":"Table 1 - Analyst and TSO details"},null,null,null,null,null,null,null,{"$f":"ROW(B26)","v":26}]
[null,{"$f":"B42","v":"Table 2 - SV year and rate peg"},null,null,null,null,null,null,null,{"$f":"ROW(B42)","v":42}]
[null,{"$f":"B52","v":"Table 3 - SV year, rate peg  and units in display format "},null,null,null,null,null,null,null,{"$f":"ROW(B52)","v":52}]
[null,{"$f":"B67","v":"2. Council Name"},null,null,null,null,null,null,null,{"$f":"ROW(B67)","v":67}]
{"$rows_left_out":391}
{"sheet":"Analysis","index":3,"n_rows":38,"n_cols":11,"rows_kept":38,"cut":false,"hidden":true,"merged":[]}
["WORKSHEET TO BE HIDDEN - NOT TO BE INCLUDED IN PUBLICATION"]
[null,"ANALYSIS WORKSHEET"]
[null,"NB: The benchmarks I've used here are dummy values set to be the same as the ones in the OLG guidelines.  They can be changed to wherever we land."]
[]
[1,{"$f":"\"Table \"&A5&\" - Demonstration of financial need (first criteria for temporary and permanent applications)\"","v":"Table 1 - Demonstration of financial need (first criteria for temporary and permanent applications)"}]
[]
[null,"Unrestricted current ratio benchmark",null,1.5]
[]
[{"$f":"A5+1","v":2},{"$f":"\"Table \"&A9&\" - Demonstration of financial need (second criteria for permanent applications only)\"","v":"Table 2 - Demonstration of financial need (second criteria for permanent applications only)"}]
[]
[]
[null,"Average OPR benchmark",null,0.02]
[]
[null,null,null,null,null,{"$f":"'WK8 - LTFP'!F17","v":"Year 0"},{"$f":"'WK8 - LTFP'!G17","v":"Year 1"},{"$f":"'WK8 - LTFP'!H17","v":"Year 2"},{"$f":"'WK8 - LTFP'!I17","v":"Year 3"},{"$f":"'WK8 - LTFP'!J17","v":"Year 4"},{"$f":"'WK8 - LTFP'!K17","v":"Year 5"}]
[null,null,null,null,null,{"$f":"'WK8 - LTFP'!F18","v":"2021-22"},{"$f":"'WK8 - LTFP'!G18","v":"2022-23"},{"$f":"'WK8 - LTFP'!H18","v":"2023-24"},{"$f":"'WK8 - LTFP'!I18","v":"2024-25"},{"$f":"'WK8 - LTFP'!J18","v":"2025-26"},{"$f":"'WK8 - LTFP'!K18","v":"2026-27"}]
{"$rows_left_out":24}
{"sheet":"Instructions","index":4,"n_rows":138,"n_cols":17,"rows_kept":138,"cut":false,"hidden":false,"merged":[[28,2,29,12],[27,2,27,12],[137,2,137,12],[134,2,134,12]]}
[]
[]
[]
[]
[]
[null,null,null,null,null,null,null,"  THE INDEPENDENT PRICING AND REGULATORY TRIBUNAL OF NSW"]
[]
[null,null,null,null,null,null,null,"APPLICATION FOR A ADDITIONAL SPECIAL VARIATION "]
[null,null,null,null,null,null,null,"2022-23"]
[null,null,null,null,null,null,null,"TO GENERAL INCOME"]
[null,null,null,null,null,null,null,"under section 508(2) of the Local Government Act 1993"]
[null,null,null,null,null,null,null,"and Office of Local Government circular 22-07 / 6 April 2022 / A815377"]
[]
[null,null,null,null,null,null,null,"SECTION 508(2) APPLICATION FORM"]
[null,null,null,null,null,null,null,{"$f":"'WK0 - Input data'!$D$45","v":"2022-23"}]
{"$rows_left_out":124}
{"sheet":"WK1 - Identification","index":5,"n_rows":81,"n_cols":19,"rows_kept":81,"cut":false,"hidden":false,"merged":[]}
[]
[]
[null,null,null,null,"             APPLICATION FOR ADDITIONAL SPECIAL VARIATION TO GENERAL INCOME        ",null,null,null,null,null,null,null,{"$f":"'WK0 - Input data'!$D$45","v":"2022-23"}]
[]
[null,null,null,null,null,"WORKSHEET 1"]
[]
[null,null,null,"Step 1: Fill out council details"]
[null,null,null,"Step 2: Fill out any existing variation information"]
[null,null,null,"Step 3: Fill out crown land adjustments, catch up & excess, valuation objections"]
[null,null,null,"Step 4: Fill out proposed special variation amounts"]
[null,null,"                                                                                                          All dollars in nominal terms "]
[]
[null,null,"Council Name:",null,"City of Parramatta Council",null,null,null,{"$f":"\"If your councils' name is not in the list, please enter it in cell E\"&ROW(C14)","v":"If your councils' name is not in the list, please enter it in cell E14"}]
[null,null,"Council Name if not listed:"]
[]
{"$rows_left_out":67}
{"sheet":"WK2 - Notional General Income","index":6,"n_rows":163,"n_cols":13,"rows_kept":163,"cut":false,"hidden":true,"merged":[]}
[]
[]
[null,null,{"$f":"IF(ISBLANK('WK1 - Identification'!$E$13),'WK1 - Identification'!$E$14,'WK1 - Identification'!$E$13)","v":"City of Parramatta Council"}]
[]
[null,null,null,null,null,null,null,"WORKSHEET 2"]
[]
[null,null,null,null,null,null,null,{"$f":"\"CALCULATION OF NOTIONAL GENERAL INCOME \"&'WK0 - Input data'!$F$58","v":"CALCULATION OF NOTIONAL GENERAL INCOME 2021-22"}]
[null,null,null,null,null,null,null,"Applicable to the first year of the application"]
[]
[null,null,null,null,null,null,null,"All dollars in nominal terms "]
[null,null,null,null,null,null,null,"This worksheet must reflect the rating structure levied in the previous year "]
[null,null,null,null,{"$f":"\"NOTE: Valuations used here are to be taken from Council's valuation list on 1 July \"&'WK0 - Input data'!$F$57&\" and are to include:\"","v":"NOTE: Valuations used here are to be taken from Council's valuation list on 1 July 2021 and are to include:"}]
[null,null,null,null,"(i) supplementaries having the same base date and furnished to Council during that year, and"]
[null,null,null,null,"(ii) estimates of increases in valuations provided to the Council under section 513."]
[]
{"$rows_left_out":149}
{"sheet":"WK3 - Notional GI Yr1 YIELD","index":7,"n_rows":168,"n_cols":13,"rows_kept":168,"cut":false,"hidden":true,"merged":[]}
[]
[]
[null,null,{"$f":"'WK2 - Notional General Income'!$C$3","v":"City of Parramatta Council"}]
[]
[null,null,null,null,null,null,null,"WORKSHEET 3"]
[]
[null,null,null,null,null,null,null,{"$f":"\"CALCULATION OF NOTIONAL GENERAL INCOME \"&'WK0 - Input data'!$G$58","v":"CALCULATION OF NOTIONAL GENERAL INCOME 2022-23"}]
[]
[null,null,null,null,null,null,null,"All dollars in nominal terms "]
[]
[null,null,null,null,null,null,null,"This worksheet must contain the rating structure proposed for the first year of the special variation application. "]
[null,null,null,null,null,null,null,"Note: A rating structure that does not comply with the legislation may not be approved.  It is Council's responsibility to check its rating structure with OLG before submission to IPART."]
[]
[null,null,null,null,null,null,null,"Calculation of Notional General Income - Ordinary Rates"]
[]
{"$rows_left_out":154}
{"sheet":"WK4 - PGI summary","index":8,"n_rows":107,"n_cols":17,"rows_kept":107,"cut":false,"hidden":false,"merged":[]}
[]
[]
[null,null,{"$f":"'WK2 - Notional General Income'!$C$3","v":"City of Parramatta Council"}]
[]
[null,null,null,null,"WORKSHEET 4"]
[]
[null,null,null,null,{"$f":"\"PERMISSIBLE GENERAL INCOME SUMMARY FOR \"&'WK0 - Input data'!$D$45","v":"PERMISSIBLE GENERAL INCOME SUMMARY FOR 2022-23"}]
[null,null,null,null,"  All dollars in nominal terms"]
[null,null,null,null,"Please check all income adjustments and expiring variation amounts with OLG"]
[null,null,null,null,"before submitting the application.",null,null,null,null,"check = 0"]
[null,null,"Prior year Notional General Income",null,null,null,null,{"$f":"'WK1 - Identification'!$K$27","v":159982939},null,{"$f":"IF(H11=0,0,H11-G45)","v":0}]
[null,null,"Less:","Expiry of a prior special variation",null,null,null,{"$f":"'WK1 - Identification'!F80","v":0},null,{"$f":"IF(H12=0,0,H12-G46)","v":0}]
[]
[null,null,"Adjusted first year Notional General Income",null,null,null,"$",{"$f":"H11-H12","v":159982939}]
[]
{"$rows_left_out":93}
{"sheet":"WK5a - Impact on Rates","index":9,"n_rows":450,"n_cols":49,"rows_kept":450,"cut":false,"hidden":true,"merged":[]}
[]
[]
[null,null,{"$f":"'WK2 - Notional General Income'!$C$3","v":"City of Parramatta Council"}]
[]
[null,null,null,null,null,"WORKSHEET 5a"]
[]
[null,null,null,null,null,"IMPACT ON MINIMUM RATES, AVERAGE RATES AND OTHER CHARGES"]
[null,null,null,null,null,"  All dollars in nominal terms"]
[]
[null,null,null,"    The aim of this sheet is to show the minimum rate increase (if applicable), the average rate increase per sub-category"]
[null,null,null,"    (inclusive of all relevant rates) and the proposed annual charges in each year of the proposed special variation."]
[null,null,null,"    It also aims to compare average rates with and without the proposed special variation."]
[null,null,null,"    All ordinary rates and special rates need to be included."]
[null,null,null,"Note: rate estimates should reflect expected minimum or average rates, inclusive of any expiring variations."]
[]
{"$rows_left_out":436}
{"sheet":"WK6 - Expenditure Program","index":10,"n_rows":155,"n_cols":22,"rows_kept":155,"cut":false,"hidden":true,"merged":[]}
[]
[]
[null,null,{"$f":"'WK2 - Notional General Income'!$C$3","v":"City of Parramatta Council"}]
[]
[null,null,null,null,null,null,null,null,null,"WORKSHEET 6"]
[]
[null,null,null,null,null,null,null,null,null,"PROPOSED ADDITIONAL SPECIAL VARIATION INCOME AND EXPENDITURE"]
[null,null,null,null,null,null,null,null,null,"      All dollars in nominal terms"]
[]
[null,null,null,null,null,null,"This sheet shows how the council proposes to use the additional income from the special variation."]
[null,null,null,null,null,null,{"$f":"\"Enter the proposed spending over \"&IF($G$18='WK0 - Input data'!$B$243,10,G19)&\" years under each of the headings as relevant.\"","v":"Enter the proposed spending over 10 years under each of the headings as relevant."}]
[]
[null,null,null,null,null,null,"For additional SV income in years beyond the period of the proposed special variation, we increase the income after the final year"]
[null,null,null,null,null,null,"of the variation by the assumed rate peg of 2.5% in each of the future years. i.e. multiply by 1.025 each year."]
[]
{"$rows_left_out":141}
{"sheet":"WK7 - Financials","index":11,"n_rows":29,"n_cols":22,"rows_kept":29,"cut":false,"hidden":true,"merged":[[12,2,12,7],[11,2,11,7]]}
[]
[]
[null,null,{"$f":"'WK2 - Notional General Income'!$C$3","v":"City of Parramatta Council"}]
[]
[null,null,null,"WORKSHEET 7"]
[]
[null,null,null,"FINANCIAL INFORMATION"]
[null,null,null,"      All dollars in nominal terms ($'000)"]
[]
[null,null,null,"This sheet captures the council's cash flow position as reported in its financial statements."]
[null,null,null,"Sources:  Notes to financial statements and Council's Long Term Financial Plan (LTFP)."]
[null,null,"See: Office of Local Government, Local Government code of accounting practice and financial reporting 2020-21, Section C1-3 - Restricted cash, cash equivalents and investments, p. 42 & Section G6-2, commentary 6, p103."]
[null,null,{"$f":"IF(H29>Analysis!D7,V23,\"\")","v":""}]
[]
[null,null,"Balance sheet extract (General fund) ",null,null,"$'000 nominal"]
{"$rows_left_out":15}
{"sheet":"WK8 - LTFP","index":12,"n_rows":122,"n_cols":15,"rows_kept":122,"cut":false,"hidden":false,"merged":[[14,2,14,14]]}
[]
[]
[null,null,{"$f":"'WK2 - Notional General Income'!$C$3","v":"City of Parramatta Council"}]
[]
[null,null,null,null,null,null,null,"WORKSHEET 8"]
[null,null,null,null,null,null,null,"This worksheet only needs to completed for permanent SV applications"]
[null,null,null,null,null,null,null,"LONG TERM FINANCIAL PLAN "]
[null,null,null,null,null,null,null,"      All dollars in nominal terms"]
[]
[null,null,null,"This sheet shows the forecast general fund operating position in the council's Long Term Financial Plan."]
[null,null,null,"Enter the figures from the 2021-22 Long Term Financial Plan over 5 years under each of the headings as relevant.  Add rows if necessary."]
[]
[]
[]
[null,null,{"$f":"CHOOSE(Analysis!E32,Analysis!B37,Analysis!B38)","v":"Council has a forecast mean OPR above 2.0% over the next 5-years (2022-23 to 2026-27).  You will need to provide additional information to demonstrate financial need.  Please see our information paper for more information."}]
{"$rows_left_out":108}
{"sheet":"WK9 - Ratios","index":13,"n_rows":81,"n_cols":23,"rows_kept":81,"cut":false,"hidden":true,"merged":[]}
[]
[]
[null,null,{"$f":"'WK2 - Notional General Income'!$C$3","v":"City of Parramatta Council"}]
[]
[null,null,null,null,null,"WORKSHEET 9"]
[]
[null,null,null,null,null,"FINANCIAL RATIOS"]
[]
[null,null,null,null,null,"This worksheet captures financial ratios for three historical years as well as the current and forecast years (0 to 10)"]
[null,null,null,null,null,"The historical ratios are calculated from information provided in Worksheet 7 and two of the forecast ratios are calculated from information entered in Worksheet 8."]
[null,null,null,null,null,"Please enter the forecast financial ratios in the blue input cells"]
[null,null,null,null,null,{"$f":"\"Enter the two compusory ratios (\"&C33&\" and \"&C39&\")\"","v":"Enter the two compusory ratios (Infrastructure Renewals Ratio and Infrastructure Backlog Ratio)"}]
[null,null,null,null,null,"Enter the two optional ratios (Asset Maintenance Ratio and Debt Service Ratio) only if they are relevant to your Council's application, otherwise leave blank. "]
[]
[null,null,null,null,null,null,null,"Historical ratios",null,null,null,null,null,"Forecast ratios"]
{"$rows_left_out":66}