{"text_format":"1","workbook":"xlsx","n_sheets":9,"sheets":["Examples","QA Scope","QA log","timing","Rate Peg","Names","ABS pop T1","Supp val","Pop calcs"],"not_rendered":{"charts":15,"images":0,"macros":0,"external_links":0,"defined_names":6,"comments":1,"pivot_tables":0},"unopened":[],"bounds":{"document_bytes":16777216,"sheet_cells":100000,"rows_first":2000,"rows_last":500,"rows_between":2000,"halvings":0,"cell_chars":16384,"cell_head_chars":4096},"cells_cut":0,"cells_raw":0,"read":"whole","date_system":"1900"}

{"sheet":"Examples","index":0,"n_rows":42,"n_cols":27,"rows_kept":42,"cut":false,"hidden":true,"merged":[]}
[]
[null,"IPART colour codes for models, spreadsheets and information requests"]
[null,"NB  ALWAYS DESCRIBE THE COLOUR CODE USED IN YOUR MODEL "]
[null,"Note: If you use the formats for the inputs provided in this template, input cells will always be unprotected even when you protect the worksheet"]
[null,null,null,null,null,null,null,"use this column cell to \"paint\" input cells for numbers (NOT for percentages)"]
[null,null,null,null,null,null,null,null,"use this column cell to \"paint\" input cells for percentages (NOT numbers)"]
[null,"Models and spreadsheets"]
[null,null,null,null,null,null,"numbers","%"]
[null,"Inputs",null,null,null,null,4232,0.08]
[null,"Inputs with default values, default values are shown in italics next to or below ",null,null,null,null,34345,0.08]
[null,"Hard-coded values used that should not be changed, eg credit ratings or '1' at the start of an index series."]
[null,"Key outputs"]
[null,"Links from other files (green)"]
[null,"Error check (check =0)"]
[null,"Error warnings, messages and unusual calculation assumptions"]
[null,"Indicate change in formula across row with a double red line"]
[null,"Note:  You can combine options for inputs, eg:",null,null,"Inputs can be links to other files "]
[null,null,null,null,"You can drawn attention to unusual inputs "]
[]
[null,null,null,null,null,null,null,"use this column cell to \"paint\" input cells for numbers (NOT for percentages)"]
{"$rows_left_out":23}
{"sheet":"QA Scope","index":1,"n_rows":106,"n_cols":9,"rows_kept":106,"cut":false,"hidden":true,"merged":[]}
[]
[null,"Review that the QA is for"]
[null,"Name of model",null,null,{"$f":"#REF!","v":{"$error":"#REF!"}}]
[null,"File name(s):  "]
[]
[]
[]
[null,"Name of modeller"]
[null,"Planned date of QA:"]
[null,"Risk rating for the review:"]
[null,"Note: low risk models do not require independent QA, however the modeller should indicate in section 2.3 what steps have been taken to ensure accuracy of results."]
[]
[null,"1. PURPOSE OF MODEL"]
[null,"The modeller provides a concise summary of the model's purpose(s)"]
[null,"Calculates the rate peg and population factors. For more information see 'Overview & instructions' worksheet"]
[]
[]
[]
[]
[]
{"$rows_left_out":87}
{"sheet":"QA log","index":2,"n_rows":36,"n_cols":14,"rows_kept":36,"cut":false,"hidden":true,"merged":[]}
[]
[null,"DETAILS OF ISSUES FOUND IN THE QA "]
[null,"Item no.","Date checked (Month and Year)","QAed by","What is the issue?","Category","Where in model? ","Where … continued (optional)","Responses by industry team /model developer (industry team should prioritise red cells, i.e. calculation or data errors)","QA signoff"]
[null,null,"Required only if QA is staggered over along period","required only if there is more than one QAer",null,"Select the type of issue from the drop-down box (see notes in column N)","e.g. worksheet(s),  and rows/columns, or table numbers. May refer to highlighted areas in worksheet(s)","Optional 2nd column, e.g. with cell reference area in (or link to) relevant worksheet","Changed / not changed & reason",null,null,null,"Categories for drop-down box.  DO NOT DELETE","Notes on when to use the categories"]
[null,1,null,null,null,"Calculation or data error",null,null,null,null,null,null,"Calculation or data error","The formula logical is flawed, contains a cell reference error or contains another error (e.g. bracket is in the wrong place), or there is a data input problem"]
[null,{"$f":"B5+1","v":2},null,null,null,"Documentation, formatting or structure",null,null,null,null,null,null,"Documentation, formatting or structure","Model is not structured efficiently, not consistent with IPART colour coding and formatting, or there is a labelling issue"]
[null,{"$f":"B6+1","v":3}]
[null,4]
[null,5]
[null,6]
[null,7]
[null,8]
[null,9]
[null,10]
[null,11]
[null,12]
[null,13]
[null,14]
[null,15]
[null,16]
{"$rows_left_out":17}
{"sheet":"timing","index":3,"n_rows":19,"n_cols":13,"rows_kept":19,"cut":false,"hidden":true,"merged":[]}
[]
[]
[null,"Timing for population factor"]
[]
[null,"Rate peg on 1 July ",null,null,2022,{"$f":"E5+1","v":2023},2024,2025,2026,2027,2028,2029]
[null,"FY",null,null,{"$f":"E5&\"-\"&RIGHT(F5,2)","v":"2022-23"},"2023-24","2024-25","2025-26","2026-27","2027-28","2028-29"]
[]
[null,"ABS release dates"]
[null,"Regional population, 2019-20","March 2021",null,"to 30 June 2020"]
[null,"Regional population, 2020-21","March 2022",null,null,"to June 2021","Initial census release date Oct 2022 - updated 2020-21 ERP?"]
[null,"Census - 2021-22","early to mid 2023",null,null,null,"as at Aug 2021",null,null,null,null,null,"https://www.abs.gov.au/census/2021-data-releases"]
[null,"Regional population, 2022-23","March 2024",null,null,null,null,"to June 2023"]
[null,"Regional population, 2023-24","March 2025",null,null,null,null,null,"to June 2024"]
[null,"Regional population, 2024-25","March 2026",null,null,null,null,null,null,"to June 2025"]
[null,"Regional population, 2025-26","March 2027",null,null,null,null,null,null,null,"to June 2026"]
[]
[]
[]
[null,"Supp val for year",null,null,"2019-20","2020-21","2021-22","2022-23","2023-24","2024-25","2025-26"]

{"sheet":"Rate Peg","index":4,"n_rows":141,"n_cols":8,"rows_kept":141,"cut":false,"hidden":false,"merged":[]}
[]
[null,"Population factors and final Rate Peg for 2022-23"]
[]
[null,"Rate peg before population factor ",null,7.0000000000000001E-3]
[null,"Rate peg from 1 July",null,2022]
[]
[]
[]
[]
[]
[]
[]
[null,{"$f":"'Supp val'!B7","v":"Org. Id"},"Council","Change in population ","Supplementary valuations percentage",null,"Population factor","Rate Peg (including population factor)"]
[null,{"$f":"Names!I7","v":2047},{"$f":"Names!F7","v":"Albury "},{"$f":"IF($D$5='Pop calcs'!$D$3,'Pop calcs'!F11,IF($D$5='Pop calcs'!#REF!,'Pop calcs'!#REF!,\"'\"))","v":1.3083321065803011E-2},{"$f":"IF($D$5='Pop calcs'!$D$3,'Pop calcs'!I11,IF($D$5='Pop calcs'!#REF!,'Pop calcs'!#REF!,\"'\"))","v":9.0164879511126488E-3},null,{"$f":"IFERROR(MAX(0,ROUND(D14-E14,3)),0)","v":4.0000000000000001E-3},{"$f":"ROUND($D$4+G14,3)","v":1.0999999999999999E-2}]
[null,{"$f":"Names!I8","v":2079},{"$f":"Names!F8","v":"Armidale Regional"},{"$f":"IF($D$5='Pop calcs'!$D$3,'Pop calcs'!F12,IF($D$5='Pop calcs'!#REF!,'Pop calcs'!#REF!,\"'\"))","v":0},{"$f":"IF($D$5='Pop calcs'!$D$3,'Pop calcs'!I12,IF($D$5='Pop calcs'!#REF!,'Pop calcs'!#REF!,\"'\"))","v":1.1178537208559566E-3},null,{"$f":"IFERROR(MAX(0,ROUND(D15-E15,3)),0)","v":0},{"$f":"ROUND($D$4+G15,3)","v":7.0000000000000001E-3}]
[null,{"$f":"Names!I9","v":54},{"$f":"Names!F9","v":"Ballina "},{"$f":"IF($D$5='Pop calcs'!$D$3,'Pop calcs'!F13,IF($D$5='Pop calcs'!#REF!,'Pop calcs'!#REF!,\"'\"))","v":1.3334229752140159E-2},{"$f":"IF($D$5='Pop calcs'!$D$3,'Pop calcs'!I13,IF($D$5='Pop calcs'!#REF!,'Pop calcs'!#REF!,\"'\"))","v":2.0434018554088846E-2},null,0,7.0000000000000001E-3]
[null,{"$f":"Names!I10","v":55},{"$f":"Names!F10","v":"Balranald "},{"$f":"IF($D$5='Pop calcs'!$D$3,'Pop calcs'!F14,IF($D$5='Pop calcs'!#REF!,'Pop calcs'!#REF!,\"'\"))","v":0},{"$f":"IF($D$5='Pop calcs'!$D$3,'Pop calcs'!I14,IF($D$5='Pop calcs'!#REF!,'Pop calcs'!#REF!,\"'\"))","v":8.3665338645418329E-3},null,0,7.0000000000000001E-3]
[null,{"$f":"Names!I11","v":2043},{"$f":"Names!F11","v":"Bathurst Regional"},{"$f":"IF($D$5='Pop calcs'!$D$3,'Pop calcs'!F15,IF($D$5='Pop calcs'!#REF!,'Pop calcs'!#REF!,\"'\"))","v":8.8049160781435987E-3},{"$f":"IF($D$5='Pop calcs'!$D$3,'Pop calcs'!I15,IF($D$5='Pop calcs'!#REF!,'Pop calcs'!#REF!,\"'\"))","v":7.0499309542844685E-3},null,2E-3,8.9999999999999993E-3]
[null,{"$f":"Names!I12","v":2099},{"$f":"Names!F12","v":"Bayside"},{"$f":"IF($D$5='Pop calcs'!$D$3,'Pop calcs'!F16,IF($D$5='Pop calcs'!#REF!,'Pop calcs'!#REF!,\"'\"))","v":1.7499201013731369E-2},{"$f":"IF($D$5='Pop calcs'!$D$3,'Pop calcs'!I16,IF($D$5='Pop calcs'!#REF!,'Pop calcs'!#REF!,\"'\"))","v":8.9053355148294155E-3},null,8.9999999999999993E-3,1.6E-2]
[null,{"$f":"Names!I13","v":60},{"$f":"Names!F13","v":"Bega Valley "},{"$f":"IF($D$5='Pop calcs'!$D$3,'Pop calcs'!F17,IF($D$5='Pop calcs'!#REF!,'Pop calcs'!#REF!,\"'\"))","v":7.3680851681026116E-3},{"$f":"IF($D$5='Pop calcs'!$D$3,'Pop calcs'!I17,IF($D$5='Pop calcs'!#REF!,'Pop calcs'!#REF!,\"'\"))","v":9.2573544538160878E-3},null,0,7.0000000000000001E-3]
{"$rows_left_out":122}
{"sheet":"Names","index":5,"n_rows":134,"n_cols":9,"rows_kept":134,"cut":false,"hidden":false,"merged":[]}
[]
[]
[null,"LGA and Council names"]
[]
[null,"LGA code","Local Government Area",null,"Council name","Council Name","Rate peg order name","OLG Group","OrgID"]
[]
[null,10050,"Albury (C)",null,"Albury City Council","Albury ","Albury City",4,2047]
[null,10180,"Armidale Regional (A)",null,"Armidale Regional Council","Armidale Regional","Armidale Regional",4,2079]
[null,10250,"Ballina (A)",null,"Ballina Shire Council","Ballina ","Ballina Shire",4,54]
[null,10300,"Balranald (A)",null,"Balranald Shire Council","Balranald ","Balranald Shire",9,55]
[null,10470,"Bathurst Regional (A)",null,"Bathurst Regional Council","Bathurst Regional","Bathurst Regional",4,2043]
[null,10500,"Bayside (A)",null,"Bayside Council","Bayside","Bayside",3,2099]
[null,10550,"Bega Valley (A)",null,"Bega Valley Shire Council","Bega Valley ","Bega Valley Shire",4,60]
[null,10600,"Bellingen (A)",null,"Bellingen Shire Council","Bellingen ","Bellingen Shire",11,61]
[null,10650,"Berrigan (A)",null,"Berrigan Shire Council","Berrigan ","Berrigan Shire",10,62]
[null,10750,"Blacktown (C)",null,"Blacktown City Council","Blacktown ","Blacktown City",3,64]
[null,10800,"Bland (A)",null,"Bland Shire Council","Bland ","Bland Shire",10,65]
[null,10850,"Blayney (A)",null,"Blayney Shire Council","Blayney ","Blayney Shire",10,66]
[null,10900,"Blue Mountains (C)",null,"Blue Mountains City Council","Blue Mountains ","Blue Mountains City",7,67]
[null,10950,"Bogan (A)",null,"Bogan Shire Council","Bogan ","Bogan Shire",9,68]
{"$rows_left_out":115}
{"sheet":"ABS pop T1","index":6,"n_rows":148,"n_cols":8,"rows_kept":148,"cut":false,"hidden":false,"merged":[]}
[]
[null,"Source:",null,"https://www.abs.gov.au/statistics/people/population/regional-population/latest-release#data-download"]
[]
[null,null,"Regional population, 2019-20"]
[null,null,"Released at 11.30am (Canberra time) 30 March 2021"]
[null,null,"Table 1. Estimated resident population, Local Government Areas, New South Wales"]
[]
[null,null,null,null,"ERP at 30 June"]
[null,null,null,null,2019,2020,null,{"$f":"'Supp val'!$C$7","v":"Org. Name"}]
[null,null,"LGA code","Local Government Area","no.","no."]
[]
[null,null,10050,"Albury (C)",54344,55055,null,{"$f":"INDEX(Names!$F$7:$F$134,MATCH(D12,Names!$C$7:$C$134,0))","v":"Albury "}]
[null,null,10180,"Armidale Regional (A)",29812,29704,null,{"$f":"INDEX(Names!$F$7:$F$134,MATCH(D13,Names!$C$7:$C$134,0))","v":"Armidale Regional"}]
[null,null,10250,"Ballina (A)",44622,45217,null,{"$f":"INDEX(Names!$F$7:$F$134,MATCH(D14,Names!$C$7:$C$134,0))","v":"Ballina "}]
[null,null,10300,"Balranald (A)",2338,2306,null,{"$f":"INDEX(Names!$F$7:$F$134,MATCH(D15,Names!$C$7:$C$134,0))","v":"Balranald "}]
[null,null,10470,"Bathurst Regional (A)",43612,43996,null,{"$f":"INDEX(Names!$F$7:$F$134,MATCH(D16,Names!$C$7:$C$134,0))","v":"Bathurst Regional"}]
[null,null,10500,"Bayside (A)",178351,181472,null,{"$f":"INDEX(Names!$F$7:$F$134,MATCH(D17,Names!$C$7:$C$134,0))","v":"Bayside"}]
[null,null,10550,"Bega Valley (A)",34473,34727,null,{"$f":"INDEX(Names!$F$7:$F$134,MATCH(D18,Names!$C$7:$C$134,0))","v":"Bega Valley "}]
[null,null,10600,"Bellingen (A)",12993,13141,null,{"$f":"INDEX(Names!$F$7:$F$134,MATCH(D19,Names!$C$7:$C$134,0))","v":"Bellingen "}]
[null,null,10650,"Berrigan (A)",8750,8784,null,{"$f":"INDEX(Names!$F$7:$F$134,MATCH(D20,Names!$C$7:$C$134,0))","v":"Berrigan "}]
{"$rows_left_out":129}
{"sheet":"Supp val","index":7,"n_rows":135,"n_cols":5,"rows_kept":135,"cut":false,"hidden":false,"merged":[]}
[]
[null,"Sources","Annual LGA accounts (collated by OLG)"]
[null,null,"For Central Coast",null,"Financial Reports Central Coast Council 1 July 2019 to 30 June 2020, Special Schedules, p3"]
[]
[null,null,null,"Income before supplementary valuations in 2019-20","Supplemetary valuations in 2019-20"]
[null,null,null,"Schedule 9 - Last Year Notional General Income Yield - 2020-21","Schedule 9 - Plus or minus Adjustments - 2020-21"]
[null,"Org. Id","Org. Name","C454_Item11797","C454_Item11799"]
[null,2047,"Albury",43365000,391000]
[null,2079,"Armidale Regional",18786000,21000]
[null,54,"Ballina",24469000,500000]
[null,55,"Balranald",2510000,21000]
[null,2043,"Bathurst Regional",27518000,194000]
[null,2099,"Bayside",91069000,811000]
[null,60,"Bega Valley",24305000,225000]
[null,61,"Bellingen",8276000,45000]
[null,62,"Berrigan",5302000,12000]
[null,64,"Blacktown",175512000,4002000]
[null,65,"Bland",6701000,4000]
[null,66,"Blayney",8858000,3000]
[null,67,"Blue Mountains",69666000,16000]
{"$rows_left_out":116}
{"sheet":"Pop calcs","index":8,"n_rows":138,"n_cols":10,"rows_kept":138,"cut":false,"hidden":false,"merged":[]}
[]
[null,"Population factor calculations"]
[null,null,null,{"$f":"'Rate Peg'!D5","v":2022}]
[null,null,null,{"$f":"\"Population factor for Rate Peg from 1 July \"&D3","v":"Population factor for Rate Peg from 1 July 2022"}]
[]
[]
[]
[]
[]
[null,{"$f":"'Supp val'!B7","v":"Org. Id"},{"$f":"'Supp val'!C7","v":"Org. Name"},{"$f":"\"ERP as at 30 June \"&'ABS pop T1'!E9","v":"ERP as at 30 June 2019"},{"$f":"\"ERP as at 30 June \"&'ABS pop T1'!F9","v":"ERP as at 30 June 2020"},"Change in population (unrounded)",{"$f":"'Supp val'!D6","v":"Schedule 9 - Last Year Notional General Income Yield - 2020-21"},{"$f":"'Supp val'!E6","v":"Schedule 9 - Plus or minus Adjustments - 2020-21"},"Supplementary valuations percentage (unrounded)","Population factor (unrounded)"]
[null,{"$f":"Names!I7","v":2047},{"$f":"Names!F7","v":"Albury "},{"$f":"INDEX('ABS pop T1'!E$12:E$139,MATCH($C11,'ABS pop T1'!$H$12:$H$139,0))","v":54344},{"$f":"INDEX('ABS pop T1'!F$12:F$139,MATCH($C11,'ABS pop T1'!$H$12:$H$139,0))","v":55055},{"$f":"MAX(0,E11/D11-1)","v":1.3083321065803011E-2},{"$f":"INDEX('Supp val'!D$8:D$135,MATCH($B11,'Supp val'!$B$8:$B$135,0))","v":43365000},{"$f":"INDEX('Supp val'!E$8:E$135,MATCH($B11,'Supp val'!$B$8:$B$135,0))","v":391000},{"$f":"MAX(0,H11/G11)","v":9.0164879511126488E-3},{"$f":"MAX(0,F11-I11)","v":4.066833114690362E-3}]
[null,{"$f":"Names!I8","v":2079},{"$f":"Names!F8","v":"Armidale Regional"},{"$f":"INDEX('ABS pop T1'!E$12:E$139,MATCH($C12,'ABS pop T1'!$H$12:$H$139,0))","v":29812},{"$f":"INDEX('ABS pop T1'!F$12:F$139,MATCH($C12,'ABS pop T1'!$H$12:$H$139,0))","v":29704},{"$f":"MAX(0,E12/D12-1)","v":0},{"$f":"INDEX('Supp val'!D$8:D$135,MATCH($B12,'Supp val'!$B$8:$B$135,0))","v":18786000},{"$f":"INDEX('Supp val'!E$8:E$135,MATCH($B12,'Supp val'!$B$8:$B$135,0))","v":21000},{"$f":"MAX(0,H12/G12)","v":1.1178537208559566E-3},{"$f":"MAX(0,F12-I12)","v":0}]
[null,{"$f":"Names!I9","v":54},{"$f":"Names!F9","v":"Ballina "},{"$f":"INDEX('ABS pop T1'!E$12:E$139,MATCH($C13,'ABS pop T1'!$H$12:$H$139,0))","v":44622},{"$f":"INDEX('ABS pop T1'!F$12:F$139,MATCH($C13,'ABS pop T1'!$H$12:$H$139,0))","v":45217},1.3334229752140159E-2,{"$f":"INDEX('Supp val'!D$8:D$135,MATCH($B13,'Supp val'!$B$8:$B$135,0))","v":24469000},{"$f":"INDEX('Supp val'!E$8:E$135,MATCH($B13,'Supp val'!$B$8:$B$135,0))","v":500000},2.0434018554088846E-2,0]
[null,{"$f":"Names!I10","v":55},{"$f":"Names!F10","v":"Balranald "},{"$f":"INDEX('ABS pop T1'!E$12:E$139,MATCH($C14,'ABS pop T1'!$H$12:$H$139,0))","v":2338},{"$f":"INDEX('ABS pop T1'!F$12:F$139,MATCH($C14,'ABS pop T1'!$H$12:$H$139,0))","v":2306},0,{"$f":"INDEX('Supp val'!D$8:D$135,MATCH($B14,'Supp val'!$B$8:$B$135,0))","v":2510000},{"$f":"INDEX('Supp val'!E$8:E$135,MATCH($B14,'Supp val'!$B$8:$B$135,0))","v":21000},{"$f":"MAX(0,H14/G14)","v":8.3665338645418329E-3},0]
[null,{"$f":"Names!I11","v":2043},{"$f":"Names!F11","v":"Bathurst Regional"},{"$f":"INDEX('ABS pop T1'!E$12:E$139,MATCH($C15,'ABS pop T1'!$H$12:$H$139,0))","v":43612},{"$f":"INDEX('ABS pop T1'!F$12:F$139,MATCH($C15,'ABS pop T1'!$H$12:$H$139,0))","v":43996},8.8049160781435987E-3,{"$f":"INDEX('Supp val'!D$8:D$135,MATCH($B15,'Supp val'!$B$8:$B$135,0))","v":27518000},{"$f":"INDEX('Supp val'!E$8:E$135,MATCH($B15,'Supp val'!$B$8:$B$135,0))","v":194000},7.0499309542844685E-3,1.7549851238591301E-3]
[null,{"$f":"Names!I12","v":2099},{"$f":"Names!F12","v":"Bayside"},{"$f":"INDEX('ABS pop T1'!E$12:E$139,MATCH($C16,'ABS pop T1'!$H$12:$H$139,0))","v":178351},{"$f":"INDEX('ABS pop T1'!F$12:F$139,MATCH($C16,'ABS pop T1'!$H$12:$H$139,0))","v":181472},1.7499201013731369E-2,{"$f":"INDEX('Supp val'!D$8:D$135,MATCH($B16,'Supp val'!$B$8:$B$135,0))","v":91069000},{"$f":"INDEX('Supp val'!E$8:E$135,MATCH($B16,'Supp val'!$B$8:$B$135,0))","v":811000},8.9053355148294155E-3,8.5938654989019536E-3]
[null,{"$f":"Names!I13","v":60},{"$f":"Names!F13","v":"Bega Valley "},{"$f":"INDEX('ABS pop T1'!E$12:E$139,MATCH($C17,'ABS pop T1'!$H$12:$H$139,0))","v":34473},{"$f":"INDEX('ABS pop T1'!F$12:F$139,MATCH($C17,'ABS pop T1'!$H$12:$H$139,0))","v":34727},7.3680851681026116E-3,{"$f":"INDEX('Supp val'!D$8:D$135,MATCH($B17,'Supp val'!$B$8:$B$135,0))","v":24305000},{"$f":"INDEX('Supp val'!E$8:E$135,MATCH($B17,'Supp val'!$B$8:$B$135,0))","v":225000},9.2573544538160878E-3,0]
[null,{"$f":"Names!I14","v":61},{"$f":"Names!F14","v":"Bellingen "},{"$f":"INDEX('ABS pop T1'!E$12:E$139,MATCH($C18,'ABS pop T1'!$H$12:$H$139,0))","v":12993},{"$f":"INDEX('ABS pop T1'!F$12:F$139,MATCH($C18,'ABS pop T1'!$H$12:$H$139,0))","v":13141},1.1390748864773315E-2,{"$f":"INDEX('Supp val'!D$8:D$135,MATCH($B18,'Supp val'!$B$8:$B$135,0))","v":8276000},{"$f":"INDEX('Supp val'!E$8:E$135,MATCH($B18,'Supp val'!$B$8:$B$135,0))","v":45000},5.4374093765103913E-3,5.9533394882629233E-3]
[null,{"$f":"Names!I15","v":62},{"$f":"Names!F15","v":"Berrigan "},{"$f":"INDEX('ABS pop T1'!E$12:E$139,MATCH($C19,'ABS pop T1'!$H$12:$H$139,0))","v":8750},{"$f":"INDEX('ABS pop T1'!F$12:F$139,MATCH($C19,'ABS pop T1'!$H$12:$H$139,0))","v":8784},3.8857142857142701E-3,{"$f":"INDEX('Supp val'!D$8:D$135,MATCH($B19,'Supp val'!$B$8:$B$135,0))","v":5302000},{"$f":"INDEX('Supp val'!E$8:E$135,MATCH($B19,'Supp val'!$B$8:$B$135,0))","v":12000},{"$f":"MAX(0,H19/G19)","v":2.2632968691059978E-3},1.6224174166082723E-3]
[null,{"$f":"Names!I16","v":64},{"$f":"Names!F16","v":"Blacktown "},{"$f":"INDEX('ABS pop T1'!E$12:E$139,MATCH($C20,'ABS pop T1'!$H$12:$H$139,0))","v":374372},{"$f":"INDEX('ABS pop T1'!F$12:F$139,MATCH($C20,'ABS pop T1'!$H$12:$H$139,0))","v":382831},2.2595172715908163E-2,{"$f":"INDEX('Supp val'!D$8:D$135,MATCH($B20,'Supp val'!$B$8:$B$135,0))","v":175512000},{"$f":"INDEX('Supp val'!E$8:E$135,MATCH($B20,'Supp val'!$B$8:$B$135,0))","v":4002000},2.2801859701900726E-2,0]
{"$rows_left_out":118}