{"text_format":"1","workbook":"xlsx","n_sheets":9,"sheets":["Examples","QA Scope","QA log","timing","Rate Peg","Names","ABS pop T1","Supp val","Pop calcs"],"not_rendered":{"charts":15,"images":0,"macros":0,"external_links":0,"defined_names":6,"comments":1,"pivot_tables":0},"unopened":[],"bounds":{"document_bytes":16777216,"sheet_cells":100000,"rows_first":2000,"rows_last":500,"rows_between":2000,"halvings":0,"cell_chars":16384,"cell_head_chars":4096},"cells_cut":0,"cells_raw":0,"read":"whole","date_system":"1900"}

{"sheet":"Examples","index":0,"n_rows":42,"n_cols":27,"rows_kept":42,"cut":false,"hidden":true,"merged":[]}
[]
[null,"IPART colour codes for models, spreadsheets and information requests"]
[null,"NB  ALWAYS DESCRIBE THE COLOUR CODE USED IN YOUR MODEL "]
[null,"Note: If you use the formats for the inputs provided in this template, input cells will always be unprotected even when you protect the worksheet"]
[null,null,null,null,null,null,null,"use this column cell to \"paint\" input cells for numbers (NOT for percentages)"]
[null,null,null,null,null,null,null,null,"use this column cell to \"paint\" input cells for percentages (NOT numbers)"]
[null,"Models and spreadsheets"]
[null,null,null,null,null,null,"numbers","%"]
[null,"Inputs",null,null,null,null,4232,0.08]
[null,"Inputs with default values, default values are shown in italics next to or below ",null,null,null,null,34345,0.08]
[null,"Hard-coded values used that should not be changed, eg credit ratings or '1' at the start of an index series."]
[null,"Key outputs"]
[null,"Links from other files (green)"]
[null,"Error check (check =0)"]
[null,"Error warnings, messages and unusual calculation assumptions"]
[null,"Indicate change in formula across row with a double red line"]
[null,"Note:  You can combine options for inputs, eg:",null,null,"Inputs can be links to other files "]
[null,null,null,null,"You can drawn attention to unusual inputs "]
[]
[null,null,null,null,null,null,null,"use this column cell to \"paint\" input cells for numbers (NOT for percentages)"]
[null,"Information Requests",null,null,null,null,null,null,"use this column cell to \"paint\" input cells for percentages (NOT numbers)"]
[null,null,null,null,null,null,"numbers","%"]
[null,"Inputs for historical years (actual values)",null,null,null,null,234,0.24]
[null,"Forecast inputs",null,null,null,null,6667,0.05]
[null,"Error warnings and messages"]
[null,"Error check (check =0)"]
[]
[null,"QA notes - annotation or documenation by QA staff"]
[]
[]
["User Instructions - IPART CHARTS"]
[]
[null,"Blue","Mid Grey","Pale Blue","Green","Charcoal","Orange","Purple","Pink",null,null,"Blue","Mid Grey","Pale Blue","Green","Charcoal","Orange",null,"X value","1st Y value","2nd Y value",null,null,"Black","Red 100%","Red 70%","Grey 40%"]
["1975-76",36.19,36.880000000000003,21.56,5.36,3.01,10,3.01,10,null,"1975-76",33.19,36.880000000000003,21.56,5.36,3.01,10,null,1.8,10,17,null,"1975-76",33.19,36.880000000000003,21.56,5.36]
["1983-84",39.39,32.020000000000003,21.6,7.01,3.36,12,3.36,12,null,"1983-84",39.39,32.020000000000003,21.6,7.01,3.36,12,null,2.2999999999999998,12,9,null,"1983-84",39.39,32.020000000000003,21.6,7.01]
["1988-89",42.78,29.91,18.350000000000001,6.33,2.63,14,2.63,14,null,"1988-89",42.78,29.91,18.350000000000001,6.33,2.63,14,null,3.7,16,14,null,"1988-89",42.78,29.91,18.350000000000001,6.33]
["1993-94",42.13,26.53,21.6,7.01,2.72,16,2.72,16,null,"1993-94",42.13,26.53,21.6,7.01,2.72,16,null,4.0999999999999996,8,23,null,"1993-94",42.13,26.53,21.6,7.01]
["1996-97",41.69,24.76,23.98,7,2.57,18,2.57,18,null,"1996-97",41.69,24.76,23.98,7,2.57,18,null,5.5,14,27,null,"1996-97",41.69,24.76,23.98,7]
["1997-98",39.39,32.020000000000003,21.6,7.01,3.36,12,3.36,12,null,"1997-98",39.39,32.020000000000003,21.6,7.01,3.36,12,null,null,null,null,null,"1997-98",39.39,32.020000000000003,21.6,7.01]
["1998-99",42.13,26.53,21.6,7.01,2.72,16,2.72,16,null,"1998-99",42.13,26.53,21.6,7.01,2.72,16,null,null,null,null,null,"1998-99",42.13,26.53,21.6,7.01]
["1999-00",45,22,26,8,2,20,2,20,null,"1999-00",45,22,26,8,2,20,null,null,null,null,null,"1999-00",45,22,26,8]
["–  en rule for when needed"]

{"sheet":"QA Scope","index":1,"n_rows":106,"n_cols":9,"rows_kept":106,"cut":false,"hidden":true,"merged":[]}
[]
[null,"Review that the QA is for"]
[null,"Name of model",null,null,{"$f":"#REF!","v":{"$error":"#REF!"}}]
[null,"File name(s):  "]
[]
[]
[]
[null,"Name of modeller"]
[null,"Planned date of QA:"]
[null,"Risk rating for the review:"]
[null,"Note: low risk models do not require independent QA, however the modeller should indicate in section 2.3 what steps have been taken to ensure accuracy of results."]
[]
[null,"1. PURPOSE OF MODEL"]
[null,"The modeller provides a concise summary of the model's purpose(s)"]
[null,"Calculates the rate peg and population factors. For more information see 'Overview & instructions' worksheet"]
[]
[]
[]
[]
[]
[null,"2. CONTEXT AND SCOPE OF QA"]
[null,"The modeller provides information about the context of the QA and the scope of work.",null,null,null,null,null,null,"DO NOT DELETE"]
[null,null,null,null,null,null,null,null,"Yes"]
[null,"2.1 The model/spreadsheet is for (context)",null,null,null,null,null,null,"No "]
[null,null,null,null,null,null,null,null,"NA"]
[]
[null,null,null,null,null,null,null,null,"High"]
[null,null,null,null,null,null,null,null,"Medium"]
[null,null,null,null,null,null,null,null,"Low"]
[null,null,null,null,null,null,null,null,"select"]
[]
[]
[]
[]
[]
[null,"2.2 The scope of the QA is to check"]
[]
[null,null,"Logic checks",null,null,"Input checks"]
[]
[]
[]
[]
[]
[]
[]
[]
[]
[]
[]
[]
[]
[null,"* provide details of requirements for \"simplified duplication of analysis\" and/or \"sampling of inputs\" in section 2.3 below."]
[]
[]
[null,"2.3 Detailed scope of QA"]
[null,"Specify clearly how to identify what needs to be checked (e.g. \"check all calculations and inputs highlighted in green on the following worksheets: …\")"]
[null,"For \"simplified duplications of analysis\" (if applicable), specify how you and the QAer have agreed the analysis will be duplicated"]
[null,"For \"sampling of inputs\" (if applicable), specify how you and the QAer have agreed the inputs will be sampled"]
[]
[]
[]
[]
[]
[]
[]
[]
[]
[]
[]
[]
[]
[]
[]
[]
[]
[null,"3. QA CHECK LIST"]
[]
[null,"3.1 Pre-QA check list (for both medium and high risk QAs)"]
[]
[null,null,"Select an option"]
[]
[null,null,"No ","Is the model consistent with good modelling practice?"]
[null,null,"No ","Tables, inputs and outputs are clearly labelled, e.g.:"]
[null,null,null,"–     Units e.g. $m, $’000, $ or cents, kL, MWh, GJ, etc"]
[null,null,null,"–     Nominal or real"]
[null,null,null,"–     Including or excluding GST"]
[null,null,"No ","The QAer can easily identify the parts of the model that need to be checked"]
[null,null,"No ","The model inputs reflect Tribunal decisions or information from the source documents or related models"]
[null,null,"No ","The source documents (or references) have all been located and provided to the QAer/s"]
[]
[null,null,"No ","Has the QA scope been reviewed by the Chief Modeller? (Only applicable for external models and high risk price determinations)"]
[]
[]
[null,"3.2 QA check list (for RStudio scripts only)"]
[]
[null,null,"NA","Code was rerun successfully; or an alternative calculation successfully replicated results"]
[null,null,"NA","Code is easy to follow, with comments highlighting different sections in code"]
[null,null,"NA","Variable names are easy to understand"]
[null,null,"NA","Test variables are used to check that data is not duplicated or excluded in error when joining data sources"]
[null,null,"NA","If this QA is an update to an existing RStudio script, changes are highlighted and easy to find (e.g. a text comparison tool is used to compare scripts before and after change)"]
[]
[]
[null,"4  INDUSTRY TEAM REMINDER – POST QA SIGN OFF IN CM9"]
[]
[null,"Has the post-QA deliverable been CM9ed?"]
[null,"Has the QA been signed off via action tracking in CM9 by the QA analyst and Director?"]

{"sheet":"QA log","index":2,"n_rows":36,"n_cols":14,"rows_kept":36,"cut":false,"hidden":true,"merged":[]}
[]
[null,"DETAILS OF ISSUES FOUND IN THE QA "]
[null,"Item no.","Date checked (Month and Year)","QAed by","What is the issue?","Category","Where in model? ","Where … continued (optional)","Responses by industry team /model developer (industry team should prioritise red cells, i.e. calculation or data errors)","QA signoff"]
[null,null,"Required only if QA is staggered over along period","required only if there is more than one QAer",null,"Select the type of issue from the drop-down box (see notes in column N)","e.g. worksheet(s),  and rows/columns, or table numbers. May refer to highlighted areas in worksheet(s)","Optional 2nd column, e.g. with cell reference area in (or link to) relevant worksheet","Changed / not changed & reason",null,null,null,"Categories for drop-down box.  DO NOT DELETE","Notes on when to use the categories"]
[null,1,null,null,null,"Calculation or data error",null,null,null,null,null,null,"Calculation or data error","The formula logical is flawed, contains a cell reference error or contains another error (e.g. bracket is in the wrong place), or there is a data input problem"]
[null,{"$f":"B5+1","v":2},null,null,null,"Documentation, formatting or structure",null,null,null,null,null,null,"Documentation, formatting or structure","Model is not structured efficiently, not consistent with IPART colour coding and formatting, or there is a labelling issue"]
[null,{"$f":"B6+1","v":3}]
[null,4]
[null,5]
[null,6]
[null,7]
[null,8]
[null,9]
[null,10]
[null,11]
[null,12]
[null,13]
[null,14]
[null,15]
[null,16]
[null,17]
[null,18]
[null,19]
[null,20]
[null,21]
[null,22]
[null,23]
[null,24]
[null,25]
[null,26]
[null,27]
[null,28]
[null,29]
[null,30]
[null,"END OF LOG"]
[null,"IF A LONGER LOG IS REQUIRED, INSERT NEW ROWS ABOVE ITEM 29 AND REDO THE NUMBERING"]

{"sheet":"timing","index":3,"n_rows":19,"n_cols":13,"rows_kept":19,"cut":false,"hidden":true,"merged":[]}
[]
[]
[null,"Timing for population factor"]
[]
[null,"Rate peg on 1 July ",null,null,2022,{"$f":"E5+1","v":2023},2024,2025,2026,2027,2028,2029]
[null,"FY",null,null,{"$f":"E5&\"-\"&RIGHT(F5,2)","v":"2022-23"},"2023-24","2024-25","2025-26","2026-27","2027-28","2028-29"]
[]
[null,"ABS release dates"]
[null,"Regional population, 2019-20","March 2021",null,"to 30 June 2020"]
[null,"Regional population, 2020-21","March 2022",null,null,"to June 2021","Initial census release date Oct 2022 - updated 2020-21 ERP?"]
[null,"Census - 2021-22","early to mid 2023",null,null,null,"as at Aug 2021",null,null,null,null,null,"https://www.abs.gov.au/census/2021-data-releases"]
[null,"Regional population, 2022-23","March 2024",null,null,null,null,"to June 2023"]
[null,"Regional population, 2023-24","March 2025",null,null,null,null,null,"to June 2024"]
[null,"Regional population, 2024-25","March 2026",null,null,null,null,null,null,"to June 2025"]
[null,"Regional population, 2025-26","March 2027",null,null,null,null,null,null,null,"to June 2026"]
[]
[]
[]
[null,"Supp val for year",null,null,"2019-20","2020-21","2021-22","2022-23","2023-24","2024-25","2025-26"]

{"sheet":"Rate Peg","index":4,"n_rows":141,"n_cols":8,"rows_kept":141,"cut":false,"hidden":false,"merged":[]}
[]
[null,"Population factors and final Rate Peg for 2022-23"]
[]
[null,"Rate peg before population factor ",null,7.0000000000000001E-3]
[null,"Rate peg from 1 July",null,2022]
[]
[]
[]
[]
[]
[]
[]
[null,{"$f":"'Supp val'!B7","v":"Org. Id"},"Council","Change in population ","Supplementary valuations percentage",null,"Population factor","Rate Peg (including population factor)"]
[null,{"$f":"Names!I7","v":2047},{"$f":"Names!F7","v":"Albury "},{"$f":"IF($D$5='Pop calcs'!$D$3,'Pop calcs'!F11,IF($D$5='Pop calcs'!#REF!,'Pop calcs'!#REF!,\"'\"))","v":1.3083321065803011E-2},{"$f":"IF($D$5='Pop calcs'!$D$3,'Pop calcs'!I11,IF($D$5='Pop calcs'!#REF!,'Pop calcs'!#REF!,\"'\"))","v":9.0164879511126488E-3},null,{"$f":"IFERROR(MAX(0,ROUND(D14-E14,3)),0)","v":4.0000000000000001E-3},{"$f":"ROUND($D$4+G14,3)","v":1.0999999999999999E-2}]
[null,{"$f":"Names!I8","v":2079},{"$f":"Names!F8","v":"Armidale Regional"},{"$f":"IF($D$5='Pop calcs'!$D$3,'Pop calcs'!F12,IF($D$5='Pop calcs'!#REF!,'Pop calcs'!#REF!,\"'\"))","v":0},{"$f":"IF($D$5='Pop calcs'!$D$3,'Pop calcs'!I12,IF($D$5='Pop calcs'!#REF!,'Pop calcs'!#REF!,\"'\"))","v":1.1178537208559566E-3},null,{"$f":"IFERROR(MAX(0,ROUND(D15-E15,3)),0)","v":0},{"$f":"ROUND($D$4+G15,3)","v":7.0000000000000001E-3}]
[null,{"$f":"Names!I9","v":54},{"$f":"Names!F9","v":"Ballina "},{"$f":"IF($D$5='Pop calcs'!$D$3,'Pop calcs'!F13,IF($D$5='Pop calcs'!#REF!,'Pop calcs'!#REF!,\"'\"))","v":1.3334229752140159E-2},{"$f":"IF($D$5='Pop calcs'!$D$3,'Pop calcs'!I13,IF($D$5='Pop calcs'!#REF!,'Pop calcs'!#REF!,\"'\"))","v":2.0434018554088846E-2},null,0,7.0000000000000001E-3]
[null,{"$f":"Names!I10","v":55},{"$f":"Names!F10","v":"Balranald "},{"$f":"IF($D$5='Pop calcs'!$D$3,'Pop calcs'!F14,IF($D$5='Pop calcs'!#REF!,'Pop calcs'!#REF!,\"'\"))","v":0},{"$f":"IF($D$5='Pop calcs'!$D$3,'Pop calcs'!I14,IF($D$5='Pop calcs'!#REF!,'Pop calcs'!#REF!,\"'\"))","v":8.3665338645418329E-3},null,0,7.0000000000000001E-3]
[null,{"$f":"Names!I11","v":2043},{"$f":"Names!F11","v":"Bathurst Regional"},{"$f":"IF($D$5='Pop calcs'!$D$3,'Pop calcs'!F15,IF($D$5='Pop calcs'!#REF!,'Pop calcs'!#REF!,\"'\"))","v":8.8049160781435987E-3},{"$f":"IF($D$5='Pop calcs'!$D$3,'Pop calcs'!I15,IF($D$5='Pop calcs'!#REF!,'Pop calcs'!#REF!,\"'\"))","v":7.0499309542844685E-3},null,2E-3,8.9999999999999993E-3]
[null,{"$f":"Names!I12","v":2099},{"$f":"Names!F12","v":"Bayside"},{"$f":"IF($D$5='Pop calcs'!$D$3,'Pop calcs'!F16,IF($D$5='Pop calcs'!#REF!,'Pop calcs'!#REF!,\"'\"))","v":1.7499201013731369E-2},{"$f":"IF($D$5='Pop calcs'!$D$3,'Pop calcs'!I16,IF($D$5='Pop calcs'!#REF!,'Pop calcs'!#REF!,\"'\"))","v":8.9053355148294155E-3},null,8.9999999999999993E-3,1.6E-2]
[null,{"$f":"Names!I13","v":60},{"$f":"Names!F13","v":"Bega Valley "},{"$f":"IF($D$5='Pop calcs'!$D$3,'Pop calcs'!F17,IF($D$5='Pop calcs'!#REF!,'Pop calcs'!#REF!,\"'\"))","v":7.3680851681026116E-3},{"$f":"IF($D$5='Pop calcs'!$D$3,'Pop calcs'!I17,IF($D$5='Pop calcs'!#REF!,'Pop calcs'!#REF!,\"'\"))","v":9.2573544538160878E-3},null,0,7.0000000000000001E-3]
[null,{"$f":"Names!I14","v":61},{"$f":"Names!F14","v":"Bellingen "},{"$f":"IF($D$5='Pop calcs'!$D$3,'Pop calcs'!F18,IF($D$5='Pop calcs'!#REF!,'Pop calcs'!#REF!,\"'\"))","v":1.1390748864773315E-2},{"$f":"IF($D$5='Pop calcs'!$D$3,'Pop calcs'!I18,IF($D$5='Pop calcs'!#REF!,'Pop calcs'!#REF!,\"'\"))","v":5.4374093765103913E-3},null,6.0000000000000001E-3,1.2999999999999999E-2]
[null,{"$f":"Names!I15","v":62},{"$f":"Names!F15","v":"Berrigan "},{"$f":"IF($D$5='Pop calcs'!$D$3,'Pop calcs'!F19,IF($D$5='Pop calcs'!#REF!,'Pop calcs'!#REF!,\"'\"))","v":3.8857142857142701E-3},{"$f":"IF($D$5='Pop calcs'!$D$3,'Pop calcs'!I19,IF($D$5='Pop calcs'!#REF!,'Pop calcs'!#REF!,\"'\"))","v":2.2632968691059978E-3},null,2E-3,8.9999999999999993E-3]
[null,{"$f":"Names!I16","v":64},{"$f":"Names!F16","v":"Blacktown "},{"$f":"IF($D$5='Pop calcs'!$D$3,'Pop calcs'!F20,IF($D$5='Pop calcs'!#REF!,'Pop calcs'!#REF!,\"'\"))","v":2.2595172715908163E-2},{"$f":"IF($D$5='Pop calcs'!$D$3,'Pop calcs'!I20,IF($D$5='Pop calcs'!#REF!,'Pop calcs'!#REF!,\"'\"))","v":2.2801859701900726E-2},null,0,7.0000000000000001E-3]
[null,{"$f":"Names!I17","v":65},{"$f":"Names!F17","v":"Bland "},{"$f":"IF($D$5='Pop calcs'!$D$3,'Pop calcs'!F21,IF($D$5='Pop calcs'!#REF!,'Pop calcs'!#REF!,\"'\"))","v":0},{"$f":"IF($D$5='Pop calcs'!$D$3,'Pop calcs'!I21,IF($D$5='Pop calcs'!#REF!,'Pop calcs'!#REF!,\"'\"))","v":5.9692583196537831E-4},null,0,7.0000000000000001E-3]
[null,{"$f":"Names!I18","v":66},{"$f":"Names!F18","v":"Blayney "},{"$f":"IF($D$5='Pop calcs'!$D$3,'Pop calcs'!F22,IF($D$5='Pop calcs'!#REF!,'Pop calcs'!#REF!,\"'\"))","v":5.4215234480881058E-4},{"$f":"IF($D$5='Pop calcs'!$D$3,'Pop calcs'!I22,IF($D$5='Pop calcs'!#REF!,'Pop calcs'!#REF!,\"'\"))","v":3.3867690223526756E-4},null,0,7.0000000000000001E-3]
[null,{"$f":"Names!I19","v":67},{"$f":"Names!F19","v":"Blue Mountains "},{"$f":"IF($D$5='Pop calcs'!$D$3,'Pop calcs'!F23,IF($D$5='Pop calcs'!#REF!,'Pop calcs'!#REF!,\"'\"))","v":1.0997623502047027E-3},{"$f":"IF($D$5='Pop calcs'!$D$3,'Pop calcs'!I23,IF($D$5='Pop calcs'!#REF!,'Pop calcs'!#REF!,\"'\"))","v":2.2966726954324921E-4},null,1E-3,8.0000000000000002E-3]
[null,{"$f":"Names!I20","v":68},{"$f":"Names!F20","v":"Bogan "},{"$f":"IF($D$5='Pop calcs'!$D$3,'Pop calcs'!F24,IF($D$5='Pop calcs'!#REF!,'Pop calcs'!#REF!,\"'\"))","v":0},{"$f":"IF($D$5='Pop calcs'!$D$3,'Pop calcs'!I24,IF($D$5='Pop calcs'!#REF!,'Pop calcs'!#REF!,\"'\"))","v":2.8492962581531067E-2},null,0,7.0000000000000001E-3]
[null,{"$f":"Names!I21","v":72},{"$f":"Names!F21","v":"Bourke "},{"$f":"IF($D$5='Pop calcs'!$D$3,'Pop calcs'!F25,IF($D$5='Pop calcs'!#REF!,'Pop calcs'!#REF!,\"'\"))","v":1.3513513513513598E-2},{"$f":"IF($D$5='Pop calcs'!$D$3,'Pop calcs'!I25,IF($D$5='Pop calcs'!#REF!,'Pop calcs'!#REF!,\"'\"))","v":0},null,1.4E-2,2.1000000000000001E-2]
[null,{"$f":"Names!I22","v":73},{"$f":"Names!F22","v":"Brewarrina "},{"$f":"IF($D$5='Pop calcs'!$D$3,'Pop calcs'!F26,IF($D$5='Pop calcs'!#REF!,'Pop calcs'!#REF!,\"'\"))","v":0},{"$f":"IF($D$5='Pop calcs'!$D$3,'Pop calcs'!I26,IF($D$5='Pop calcs'!#REF!,'Pop calcs'!#REF!,\"'\"))","v":0},null,0,7.0000000000000001E-3]
[null,{"$f":"Names!I23","v":74},{"$f":"Names!F23","v":"Broken Hill "},{"$f":"IF($D$5='Pop calcs'!$D$3,'Pop calcs'!F27,IF($D$5='Pop calcs'!#REF!,'Pop calcs'!#REF!,\"'\"))","v":0},{"$f":"IF($D$5='Pop calcs'!$D$3,'Pop calcs'!I27,IF($D$5='Pop calcs'!#REF!,'Pop calcs'!#REF!,\"'\"))","v":5.6332679283498952E-3},null,0,7.0000000000000001E-3]
[null,{"$f":"Names!I24","v":75},{"$f":"Names!F24","v":"Burwood"},{"$f":"IF($D$5='Pop calcs'!$D$3,'Pop calcs'!F28,IF($D$5='Pop calcs'!#REF!,'Pop calcs'!#REF!,\"'\"))","v":6.6509015666567084E-3},{"$f":"IF($D$5='Pop calcs'!$D$3,'Pop calcs'!I28,IF($D$5='Pop calcs'!#REF!,'Pop calcs'!#REF!,\"'\"))","v":3.5700926811021987E-2},null,0,7.0000000000000001E-3]
[null,{"$f":"Names!I25","v":76},{"$f":"Names!F25","v":"Byron "},{"$f":"IF($D$5='Pop calcs'!$D$3,'Pop calcs'!F29,IF($D$5='Pop calcs'!#REF!,'Pop calcs'!#REF!,\"'\"))","v":1.9900213827512392E-2},{"$f":"IF($D$5='Pop calcs'!$D$3,'Pop calcs'!I29,IF($D$5='Pop calcs'!#REF!,'Pop calcs'!#REF!,\"'\"))","v":3.8263251168036087E-3},null,1.6E-2,2.3E-2]
[null,{"$f":"Names!I26","v":77},{"$f":"Names!F26","v":"Cabonne"},{"$f":"IF($D$5='Pop calcs'!$D$3,'Pop calcs'!F30,IF($D$5='Pop calcs'!#REF!,'Pop calcs'!#REF!,\"'\"))","v":3.3010563380282409E-3},{"$f":"IF($D$5='Pop calcs'!$D$3,'Pop calcs'!I30,IF($D$5='Pop calcs'!#REF!,'Pop calcs'!#REF!,\"'\"))","v":1.2478402764446151E-3},null,2E-3,8.9999999999999993E-3]
[null,{"$f":"Names!I27","v":78},{"$f":"Names!F27","v":"Camden"},{"$f":"IF($D$5='Pop calcs'!$D$3,'Pop calcs'!F31,IF($D$5='Pop calcs'!#REF!,'Pop calcs'!#REF!,\"'\"))","v":6.2965884440938646E-2},{"$f":"IF($D$5='Pop calcs'!$D$3,'Pop calcs'!I31,IF($D$5='Pop calcs'!#REF!,'Pop calcs'!#REF!,\"'\"))","v":2.0346543146337281E-2},null,4.2999999999999997E-2,0.05]
[null,{"$f":"Names!I28","v":79},{"$f":"Names!F28","v":"Campbelltown "},{"$f":"IF($D$5='Pop calcs'!$D$3,'Pop calcs'!F32,IF($D$5='Pop calcs'!#REF!,'Pop calcs'!#REF!,\"'\"))","v":1.8524152780378111E-2},{"$f":"IF($D$5='Pop calcs'!$D$3,'Pop calcs'!I32,IF($D$5='Pop calcs'!#REF!,'Pop calcs'!#REF!,\"'\"))","v":1.3314404938590265E-2},null,5.0000000000000001E-3,1.2E-2]
[null,{"$f":"Names!I29","v":1989},{"$f":"Names!F29","v":"Canada Bay "},{"$f":"IF($D$5='Pop calcs'!$D$3,'Pop calcs'!F33,IF($D$5='Pop calcs'!#REF!,'Pop calcs'!#REF!,\"'\"))","v":5.5511003259840486E-3},{"$f":"IF($D$5='Pop calcs'!$D$3,'Pop calcs'!I33,IF($D$5='Pop calcs'!#REF!,'Pop calcs'!#REF!,\"'\"))","v":8.7972854090737713E-4},null,5.0000000000000001E-3,1.2E-2]
[null,{"$f":"Names!I30","v":2080},{"$f":"Names!F30","v":"Canterbury-Bankstown"},{"$f":"IF($D$5='Pop calcs'!$D$3,'Pop calcs'!F34,IF($D$5='Pop calcs'!#REF!,'Pop calcs'!#REF!,\"'\"))","v":6.8018928847437543E-3},{"$f":"IF($D$5='Pop calcs'!$D$3,'Pop calcs'!I34,IF($D$5='Pop calcs'!#REF!,'Pop calcs'!#REF!,\"'\"))","v":5.5310388888231603E-3},null,1E-3,8.0000000000000002E-3]
[null,{"$f":"Names!I31","v":81},{"$f":"Names!F31","v":"Carrathool "},{"$f":"IF($D$5='Pop calcs'!$D$3,'Pop calcs'!F35,IF($D$5='Pop calcs'!#REF!,'Pop calcs'!#REF!,\"'\"))","v":0},{"$f":"IF($D$5='Pop calcs'!$D$3,'Pop calcs'!I35,IF($D$5='Pop calcs'!#REF!,'Pop calcs'!#REF!,\"'\"))","v":0},null,0,7.0000000000000001E-3]
[null,{"$f":"Names!I32","v":2088},{"$f":"Names!F32","v":"Central Coast"},{"$f":"IF($D$5='Pop calcs'!$D$3,'Pop calcs'!F36,IF($D$5='Pop calcs'!#REF!,'Pop calcs'!#REF!,\"'\"))","v":5.4867091956896097E-3},{"$f":"IF($D$5='Pop calcs'!$D$3,'Pop calcs'!I36,IF($D$5='Pop calcs'!#REF!,'Pop calcs'!#REF!,\"'\"))","v":2.56885468962605E-3},null,3.0000000000000001E-3,0.01]
[null,{"$f":"Names!I33","v":83},{"$f":"Names!F33","v":"Central Darling "},{"$f":"IF($D$5='Pop calcs'!$D$3,'Pop calcs'!F37,IF($D$5='Pop calcs'!#REF!,'Pop calcs'!#REF!,\"'\"))","v":0},{"$f":"IF($D$5='Pop calcs'!$D$3,'Pop calcs'!I37,IF($D$5='Pop calcs'!#REF!,'Pop calcs'!#REF!,\"'\"))","v":0},null,0,7.0000000000000001E-3]
[null,{"$f":"Names!I34","v":84},{"$f":"Names!F34","v":"Cessnock "},{"$f":"IF($D$5='Pop calcs'!$D$3,'Pop calcs'!F38,IF($D$5='Pop calcs'!#REF!,'Pop calcs'!#REF!,\"'\"))","v":2.1307812864717057E-2},{"$f":"IF($D$5='Pop calcs'!$D$3,'Pop calcs'!I38,IF($D$5='Pop calcs'!#REF!,'Pop calcs'!#REF!,\"'\"))","v":2.1125324906987413E-2},null,0,7.0000000000000001E-3]
[null,{"$f":"Names!I35","v":2037},{"$f":"Names!F35","v":"Clarence Valley"},{"$f":"IF($D$5='Pop calcs'!$D$3,'Pop calcs'!F39,IF($D$5='Pop calcs'!#REF!,'Pop calcs'!#REF!,\"'\"))","v":1.4325538175623542E-3},{"$f":"IF($D$5='Pop calcs'!$D$3,'Pop calcs'!I39,IF($D$5='Pop calcs'!#REF!,'Pop calcs'!#REF!,\"'\"))","v":8.1886668850311168E-3},null,0,7.0000000000000001E-3]
[null,{"$f":"Names!I36","v":85},{"$f":"Names!F36","v":"Cobar "},{"$f":"IF($D$5='Pop calcs'!$D$3,'Pop calcs'!F40,IF($D$5='Pop calcs'!#REF!,'Pop calcs'!#REF!,\"'\"))","v":0},{"$f":"IF($D$5='Pop calcs'!$D$3,'Pop calcs'!I40,IF($D$5='Pop calcs'!#REF!,'Pop calcs'!#REF!,\"'\"))","v":3.4567901234567903E-3},null,0,7.0000000000000001E-3]
[null,{"$f":"Names!I37","v":86},{"$f":"Names!F37","v":"Coffs Harbour "},{"$f":"IF($D$5='Pop calcs'!$D$3,'Pop calcs'!F41,IF($D$5='Pop calcs'!#REF!,'Pop calcs'!#REF!,\"'\"))","v":4.9569662848638618E-3},{"$f":"IF($D$5='Pop calcs'!$D$3,'Pop calcs'!I41,IF($D$5='Pop calcs'!#REF!,'Pop calcs'!#REF!,\"'\"))","v":4.9092977309465368E-3},null,0,7.0000000000000001E-3]
[null,{"$f":"Names!I38","v":90},{"$f":"Names!F38","v":"Coolamon "},{"$f":"IF($D$5='Pop calcs'!$D$3,'Pop calcs'!F42,IF($D$5='Pop calcs'!#REF!,'Pop calcs'!#REF!,\"'\"))","v":0},{"$f":"IF($D$5='Pop calcs'!$D$3,'Pop calcs'!I42,IF($D$5='Pop calcs'!#REF!,'Pop calcs'!#REF!,\"'\"))","v":0},null,0,7.0000000000000001E-3]
[null,{"$f":"Names!I39","v":93},{"$f":"Names!F39","v":"Coonamble "},{"$f":"IF($D$5='Pop calcs'!$D$3,'Pop calcs'!F43,IF($D$5='Pop calcs'!#REF!,'Pop calcs'!#REF!,\"'\"))","v":0},{"$f":"IF($D$5='Pop calcs'!$D$3,'Pop calcs'!I43,IF($D$5='Pop calcs'!#REF!,'Pop calcs'!#REF!,\"'\"))","v":0},null,0,{"$f":"ROUND($D$4+G46,3)","v":7.0000000000000001E-3}]
[null,{"$f":"Names!I40","v":2094},{"$f":"Names!F40","v":"Cootamundra-Gundagai Regional"},{"$f":"IF($D$5='Pop calcs'!$D$3,'Pop calcs'!F44,IF($D$5='Pop calcs'!#REF!,'Pop calcs'!#REF!,\"'\"))","v":0},{"$f":"IF($D$5='Pop calcs'!$D$3,'Pop calcs'!I44,IF($D$5='Pop calcs'!#REF!,'Pop calcs'!#REF!,\"'\"))","v":0},null,0,7.0000000000000001E-3]
[null,{"$f":"Names!I41","v":97},{"$f":"Names!F41","v":"Cowra "},{"$f":"IF($D$5='Pop calcs'!$D$3,'Pop calcs'!F45,IF($D$5='Pop calcs'!#REF!,'Pop calcs'!#REF!,\"'\"))","v":0},{"$f":"IF($D$5='Pop calcs'!$D$3,'Pop calcs'!I45,IF($D$5='Pop calcs'!#REF!,'Pop calcs'!#REF!,\"'\"))","v":2.1530070331563082E-3},null,0,7.0000000000000001E-3]
[null,{"$f":"Names!I42","v":2090},{"$f":"Names!F42","v":"Cumberland"},{"$f":"IF($D$5='Pop calcs'!$D$3,'Pop calcs'!F46,IF($D$5='Pop calcs'!#REF!,'Pop calcs'!#REF!,\"'\"))","v":5.0568847767473724E-3},{"$f":"IF($D$5='Pop calcs'!$D$3,'Pop calcs'!I46,IF($D$5='Pop calcs'!#REF!,'Pop calcs'!#REF!,\"'\"))","v":0},null,5.0000000000000001E-3,1.2E-2]
[null,{"$f":"Names!I43","v":2098},{"$f":"Names!F43","v":"Dubbo Regional"},{"$f":"IF($D$5='Pop calcs'!$D$3,'Pop calcs'!F47,IF($D$5='Pop calcs'!#REF!,'Pop calcs'!#REF!,\"'\"))","v":6.2185812697821419E-3},{"$f":"IF($D$5='Pop calcs'!$D$3,'Pop calcs'!I47,IF($D$5='Pop calcs'!#REF!,'Pop calcs'!#REF!,\"'\"))","v":6.1338190389457333E-3},null,0,7.0000000000000001E-3]
[null,{"$f":"Names!I44","v":104},{"$f":"Names!F44","v":"Dungog "},{"$f":"IF($D$5='Pop calcs'!$D$3,'Pop calcs'!F48,IF($D$5='Pop calcs'!#REF!,'Pop calcs'!#REF!,\"'\"))","v":2.5684568032264821E-2},{"$f":"IF($D$5='Pop calcs'!$D$3,'Pop calcs'!I48,IF($D$5='Pop calcs'!#REF!,'Pop calcs'!#REF!,\"'\"))","v":9.1659028414298807E-3},null,1.7000000000000001E-2,2.4E-2]
[null,{"$f":"Names!I45","v":2091},{"$f":"Names!F45","v":"Edward River"},{"$f":"IF($D$5='Pop calcs'!$D$3,'Pop calcs'!F49,IF($D$5='Pop calcs'!#REF!,'Pop calcs'!#REF!,\"'\"))","v":0},{"$f":"IF($D$5='Pop calcs'!$D$3,'Pop calcs'!I49,IF($D$5='Pop calcs'!#REF!,'Pop calcs'!#REF!,\"'\"))","v":0},null,0,7.0000000000000001E-3]
[null,{"$f":"Names!I46","v":105},{"$f":"Names!F46","v":"Eurobodalla "},{"$f":"IF($D$5='Pop calcs'!$D$3,'Pop calcs'!F50,IF($D$5='Pop calcs'!#REF!,'Pop calcs'!#REF!,\"'\"))","v":1.2555564220541271E-2},{"$f":"IF($D$5='Pop calcs'!$D$3,'Pop calcs'!I50,IF($D$5='Pop calcs'!#REF!,'Pop calcs'!#REF!,\"'\"))","v":2.788043830642547E-3},null,0.01,1.7000000000000001E-2]
[null,{"$f":"Names!I47","v":107},{"$f":"Names!F47","v":"Fairfield "},{"$f":"IF($D$5='Pop calcs'!$D$3,'Pop calcs'!F51,IF($D$5='Pop calcs'!#REF!,'Pop calcs'!#REF!,\"'\"))","v":0},{"$f":"IF($D$5='Pop calcs'!$D$3,'Pop calcs'!I51,IF($D$5='Pop calcs'!#REF!,'Pop calcs'!#REF!,\"'\"))","v":3.6830028828616817E-3},null,0,7.0000000000000001E-3]
[null,{"$f":"Names!I48","v":2092},{"$f":"Names!F48","v":"Federation"},{"$f":"IF($D$5='Pop calcs'!$D$3,'Pop calcs'!F52,IF($D$5='Pop calcs'!#REF!,'Pop calcs'!#REF!,\"'\"))","v":1.3108162444712468E-2},{"$f":"IF($D$5='Pop calcs'!$D$3,'Pop calcs'!I52,IF($D$5='Pop calcs'!#REF!,'Pop calcs'!#REF!,\"'\"))","v":4.3668122270742356E-3},null,8.9999999999999993E-3,1.6E-2]
[null,{"$f":"Names!I49","v":108},{"$f":"Names!F49","v":"Forbes "},{"$f":"IF($D$5='Pop calcs'!$D$3,'Pop calcs'!F53,IF($D$5='Pop calcs'!#REF!,'Pop calcs'!#REF!,\"'\"))","v":1.615508885298933E-3},{"$f":"IF($D$5='Pop calcs'!$D$3,'Pop calcs'!I53,IF($D$5='Pop calcs'!#REF!,'Pop calcs'!#REF!,\"'\"))","v":2.8932140978432403E-3},null,0,7.0000000000000001E-3]
[null,{"$f":"Names!I50","v":2093},{"$f":"Names!F50","v":"Georges River"},{"$f":"IF($D$5='Pop calcs'!$D$3,'Pop calcs'!F54,IF($D$5='Pop calcs'!#REF!,'Pop calcs'!#REF!,\"'\"))","v":5.2750092516511415E-3},{"$f":"IF($D$5='Pop calcs'!$D$3,'Pop calcs'!I54,IF($D$5='Pop calcs'!#REF!,'Pop calcs'!#REF!,\"'\"))","v":6.2646828504306969E-3},null,0,7.0000000000000001E-3]
[null,{"$f":"Names!I51","v":109},{"$f":"Names!F51","v":"Gilgandra "},{"$f":"IF($D$5='Pop calcs'!$D$3,'Pop calcs'!F55,IF($D$5='Pop calcs'!#REF!,'Pop calcs'!#REF!,\"'\"))","v":0},{"$f":"IF($D$5='Pop calcs'!$D$3,'Pop calcs'!I55,IF($D$5='Pop calcs'!#REF!,'Pop calcs'!#REF!,\"'\"))","v":5.9090013787669888E-4},null,0,7.0000000000000001E-3]
[null,{"$f":"Names!I52","v":2053},{"$f":"Names!F52","v":"Glen Innes Severn"},{"$f":"IF($D$5='Pop calcs'!$D$3,'Pop calcs'!F56,IF($D$5='Pop calcs'!#REF!,'Pop calcs'!#REF!,\"'\"))","v":4.5100913293483202E-4},{"$f":"IF($D$5='Pop calcs'!$D$3,'Pop calcs'!I56,IF($D$5='Pop calcs'!#REF!,'Pop calcs'!#REF!,\"'\"))","v":3.854389721627409E-3},null,0,7.0000000000000001E-3]
[null,{"$f":"Names!I53","v":2032},{"$f":"Names!F53","v":"Goulburn Mulwaree"},{"$f":"IF($D$5='Pop calcs'!$D$3,'Pop calcs'!F57,IF($D$5='Pop calcs'!#REF!,'Pop calcs'!#REF!,\"'\"))","v":1.3717994024480262E-2},{"$f":"IF($D$5='Pop calcs'!$D$3,'Pop calcs'!I57,IF($D$5='Pop calcs'!#REF!,'Pop calcs'!#REF!,\"'\"))","v":1.357378320729106E-2},null,0,7.0000000000000001E-3]
[null,{"$f":"Names!I54","v":2049},{"$f":"Names!F54","v":"Greater Hume "},{"$f":"IF($D$5='Pop calcs'!$D$3,'Pop calcs'!F58,IF($D$5='Pop calcs'!#REF!,'Pop calcs'!#REF!,\"'\"))","v":7.2470500789743042E-3},{"$f":"IF($D$5='Pop calcs'!$D$3,'Pop calcs'!I58,IF($D$5='Pop calcs'!#REF!,'Pop calcs'!#REF!,\"'\"))","v":7.8947368421052634E-3},null,0,7.0000000000000001E-3]
[null,{"$f":"Names!I55","v":118},{"$f":"Names!F55","v":"Griffith "},{"$f":"IF($D$5='Pop calcs'!$D$3,'Pop calcs'!F59,IF($D$5='Pop calcs'!#REF!,'Pop calcs'!#REF!,\"'\"))","v":4.9219154762785156E-3},{"$f":"IF($D$5='Pop calcs'!$D$3,'Pop calcs'!I59,IF($D$5='Pop calcs'!#REF!,'Pop calcs'!#REF!,\"'\"))","v":5.2283826486641772E-3},null,0,7.0000000000000001E-3]
[null,{"$f":"Names!I56","v":120},{"$f":"Names!F56","v":"Gunnedah "},{"$f":"IF($D$5='Pop calcs'!$D$3,'Pop calcs'!F60,IF($D$5='Pop calcs'!#REF!,'Pop calcs'!#REF!,\"'\"))","v":7.8864353312302349E-4},{"$f":"IF($D$5='Pop calcs'!$D$3,'Pop calcs'!I60,IF($D$5='Pop calcs'!#REF!,'Pop calcs'!#REF!,\"'\"))","v":0},null,1E-3,8.0000000000000002E-3]
[null,{"$f":"Names!I57","v":2039},{"$f":"Names!F57","v":"Gwydir "},{"$f":"IF($D$5='Pop calcs'!$D$3,'Pop calcs'!F61,IF($D$5='Pop calcs'!#REF!,'Pop calcs'!#REF!,\"'\"))","v":0},{"$f":"IF($D$5='Pop calcs'!$D$3,'Pop calcs'!I61,IF($D$5='Pop calcs'!#REF!,'Pop calcs'!#REF!,\"'\"))","v":2.6227051330086175E-3},null,0,7.0000000000000001E-3]
[null,{"$f":"Names!I58","v":125},{"$f":"Names!F58","v":"Hawkesbury "},{"$f":"IF($D$5='Pop calcs'!$D$3,'Pop calcs'!F62,IF($D$5='Pop calcs'!#REF!,'Pop calcs'!#REF!,\"'\"))","v":6.8511473070977935E-3},{"$f":"IF($D$5='Pop calcs'!$D$3,'Pop calcs'!I62,IF($D$5='Pop calcs'!#REF!,'Pop calcs'!#REF!,\"'\"))","v":5.7043133986247139E-3},null,1E-3,8.0000000000000002E-3]
[null,{"$f":"Names!I59","v":126},{"$f":"Names!F59","v":"Hay "},{"$f":"IF($D$5='Pop calcs'!$D$3,'Pop calcs'!F63,IF($D$5='Pop calcs'!#REF!,'Pop calcs'!#REF!,\"'\"))","v":0},{"$f":"IF($D$5='Pop calcs'!$D$3,'Pop calcs'!I63,IF($D$5='Pop calcs'!#REF!,'Pop calcs'!#REF!,\"'\"))","v":3.3003300330033004E-3},null,0,7.0000000000000001E-3]
[null,{"$f":"Names!I60","v":2081},{"$f":"Names!F60","v":"Hilltops"},{"$f":"IF($D$5='Pop calcs'!$D$3,'Pop calcs'!F64,IF($D$5='Pop calcs'!#REF!,'Pop calcs'!#REF!,\"'\"))","v":0},{"$f":"IF($D$5='Pop calcs'!$D$3,'Pop calcs'!I64,IF($D$5='Pop calcs'!#REF!,'Pop calcs'!#REF!,\"'\"))","v":0},null,0,7.0000000000000001E-3]
[null,{"$f":"Names!I61","v":129},{"$f":"Names!F61","v":"Hornsby "},{"$f":"IF($D$5='Pop calcs'!$D$3,'Pop calcs'!F65,IF($D$5='Pop calcs'!#REF!,'Pop calcs'!#REF!,\"'\"))","v":2.7301913107549147E-3},{"$f":"IF($D$5='Pop calcs'!$D$3,'Pop calcs'!I65,IF($D$5='Pop calcs'!#REF!,'Pop calcs'!#REF!,\"'\"))","v":4.6252810747730057E-3},null,0,7.0000000000000001E-3]
[null,{"$f":"Names!I62","v":131},{"$f":"Names!F62","v":"Hunters Hill "},{"$f":"IF($D$5='Pop calcs'!$D$3,'Pop calcs'!F66,IF($D$5='Pop calcs'!#REF!,'Pop calcs'!#REF!,\"'\"))","v":0},{"$f":"IF($D$5='Pop calcs'!$D$3,'Pop calcs'!I66,IF($D$5='Pop calcs'!#REF!,'Pop calcs'!#REF!,\"'\"))","v":1.4707427250761635E-3},null,0,7.0000000000000001E-3]
[null,{"$f":"Names!I63","v":2083},{"$f":"Names!F63","v":"Inner West"},{"$f":"IF($D$5='Pop calcs'!$D$3,'Pop calcs'!F67,IF($D$5='Pop calcs'!#REF!,'Pop calcs'!#REF!,\"'\"))","v":5.7791948983658692E-3},{"$f":"IF($D$5='Pop calcs'!$D$3,'Pop calcs'!I67,IF($D$5='Pop calcs'!#REF!,'Pop calcs'!#REF!,\"'\"))","v":2.374927319034633E-4},null,6.0000000000000001E-3,1.2999999999999999E-2]
[null,{"$f":"Names!I64","v":133},{"$f":"Names!F64","v":"Inverell "},{"$f":"IF($D$5='Pop calcs'!$D$3,'Pop calcs'!F68,IF($D$5='Pop calcs'!#REF!,'Pop calcs'!#REF!,\"'\"))","v":0},{"$f":"IF($D$5='Pop calcs'!$D$3,'Pop calcs'!I68,IF($D$5='Pop calcs'!#REF!,'Pop calcs'!#REF!,\"'\"))","v":3.3141423088278714E-2},null,0,7.0000000000000001E-3]
[null,{"$f":"Names!I65","v":135},{"$f":"Names!F65","v":"Junee "},{"$f":"IF($D$5='Pop calcs'!$D$3,'Pop calcs'!F69,IF($D$5='Pop calcs'!#REF!,'Pop calcs'!#REF!,\"'\"))","v":0},{"$f":"IF($D$5='Pop calcs'!$D$3,'Pop calcs'!I69,IF($D$5='Pop calcs'!#REF!,'Pop calcs'!#REF!,\"'\"))","v":5.1736881005173688E-3},null,0,7.0000000000000001E-3]
[null,{"$f":"Names!I66","v":136},{"$f":"Names!F66","v":"Kempsey "},{"$f":"IF($D$5='Pop calcs'!$D$3,'Pop calcs'!F70,IF($D$5='Pop calcs'!#REF!,'Pop calcs'!#REF!,\"'\"))","v":6.0184251227219931E-3},{"$f":"IF($D$5='Pop calcs'!$D$3,'Pop calcs'!I70,IF($D$5='Pop calcs'!#REF!,'Pop calcs'!#REF!,\"'\"))","v":5.076142131979695E-3},null,1E-3,8.0000000000000002E-3]
[null,{"$f":"Names!I67","v":137},{"$f":"Names!F67","v":"Kiama "},{"$f":"IF($D$5='Pop calcs'!$D$3,'Pop calcs'!F71,IF($D$5='Pop calcs'!#REF!,'Pop calcs'!#REF!,\"'\"))","v":1.2915365864089257E-2},{"$f":"IF($D$5='Pop calcs'!$D$3,'Pop calcs'!I71,IF($D$5='Pop calcs'!#REF!,'Pop calcs'!#REF!,\"'\"))","v":4.1960389392413566E-3},null,8.9999999999999993E-3,1.6E-2]
[null,{"$f":"Names!I68","v":139},{"$f":"Names!F68","v":"Ku-ring-gai"},{"$f":"IF($D$5='Pop calcs'!$D$3,'Pop calcs'!F72,IF($D$5='Pop calcs'!#REF!,'Pop calcs'!#REF!,\"'\"))","v":4.1234192903627509E-3},{"$f":"IF($D$5='Pop calcs'!$D$3,'Pop calcs'!I72,IF($D$5='Pop calcs'!#REF!,'Pop calcs'!#REF!,\"'\"))","v":8.7285729309075615E-3},null,0,7.0000000000000001E-3]
[null,{"$f":"Names!I69","v":140},{"$f":"Names!F69","v":"Kyogle"},{"$f":"IF($D$5='Pop calcs'!$D$3,'Pop calcs'!F73,IF($D$5='Pop calcs'!#REF!,'Pop calcs'!#REF!,\"'\"))","v":0},{"$f":"IF($D$5='Pop calcs'!$D$3,'Pop calcs'!I73,IF($D$5='Pop calcs'!#REF!,'Pop calcs'!#REF!,\"'\"))","v":6.8287353182190655E-3},null,0,7.0000000000000001E-3]
[null,{"$f":"Names!I70","v":141},{"$f":"Names!F70","v":"Lachlan "},{"$f":"IF($D$5='Pop calcs'!$D$3,'Pop calcs'!F74,IF($D$5='Pop calcs'!#REF!,'Pop calcs'!#REF!,\"'\"))","v":0},{"$f":"IF($D$5='Pop calcs'!$D$3,'Pop calcs'!I74,IF($D$5='Pop calcs'!#REF!,'Pop calcs'!#REF!,\"'\"))","v":5.324104884866232E-4},null,0,7.0000000000000001E-3]
[null,{"$f":"Names!I71","v":142},{"$f":"Names!F71","v":"Lake Macquarie "},{"$f":"IF($D$5='Pop calcs'!$D$3,'Pop calcs'!F75,IF($D$5='Pop calcs'!#REF!,'Pop calcs'!#REF!,\"'\"))","v":9.2289010321797704E-3},{"$f":"IF($D$5='Pop calcs'!$D$3,'Pop calcs'!I75,IF($D$5='Pop calcs'!#REF!,'Pop calcs'!#REF!,\"'\"))","v":8.7544709818853129E-3},null,0,{"$f":"ROUND($D$4+G78,3)","v":7.0000000000000001E-3}]
[null,{"$f":"Names!I72","v":143},{"$f":"Names!F72","v":"Lane Cove "},{"$f":"IF($D$5='Pop calcs'!$D$3,'Pop calcs'!F76,IF($D$5='Pop calcs'!#REF!,'Pop calcs'!#REF!,\"'\"))","v":1.0117623604465775E-2},{"$f":"IF($D$5='Pop calcs'!$D$3,'Pop calcs'!I76,IF($D$5='Pop calcs'!#REF!,'Pop calcs'!#REF!,\"'\"))","v":2.4008643111520147E-2},null,{"$f":"IFERROR(MAX(0,ROUND(D79-E79,3)),0)","v":0},7.0000000000000001E-3]
[null,{"$f":"Names!I73","v":144},{"$f":"Names!F73","v":"Leeton "},{"$f":"IF($D$5='Pop calcs'!$D$3,'Pop calcs'!F77,IF($D$5='Pop calcs'!#REF!,'Pop calcs'!#REF!,\"'\"))","v":0},{"$f":"IF($D$5='Pop calcs'!$D$3,'Pop calcs'!I77,IF($D$5='Pop calcs'!#REF!,'Pop calcs'!#REF!,\"'\"))","v":1.2053033346725592E-3},null,0,7.0000000000000001E-3]
[null,{"$f":"Names!I74","v":146},{"$f":"Names!F74","v":"Lismore "},{"$f":"IF($D$5='Pop calcs'!$D$3,'Pop calcs'!F78,IF($D$5='Pop calcs'!#REF!,'Pop calcs'!#REF!,\"'\"))","v":0},{"$f":"IF($D$5='Pop calcs'!$D$3,'Pop calcs'!I78,IF($D$5='Pop calcs'!#REF!,'Pop calcs'!#REF!,\"'\"))","v":2.899764796855366E-3},null,0,7.0000000000000001E-3]
[null,{"$f":"Names!I75","v":2044},{"$f":"Names!F75","v":"Lithgow "},{"$f":"IF($D$5='Pop calcs'!$D$3,'Pop calcs'!F79,IF($D$5='Pop calcs'!#REF!,'Pop calcs'!#REF!,\"'\"))","v":0},{"$f":"IF($D$5='Pop calcs'!$D$3,'Pop calcs'!I79,IF($D$5='Pop calcs'!#REF!,'Pop calcs'!#REF!,\"'\"))","v":2.1606049693914295E-4},null,0,7.0000000000000001E-3]
[null,{"$f":"Names!I76","v":147},{"$f":"Names!F76","v":"Liverpool "},{"$f":"IF($D$5='Pop calcs'!$D$3,'Pop calcs'!F80,IF($D$5='Pop calcs'!#REF!,'Pop calcs'!#REF!,\"'\"))","v":1.648465138763755E-2},{"$f":"IF($D$5='Pop calcs'!$D$3,'Pop calcs'!I80,IF($D$5='Pop calcs'!#REF!,'Pop calcs'!#REF!,\"'\"))","v":1.3646767946996843E-2},null,3.0000000000000001E-3,0.01]
[null,{"$f":"Names!I77","v":2040},{"$f":"Names!F77","v":"Liverpool Plains "},{"$f":"IF($D$5='Pop calcs'!$D$3,'Pop calcs'!F81,IF($D$5='Pop calcs'!#REF!,'Pop calcs'!#REF!,\"'\"))","v":0},{"$f":"IF($D$5='Pop calcs'!$D$3,'Pop calcs'!I81,IF($D$5='Pop calcs'!#REF!,'Pop calcs'!#REF!,\"'\"))","v":2.4012806830309499E-3},null,0,7.0000000000000001E-3]
[null,{"$f":"Names!I78","v":148},{"$f":"Names!F78","v":"Lockhart "},{"$f":"IF($D$5='Pop calcs'!$D$3,'Pop calcs'!F82,IF($D$5='Pop calcs'!#REF!,'Pop calcs'!#REF!,\"'\"))","v":0},{"$f":"IF($D$5='Pop calcs'!$D$3,'Pop calcs'!I82,IF($D$5='Pop calcs'!#REF!,'Pop calcs'!#REF!,\"'\"))","v":4.0371417036737988E-4},null,0,7.0000000000000001E-3]
[null,{"$f":"Names!I79","v":150},{"$f":"Names!F79","v":"Maitland "},{"$f":"IF($D$5='Pop calcs'!$D$3,'Pop calcs'!F83,IF($D$5='Pop calcs'!#REF!,'Pop calcs'!#REF!,\"'\"))","v":2.630497328401149E-2},{"$f":"IF($D$5='Pop calcs'!$D$3,'Pop calcs'!I83,IF($D$5='Pop calcs'!#REF!,'Pop calcs'!#REF!,\"'\"))","v":3.1032336465218295E-2},null,0,7.0000000000000001E-3]
[null,{"$f":"Names!I80","v":2084},{"$f":"Names!F80","v":"Mid-Coast"},{"$f":"IF($D$5='Pop calcs'!$D$3,'Pop calcs'!F84,IF($D$5='Pop calcs'!#REF!,'Pop calcs'!#REF!,\"'\"))","v":6.064417112527476E-3},{"$f":"IF($D$5='Pop calcs'!$D$3,'Pop calcs'!I84,IF($D$5='Pop calcs'!#REF!,'Pop calcs'!#REF!,\"'\"))","v":3.851396131097523E-3},null,2E-3,8.9999999999999993E-3]
[null,{"$f":"Names!I81","v":2042},{"$f":"Names!F81","v":"Mid-Western Regional"},{"$f":"IF($D$5='Pop calcs'!$D$3,'Pop calcs'!F85,IF($D$5='Pop calcs'!#REF!,'Pop calcs'!#REF!,\"'\"))","v":4.7132446134348083E-3},{"$f":"IF($D$5='Pop calcs'!$D$3,'Pop calcs'!I85,IF($D$5='Pop calcs'!#REF!,'Pop calcs'!#REF!,\"'\"))","v":4.9403194980346902E-3},null,0,7.0000000000000001E-3]
[null,{"$f":"Names!I82","v":155},{"$f":"Names!F82","v":"Moree Plains "},{"$f":"IF($D$5='Pop calcs'!$D$3,'Pop calcs'!F86,IF($D$5='Pop calcs'!#REF!,'Pop calcs'!#REF!,\"'\"))","v":0},{"$f":"IF($D$5='Pop calcs'!$D$3,'Pop calcs'!I86,IF($D$5='Pop calcs'!#REF!,'Pop calcs'!#REF!,\"'\"))","v":0},null,0,7.0000000000000001E-3]
[null,{"$f":"Names!I83","v":156},{"$f":"Names!F83","v":"Mosman "},{"$f":"IF($D$5='Pop calcs'!$D$3,'Pop calcs'!F87,IF($D$5='Pop calcs'!#REF!,'Pop calcs'!#REF!,\"'\"))","v":0},{"$f":"IF($D$5='Pop calcs'!$D$3,'Pop calcs'!I87,IF($D$5='Pop calcs'!#REF!,'Pop calcs'!#REF!,\"'\"))","v":2.9144605819206293E-4},null,0,7.0000000000000001E-3]
[null,{"$f":"Names!I84","v":2085},{"$f":"Names!F84","v":"Murray River"},{"$f":"IF($D$5='Pop calcs'!$D$3,'Pop calcs'!F88,IF($D$5='Pop calcs'!#REF!,'Pop calcs'!#REF!,\"'\"))","v":1.7494636078560832E-2},{"$f":"IF($D$5='Pop calcs'!$D$3,'Pop calcs'!I88,IF($D$5='Pop calcs'!#REF!,'Pop calcs'!#REF!,\"'\"))","v":9.1986723565670933E-3},null,8.0000000000000002E-3,1.4999999999999999E-2]
[null,{"$f":"Names!I85","v":2086},{"$f":"Names!F85","v":"Murrumbidgee (new)"},{"$f":"IF($D$5='Pop calcs'!$D$3,'Pop calcs'!F89,IF($D$5='Pop calcs'!#REF!,'Pop calcs'!#REF!,\"'\"))","v":0},{"$f":"IF($D$5='Pop calcs'!$D$3,'Pop calcs'!I89,IF($D$5='Pop calcs'!#REF!,'Pop calcs'!#REF!,\"'\"))","v":0},null,0,7.0000000000000001E-3]
[null,{"$f":"Names!I86","v":162},{"$f":"Names!F86","v":"Muswellbrook "},{"$f":"IF($D$5='Pop calcs'!$D$3,'Pop calcs'!F90,IF($D$5='Pop calcs'!#REF!,'Pop calcs'!#REF!,\"'\"))","v":0},{"$f":"IF($D$5='Pop calcs'!$D$3,'Pop calcs'!I90,IF($D$5='Pop calcs'!#REF!,'Pop calcs'!#REF!,\"'\"))","v":5.2984990407403225E-2},null,0,7.0000000000000001E-3]
[null,{"$f":"Names!I87","v":163},{"$f":"Names!F87","v":"Nambucca "},{"$f":"IF($D$5='Pop calcs'!$D$3,'Pop calcs'!F91,IF($D$5='Pop calcs'!#REF!,'Pop calcs'!#REF!,\"'\"))","v":2.9794970205030413E-3},{"$f":"IF($D$5='Pop calcs'!$D$3,'Pop calcs'!I91,IF($D$5='Pop calcs'!#REF!,'Pop calcs'!#REF!,\"'\"))","v":6.9284064665127024E-3},null,0,7.0000000000000001E-3]
[null,{"$f":"Names!I88","v":164},{"$f":"Names!F88","v":"Narrabri "},{"$f":"IF($D$5='Pop calcs'!$D$3,'Pop calcs'!F92,IF($D$5='Pop calcs'!#REF!,'Pop calcs'!#REF!,\"'\"))","v":0},{"$f":"IF($D$5='Pop calcs'!$D$3,'Pop calcs'!I92,IF($D$5='Pop calcs'!#REF!,'Pop calcs'!#REF!,\"'\"))","v":4.4319692716797166E-4},null,0,7.0000000000000001E-3]
[null,{"$f":"Names!I89","v":165},{"$f":"Names!F89","v":"Narrandera "},{"$f":"IF($D$5='Pop calcs'!$D$3,'Pop calcs'!F93,IF($D$5='Pop calcs'!#REF!,'Pop calcs'!#REF!,\"'\"))","v":0},{"$f":"IF($D$5='Pop calcs'!$D$3,'Pop calcs'!I93,IF($D$5='Pop calcs'!#REF!,'Pop calcs'!#REF!,\"'\"))","v":2.0202020202020202E-4},null,0,7.0000000000000001E-3]
[null,{"$f":"Names!I90","v":166},{"$f":"Names!F90","v":"Narromine "},{"$f":"IF($D$5='Pop calcs'!$D$3,'Pop calcs'!F94,IF($D$5='Pop calcs'!#REF!,'Pop calcs'!#REF!,\"'\"))","v":0},{"$f":"IF($D$5='Pop calcs'!$D$3,'Pop calcs'!I94,IF($D$5='Pop calcs'!#REF!,'Pop calcs'!#REF!,\"'\"))","v":0},null,0,7.0000000000000001E-3]
[null,{"$f":"Names!I91","v":167},{"$f":"Names!F91","v":"Newcastle "},{"$f":"IF($D$5='Pop calcs'!$D$3,'Pop calcs'!F95,IF($D$5='Pop calcs'!#REF!,'Pop calcs'!#REF!,\"'\"))","v":1.1006336798738747E-2},{"$f":"IF($D$5='Pop calcs'!$D$3,'Pop calcs'!I95,IF($D$5='Pop calcs'!#REF!,'Pop calcs'!#REF!,\"'\"))","v":6.0184373356045994E-3},null,5.0000000000000001E-3,1.2E-2]
[null,{"$f":"Names!I92","v":168},{"$f":"Names!F92","v":"North Sydney"},{"$f":"IF($D$5='Pop calcs'!$D$3,'Pop calcs'!F96,IF($D$5='Pop calcs'!#REF!,'Pop calcs'!#REF!,\"'\"))","v":1.827714556345672E-3},{"$f":"IF($D$5='Pop calcs'!$D$3,'Pop calcs'!I96,IF($D$5='Pop calcs'!#REF!,'Pop calcs'!#REF!,\"'\"))","v":0},null,2E-3,8.9999999999999993E-3]
[null,{"$f":"Names!I93","v":2087},{"$f":"Names!F93","v":"Northern Beaches"},{"$f":"IF($D$5='Pop calcs'!$D$3,'Pop calcs'!F97,IF($D$5='Pop calcs'!#REF!,'Pop calcs'!#REF!,\"'\"))","v":2.3115552158121666E-3},{"$f":"IF($D$5='Pop calcs'!$D$3,'Pop calcs'!I97,IF($D$5='Pop calcs'!#REF!,'Pop calcs'!#REF!,\"'\"))","v":5.0744490768314474E-3},null,0,7.0000000000000001E-3]
[null,{"$f":"Names!I94","v":2045},{"$f":"Names!F94","v":"Oberon"},{"$f":"IF($D$5='Pop calcs'!$D$3,'Pop calcs'!F98,IF($D$5='Pop calcs'!#REF!,'Pop calcs'!#REF!,\"'\"))","v":1.4784697837737504E-3},{"$f":"IF($D$5='Pop calcs'!$D$3,'Pop calcs'!I98,IF($D$5='Pop calcs'!#REF!,'Pop calcs'!#REF!,\"'\"))","v":3.5087719298245615E-3},null,0,7.0000000000000001E-3]
[null,{"$f":"Names!I95","v":172},{"$f":"Names!F95","v":"Orange "},{"$f":"IF($D$5='Pop calcs'!$D$3,'Pop calcs'!F99,IF($D$5='Pop calcs'!#REF!,'Pop calcs'!#REF!,\"'\"))","v":1.3664742608081593E-3},{"$f":"IF($D$5='Pop calcs'!$D$3,'Pop calcs'!I99,IF($D$5='Pop calcs'!#REF!,'Pop calcs'!#REF!,\"'\"))","v":7.8172855351048617E-3},null,0,7.0000000000000001E-3]
[null,{"$f":"Names!I96","v":173},{"$f":"Names!F96","v":"Parkes "},{"$f":"IF($D$5='Pop calcs'!$D$3,'Pop calcs'!F100,IF($D$5='Pop calcs'!#REF!,'Pop calcs'!#REF!,\"'\"))","v":0},{"$f":"IF($D$5='Pop calcs'!$D$3,'Pop calcs'!I100,IF($D$5='Pop calcs'!#REF!,'Pop calcs'!#REF!,\"'\"))","v":0},null,0,7.0000000000000001E-3]
[null,{"$f":"Names!I97","v":2089},{"$f":"Names!F97","v":"Parramatta "},{"$f":"IF($D$5='Pop calcs'!$D$3,'Pop calcs'!F101,IF($D$5='Pop calcs'!#REF!,'Pop calcs'!#REF!,\"'\"))","v":1.2454588594055016E-2},{"$f":"IF($D$5='Pop calcs'!$D$3,'Pop calcs'!I101,IF($D$5='Pop calcs'!#REF!,'Pop calcs'!#REF!,\"'\"))","v":1.5553313151698622E-2},null,0,7.0000000000000001E-3]
[null,{"$f":"Names!I98","v":176},{"$f":"Names!F98","v":"Penrith "},{"$f":"IF($D$5='Pop calcs'!$D$3,'Pop calcs'!F102,IF($D$5='Pop calcs'!#REF!,'Pop calcs'!#REF!,\"'\"))","v":1.5675482756029702E-2},{"$f":"IF($D$5='Pop calcs'!$D$3,'Pop calcs'!I102,IF($D$5='Pop calcs'!#REF!,'Pop calcs'!#REF!,\"'\"))","v":8.2510177552561313E-3},null,7.0000000000000001E-3,1.4E-2]
[null,{"$f":"Names!I99","v":124},{"$f":"Names!F99","v":"Port Macquarie-Hastings"},{"$f":"IF($D$5='Pop calcs'!$D$3,'Pop calcs'!F103,IF($D$5='Pop calcs'!#REF!,'Pop calcs'!#REF!,\"'\"))","v":1.7002898893687446E-2},{"$f":"IF($D$5='Pop calcs'!$D$3,'Pop calcs'!I103,IF($D$5='Pop calcs'!#REF!,'Pop calcs'!#REF!,\"'\"))","v":7.0954539369250487E-3},null,0.01,1.7000000000000001E-2]
[null,{"$f":"Names!I100","v":178},{"$f":"Names!F100","v":"Port Stephens"},{"$f":"IF($D$5='Pop calcs'!$D$3,'Pop calcs'!F104,IF($D$5='Pop calcs'!#REF!,'Pop calcs'!#REF!,\"'\"))","v":1.4073388501742112E-2},{"$f":"IF($D$5='Pop calcs'!$D$3,'Pop calcs'!I104,IF($D$5='Pop calcs'!#REF!,'Pop calcs'!#REF!,\"'\"))","v":7.6654732396952167E-3},null,6.0000000000000001E-3,1.2999999999999999E-2]
[null,{"$f":"Names!I101","v":2095},{"$f":"Names!F101","v":"Queanbeyan-Palerang Regional"},{"$f":"IF($D$5='Pop calcs'!$D$3,'Pop calcs'!F105,IF($D$5='Pop calcs'!#REF!,'Pop calcs'!#REF!,\"'\"))","v":1.8824993042937388E-2},{"$f":"IF($D$5='Pop calcs'!$D$3,'Pop calcs'!I105,IF($D$5='Pop calcs'!#REF!,'Pop calcs'!#REF!,\"'\"))","v":1.9637099997335535E-2},null,0,7.0000000000000001E-3]
[null,{"$f":"Names!I102","v":181},{"$f":"Names!F102","v":"Randwick "},{"$f":"IF($D$5='Pop calcs'!$D$3,'Pop calcs'!F106,IF($D$5='Pop calcs'!#REF!,'Pop calcs'!#REF!,\"'\"))","v":7.0601397881957517E-3},{"$f":"IF($D$5='Pop calcs'!$D$3,'Pop calcs'!I106,IF($D$5='Pop calcs'!#REF!,'Pop calcs'!#REF!,\"'\"))","v":7.8920279080407188E-4},null,6.0000000000000001E-3,1.2999999999999999E-2]
[null,{"$f":"Names!I103","v":1981},{"$f":"Names!F103","v":"Richmond Valley"},{"$f":"IF($D$5='Pop calcs'!$D$3,'Pop calcs'!F107,IF($D$5='Pop calcs'!#REF!,'Pop calcs'!#REF!,\"'\"))","v":1.1934191458529142E-3},{"$f":"IF($D$5='Pop calcs'!$D$3,'Pop calcs'!I107,IF($D$5='Pop calcs'!#REF!,'Pop calcs'!#REF!,\"'\"))","v":3.1119544592030359E-3},null,0,{"$f":"ROUND($D$4+G110,3)","v":7.0000000000000001E-3}]
[null,{"$f":"Names!I104","v":184},{"$f":"Names!F104","v":"Ryde "},{"$f":"IF($D$5='Pop calcs'!$D$3,'Pop calcs'!F108,IF($D$5='Pop calcs'!#REF!,'Pop calcs'!#REF!,\"'\"))","v":1.5535194304270306E-2},{"$f":"IF($D$5='Pop calcs'!$D$3,'Pop calcs'!I108,IF($D$5='Pop calcs'!#REF!,'Pop calcs'!#REF!,\"'\"))","v":2.8841953982500387E-2},null,0,7.0000000000000001E-3]
[null,{"$f":"Names!I105","v":188},{"$f":"Names!F105","v":"Shellharbour "},{"$f":"IF($D$5='Pop calcs'!$D$3,'Pop calcs'!F109,IF($D$5='Pop calcs'!#REF!,'Pop calcs'!#REF!,\"'\"))","v":1.9078183680437011E-2},{"$f":"IF($D$5='Pop calcs'!$D$3,'Pop calcs'!I109,IF($D$5='Pop calcs'!#REF!,'Pop calcs'!#REF!,\"'\"))","v":5.3556687539009808E-3},null,1.4E-2,2.1000000000000001E-2]
[null,{"$f":"Names!I106","v":189},{"$f":"Names!F106","v":"Shoalhaven "},{"$f":"IF($D$5='Pop calcs'!$D$3,'Pop calcs'!F110,IF($D$5='Pop calcs'!#REF!,'Pop calcs'!#REF!,\"'\"))","v":1.4710754754489352E-2},{"$f":"IF($D$5='Pop calcs'!$D$3,'Pop calcs'!I110,IF($D$5='Pop calcs'!#REF!,'Pop calcs'!#REF!,\"'\"))","v":4.9845440494590415E-3},null,0.01,1.7000000000000001E-2]
[null,{"$f":"Names!I107","v":190},{"$f":"Names!F107","v":"Singleton"},{"$f":"IF($D$5='Pop calcs'!$D$3,'Pop calcs'!F111,IF($D$5='Pop calcs'!#REF!,'Pop calcs'!#REF!,\"'\"))","v":0},{"$f":"IF($D$5='Pop calcs'!$D$3,'Pop calcs'!I111,IF($D$5='Pop calcs'!#REF!,'Pop calcs'!#REF!,\"'\"))","v":1.3380345357562608E-2},null,0,7.0000000000000001E-3]
[null,{"$f":"Names!I108","v":2096},{"$f":"Names!F108","v":"Snowy Monaro Regional"},{"$f":"IF($D$5='Pop calcs'!$D$3,'Pop calcs'!F112,IF($D$5='Pop calcs'!#REF!,'Pop calcs'!#REF!,\"'\"))","v":9.810994084547664E-3},{"$f":"IF($D$5='Pop calcs'!$D$3,'Pop calcs'!I112,IF($D$5='Pop calcs'!#REF!,'Pop calcs'!#REF!,\"'\"))","v":8.5831647354546008E-3},null,1E-3,8.0000000000000002E-3]
[null,{"$f":"Names!I109","v":2097},{"$f":"Names!F109","v":"Snowy Valleys"},{"$f":"IF($D$5='Pop calcs'!$D$3,'Pop calcs'!F113,IF($D$5='Pop calcs'!#REF!,'Pop calcs'!#REF!,\"'\"))","v":0},{"$f":"IF($D$5='Pop calcs'!$D$3,'Pop calcs'!I113,IF($D$5='Pop calcs'!#REF!,'Pop calcs'!#REF!,\"'\"))","v":1.0628122010840685E-3},null,0,7.0000000000000001E-3]
[null,{"$f":"Names!I110","v":193},{"$f":"Names!F110","v":"Strathfield "},{"$f":"IF($D$5='Pop calcs'!$D$3,'Pop calcs'!F114,IF($D$5='Pop calcs'!#REF!,'Pop calcs'!#REF!,\"'\"))","v":1.8573012623677831E-2},{"$f":"IF($D$5='Pop calcs'!$D$3,'Pop calcs'!I114,IF($D$5='Pop calcs'!#REF!,'Pop calcs'!#REF!,\"'\"))","v":1.4168611910319744E-2},null,4.0000000000000001E-3,1.0999999999999999E-2]
[null,{"$f":"Names!I111","v":194},{"$f":"Names!F111","v":"Sutherland "},{"$f":"IF($D$5='Pop calcs'!$D$3,'Pop calcs'!F115,IF($D$5='Pop calcs'!#REF!,'Pop calcs'!#REF!,\"'\"))","v":7.7630660207563817E-3},{"$f":"IF($D$5='Pop calcs'!$D$3,'Pop calcs'!I115,IF($D$5='Pop calcs'!#REF!,'Pop calcs'!#REF!,\"'\"))","v":8.7970712096546132E-3},null,0,7.0000000000000001E-3]
[null,{"$f":"Names!I112","v":2029},{"$f":"Names!F112","v":"Sydney "},{"$f":"IF($D$5='Pop calcs'!$D$3,'Pop calcs'!F116,IF($D$5='Pop calcs'!#REF!,'Pop calcs'!#REF!,\"'\"))","v":1.1360402046010742E-2},{"$f":"IF($D$5='Pop calcs'!$D$3,'Pop calcs'!I116,IF($D$5='Pop calcs'!#REF!,'Pop calcs'!#REF!,\"'\"))","v":4.8219231966957861E-3},null,7.0000000000000001E-3,1.4E-2]
[null,{"$f":"Names!I113","v":2038},{"$f":"Names!F113","v":"Tamworth Regional"},{"$f":"IF($D$5='Pop calcs'!$D$3,'Pop calcs'!F117,IF($D$5='Pop calcs'!#REF!,'Pop calcs'!#REF!,\"'\"))","v":2.2388895108016449E-4},{"$f":"IF($D$5='Pop calcs'!$D$3,'Pop calcs'!I117,IF($D$5='Pop calcs'!#REF!,'Pop calcs'!#REF!,\"'\"))","v":6.4737140236830037E-3},null,0,7.0000000000000001E-3]
[null,{"$f":"Names!I114","v":198},{"$f":"Names!F114","v":"Temora "},{"$f":"IF($D$5='Pop calcs'!$D$3,'Pop calcs'!F118,IF($D$5='Pop calcs'!#REF!,'Pop calcs'!#REF!,\"'\"))","v":0},{"$f":"IF($D$5='Pop calcs'!$D$3,'Pop calcs'!I118,IF($D$5='Pop calcs'!#REF!,'Pop calcs'!#REF!,\"'\"))","v":7.4220682830282035E-4},null,0,7.0000000000000001E-3]
[null,{"$f":"Names!I115","v":199},{"$f":"Names!F115","v":"Tenterfield "},{"$f":"IF($D$5='Pop calcs'!$D$3,'Pop calcs'!F119,IF($D$5='Pop calcs'!#REF!,'Pop calcs'!#REF!,\"'\"))","v":0},{"$f":"IF($D$5='Pop calcs'!$D$3,'Pop calcs'!I119,IF($D$5='Pop calcs'!#REF!,'Pop calcs'!#REF!,\"'\"))","v":0},null,0,7.0000000000000001E-3]
[null,{"$f":"Names!I116","v":59},{"$f":"Names!F116","v":"Hills "},{"$f":"IF($D$5='Pop calcs'!$D$3,'Pop calcs'!F120,IF($D$5='Pop calcs'!#REF!,'Pop calcs'!#REF!,\"'\"))","v":3.2957336435729179E-2},{"$f":"IF($D$5='Pop calcs'!$D$3,'Pop calcs'!I120,IF($D$5='Pop calcs'!#REF!,'Pop calcs'!#REF!,\"'\"))","v":2.4450338615647677E-2},null,8.9999999999999993E-3,1.6E-2]
[null,{"$f":"Names!I117","v":202},{"$f":"Names!F117","v":"Tweed "},{"$f":"IF($D$5='Pop calcs'!$D$3,'Pop calcs'!F121,IF($D$5='Pop calcs'!#REF!,'Pop calcs'!#REF!,\"'\"))","v":1.4404289323091124E-2},{"$f":"IF($D$5='Pop calcs'!$D$3,'Pop calcs'!I121,IF($D$5='Pop calcs'!#REF!,'Pop calcs'!#REF!,\"'\"))","v":3.9221223388399935E-3},null,0.01,1.7000000000000001E-2]
[null,{"$f":"Names!I118","v":2046},{"$f":"Names!F118","v":"Upper Hunter "},{"$f":"IF($D$5='Pop calcs'!$D$3,'Pop calcs'!F122,IF($D$5='Pop calcs'!#REF!,'Pop calcs'!#REF!,\"'\"))","v":0},{"$f":"IF($D$5='Pop calcs'!$D$3,'Pop calcs'!I122,IF($D$5='Pop calcs'!#REF!,'Pop calcs'!#REF!,\"'\"))","v":1.6219138583528565E-3},null,0,7.0000000000000001E-3]
[null,{"$f":"Names!I119","v":2035},{"$f":"Names!F119","v":"Upper Lachlan "},{"$f":"IF($D$5='Pop calcs'!$D$3,'Pop calcs'!F123,IF($D$5='Pop calcs'!#REF!,'Pop calcs'!#REF!,\"'\"))","v":2.6678247921578357E-2},{"$f":"IF($D$5='Pop calcs'!$D$3,'Pop calcs'!I123,IF($D$5='Pop calcs'!#REF!,'Pop calcs'!#REF!,\"'\"))","v":9.5563139931740607E-3},null,1.7000000000000001E-2,2.4E-2]
[null,{"$f":"Names!I120","v":204},{"$f":"Names!F120","v":"Uralla "},{"$f":"IF($D$5='Pop calcs'!$D$3,'Pop calcs'!F124,IF($D$5='Pop calcs'!#REF!,'Pop calcs'!#REF!,\"'\"))","v":0},{"$f":"IF($D$5='Pop calcs'!$D$3,'Pop calcs'!I124,IF($D$5='Pop calcs'!#REF!,'Pop calcs'!#REF!,\"'\"))","v":0},null,0,7.0000000000000001E-3]
[null,{"$f":"Names!I121","v":206},{"$f":"Names!F121","v":"Wagga Wagga "},{"$f":"IF($D$5='Pop calcs'!$D$3,'Pop calcs'!F125,IF($D$5='Pop calcs'!#REF!,'Pop calcs'!#REF!,\"'\"))","v":7.9847967018651378E-3},{"$f":"IF($D$5='Pop calcs'!$D$3,'Pop calcs'!I125,IF($D$5='Pop calcs'!#REF!,'Pop calcs'!#REF!,\"'\"))","v":1.0961083732956178E-2},null,0,7.0000000000000001E-3]
[null,{"$f":"Names!I122","v":208},{"$f":"Names!F122","v":"Walcha"},{"$f":"IF($D$5='Pop calcs'!$D$3,'Pop calcs'!F126,IF($D$5='Pop calcs'!#REF!,'Pop calcs'!#REF!,\"'\"))","v":0},{"$f":"IF($D$5='Pop calcs'!$D$3,'Pop calcs'!I126,IF($D$5='Pop calcs'!#REF!,'Pop calcs'!#REF!,\"'\"))","v":0},null,0,7.0000000000000001E-3]
[null,{"$f":"Names!I123","v":209},{"$f":"Names!F123","v":"Walgett "},{"$f":"IF($D$5='Pop calcs'!$D$3,'Pop calcs'!F127,IF($D$5='Pop calcs'!#REF!,'Pop calcs'!#REF!,\"'\"))","v":0},{"$f":"IF($D$5='Pop calcs'!$D$3,'Pop calcs'!I127,IF($D$5='Pop calcs'!#REF!,'Pop calcs'!#REF!,\"'\"))","v":1.7661603673613564E-4},null,0,7.0000000000000001E-3]
[null,{"$f":"Names!I124","v":210},{"$f":"Names!F124","v":"Warren "},{"$f":"IF($D$5='Pop calcs'!$D$3,'Pop calcs'!F128,IF($D$5='Pop calcs'!#REF!,'Pop calcs'!#REF!,\"'\"))","v":7.0448646644418744E-3},{"$f":"IF($D$5='Pop calcs'!$D$3,'Pop calcs'!I128,IF($D$5='Pop calcs'!#REF!,'Pop calcs'!#REF!,\"'\"))","v":1.0201999591920017E-3},null,6.0000000000000001E-3,1.2999999999999999E-2]
[null,{"$f":"Names!I125","v":2050},{"$f":"Names!F125","v":"Warrumbungle "},{"$f":"IF($D$5='Pop calcs'!$D$3,'Pop calcs'!F129,IF($D$5='Pop calcs'!#REF!,'Pop calcs'!#REF!,\"'\"))","v":0},{"$f":"IF($D$5='Pop calcs'!$D$3,'Pop calcs'!I129,IF($D$5='Pop calcs'!#REF!,'Pop calcs'!#REF!,\"'\"))","v":7.3592542622347601E-4},null,0,7.0000000000000001E-3]
[null,{"$f":"Names!I126","v":212},{"$f":"Names!F126","v":"Waverley"},{"$f":"IF($D$5='Pop calcs'!$D$3,'Pop calcs'!F130,IF($D$5='Pop calcs'!#REF!,'Pop calcs'!#REF!,\"'\"))","v":7.27547088464231E-4},{"$f":"IF($D$5='Pop calcs'!$D$3,'Pop calcs'!I130,IF($D$5='Pop calcs'!#REF!,'Pop calcs'!#REF!,\"'\"))","v":0},null,1E-3,8.0000000000000002E-3]
[null,{"$f":"Names!I127","v":213},{"$f":"Names!F127","v":"Weddin "},{"$f":"IF($D$5='Pop calcs'!$D$3,'Pop calcs'!F131,IF($D$5='Pop calcs'!#REF!,'Pop calcs'!#REF!,\"'\"))","v":0},{"$f":"IF($D$5='Pop calcs'!$D$3,'Pop calcs'!I131,IF($D$5='Pop calcs'!#REF!,'Pop calcs'!#REF!,\"'\"))","v":0},null,0,7.0000000000000001E-3]
[null,{"$f":"Names!I128","v":215},{"$f":"Names!F128","v":"Wentworth "},{"$f":"IF($D$5='Pop calcs'!$D$3,'Pop calcs'!F132,IF($D$5='Pop calcs'!#REF!,'Pop calcs'!#REF!,\"'\"))","v":5.2459946122218604E-3},{"$f":"IF($D$5='Pop calcs'!$D$3,'Pop calcs'!I132,IF($D$5='Pop calcs'!#REF!,'Pop calcs'!#REF!,\"'\"))","v":1.0244735344336939E-2},null,0,7.0000000000000001E-3]
[null,{"$f":"Names!I129","v":216},{"$f":"Names!F129","v":"Willoughby "},{"$f":"IF($D$5='Pop calcs'!$D$3,'Pop calcs'!F133,IF($D$5='Pop calcs'!#REF!,'Pop calcs'!#REF!,\"'\"))","v":1.0726306575101763E-3},{"$f":"IF($D$5='Pop calcs'!$D$3,'Pop calcs'!I133,IF($D$5='Pop calcs'!#REF!,'Pop calcs'!#REF!,\"'\"))","v":5.4209986253896342E-4},null,1E-3,8.0000000000000002E-3]
[null,{"$f":"Names!I130","v":218},{"$f":"Names!F130","v":"Wingecarribee "},{"$f":"IF($D$5='Pop calcs'!$D$3,'Pop calcs'!F134,IF($D$5='Pop calcs'!#REF!,'Pop calcs'!#REF!,\"'\"))","v":1.2380933753202816E-2},{"$f":"IF($D$5='Pop calcs'!$D$3,'Pop calcs'!I134,IF($D$5='Pop calcs'!#REF!,'Pop calcs'!#REF!,\"'\"))","v":7.6882238433254027E-3},null,5.0000000000000001E-3,1.2E-2]
[null,{"$f":"Names!I131","v":219},{"$f":"Names!F131","v":"Wollondilly "},{"$f":"IF($D$5='Pop calcs'!$D$3,'Pop calcs'!F135,IF($D$5='Pop calcs'!#REF!,'Pop calcs'!#REF!,\"'\"))","v":1.6220386504337325E-2},{"$f":"IF($D$5='Pop calcs'!$D$3,'Pop calcs'!I135,IF($D$5='Pop calcs'!#REF!,'Pop calcs'!#REF!,\"'\"))","v":1.0600890787383117E-2},null,6.0000000000000001E-3,1.2999999999999999E-2]
[null,{"$f":"Names!I132","v":220},{"$f":"Names!F132","v":"Wollongong "},{"$f":"IF($D$5='Pop calcs'!$D$3,'Pop calcs'!F136,IF($D$5='Pop calcs'!#REF!,'Pop calcs'!#REF!,\"'\"))","v":7.8963297199141635E-3},{"$f":"IF($D$5='Pop calcs'!$D$3,'Pop calcs'!I136,IF($D$5='Pop calcs'!#REF!,'Pop calcs'!#REF!,\"'\"))","v":4.8486767275243018E-3},null,3.0000000000000001E-3,0.01]
[null,{"$f":"Names!I133","v":221},{"$f":"Names!F133","v":"Woollahra "},{"$f":"IF($D$5='Pop calcs'!$D$3,'Pop calcs'!F137,IF($D$5='Pop calcs'!#REF!,'Pop calcs'!#REF!,\"'\"))","v":1.449153256382063E-3},{"$f":"IF($D$5='Pop calcs'!$D$3,'Pop calcs'!I137,IF($D$5='Pop calcs'!#REF!,'Pop calcs'!#REF!,\"'\"))","v":1.7601705630066688E-3},null,0,7.0000000000000001E-3]
[null,{"$f":"Names!I134","v":2036},{"$f":"Names!F134","v":"Yass Valley"},{"$f":"IF($D$5='Pop calcs'!$D$3,'Pop calcs'!F138,IF($D$5='Pop calcs'!#REF!,'Pop calcs'!#REF!,\"'\"))","v":1.3753950602832798E-2},{"$f":"IF($D$5='Pop calcs'!$D$3,'Pop calcs'!I138,IF($D$5='Pop calcs'!#REF!,'Pop calcs'!#REF!,\"'\"))","v":7.8660934784597087E-3},null,{"$f":"IFERROR(MAX(0,D141-E141),0)","v":5.8878571243730898E-3},1.2999999999999999E-2]

{"sheet":"Names","index":5,"n_rows":134,"n_cols":9,"rows_kept":134,"cut":false,"hidden":false,"merged":[]}
[]
[]
[null,"LGA and Council names"]
[]
[null,"LGA code","Local Government Area",null,"Council name","Council Name","Rate peg order name","OLG Group","OrgID"]
[]
[null,10050,"Albury (C)",null,"Albury City Council","Albury ","Albury City",4,2047]
[null,10180,"Armidale Regional (A)",null,"Armidale Regional Council","Armidale Regional","Armidale Regional",4,2079]
[null,10250,"Ballina (A)",null,"Ballina Shire Council","Ballina ","Ballina Shire",4,54]
[null,10300,"Balranald (A)",null,"Balranald Shire Council","Balranald ","Balranald Shire",9,55]
[null,10470,"Bathurst Regional (A)",null,"Bathurst Regional Council","Bathurst Regional","Bathurst Regional",4,2043]
[null,10500,"Bayside (A)",null,"Bayside Council","Bayside","Bayside",3,2099]
[null,10550,"Bega Valley (A)",null,"Bega Valley Shire Council","Bega Valley ","Bega Valley Shire",4,60]
[null,10600,"Bellingen (A)",null,"Bellingen Shire Council","Bellingen ","Bellingen Shire",11,61]
[null,10650,"Berrigan (A)",null,"Berrigan Shire Council","Berrigan ","Berrigan Shire",10,62]
[null,10750,"Blacktown (C)",null,"Blacktown City Council","Blacktown ","Blacktown City",3,64]
[null,10800,"Bland (A)",null,"Bland Shire Council","Bland ","Bland Shire",10,65]
[null,10850,"Blayney (A)",null,"Blayney Shire Council","Blayney ","Blayney Shire",10,66]
[null,10900,"Blue Mountains (C)",null,"Blue Mountains City Council","Blue Mountains ","Blue Mountains City",7,67]
[null,10950,"Bogan (A)",null,"Bogan Shire Council","Bogan ","Bogan Shire",9,68]
[null,11150,"Bourke (A)",null,"Bourke Shire Council","Bourke ","Bourke Shire",9,72]
[null,11200,"Brewarrina (A)",null,"Brewarrina Shire Council","Brewarrina ","Brewarrina Shire",8,73]
[null,11250,"Broken Hill (C)",null,"Broken Hill City Council","Broken Hill ","Broken Hill City",4,74]
[null,11300,"Burwood (A)",null,"Burwood Council","Burwood","Burwood",2,75]
[null,11350,"Byron (A)",null,"Byron Shire Council","Byron ","Byron Shire",4,76]
[null,11400,"Cabonne (A)",null,"Cabonne Council","Cabonne","Cabonne",11,77]
[null,11450,"Camden (A)",null,"Camden Council","Camden","Camden",7,78]
[null,11500,"Campbelltown (C) (NSW)",null,"Campbelltown City Council","Campbelltown ","Campbelltown City",7,79]
[null,11520,"Canada Bay (A)",null,"City of Canada Bay Council","Canada Bay ","City of Canada Bay ",3,1989]
[null,11570,"Canterbury-Bankstown (A)",null,"Canterbury-Bankstown Council","Canterbury-Bankstown","Canterbury-Bankstown",3,2080]
[null,11600,"Carrathool (A)",null,"Carrathool Shire Council","Carrathool ","Carrathool Shire",9,81]
[null,11650,"Central Coast (C) (NSW)",null,"Central Coast Council","Central Coast","Central Coast",7,2088]
[null,11700,"Central Darling (A)",null,"Central Darling Shire Council","Central Darling ","Central Darling Shire",9,83]
[null,11720,"Cessnock (C)",null,"Cessnock City Council","Cessnock ","Cessnock City",4,84]
[null,11730,"Clarence Valley (A)",null,"Clarence Valley Council","Clarence Valley","Clarence Valley",4,2037]
[null,11750,"Cobar (A)",null,"Cobar Shire Council","Cobar ","Cobar Shire",10,85]
[null,11800,"Coffs Harbour (C)",null,"Coffs Harbour City Council","Coffs Harbour ","Coffs Harbour City",5,86]
[null,12000,"Coolamon (A)",null,"Coolamon Shire Council","Coolamon ","Coolamon Shire",9,90]
[null,12150,"Coonamble (A)",null,"Coonamble Shire Council","Coonamble ","Coonamble Shire",9,93]
[null,12160,"Cootamundra-Gundagai Regional (A)",null,"Cootamundra-Gundagai Council","Cootamundra-Gundagai Regional","Cootamundra-Gundagai Regional",11,2094]
[null,12350,"Cowra (A)",null,"Corowa Shire Council","Cowra ","Cowra Shire",11,97]
[null,12380,"Cumberland (A)",null,"Cumberland Council","Cumberland","Cumberland City",3,2090]
[null,12390,"Dubbo Regional (A)",null,"Dubbo Regional Council","Dubbo Regional","Dubbo Regional",4,2098]
[null,12700,"Dungog (A)",null,"Dungog Shire Council","Dungog ","Dungog Shire",10,104]
[null,12730,"Edward River (A)",null,"Edward River Council","Edward River","Edward River",10,2091]
[null,12750,"Eurobodalla (A)",null,"Eurobodalla Shire Council","Eurobodalla ","Eurobodalla Shire",4,105]
[null,12850,"Fairfield (C)",null,"Fairfield City Council","Fairfield ","Fairfield City",3,107]
[null,12870,"Federation (A)",null,"Federation Council","Federation","Federation",11,2092]
[null,12900,"Forbes (A)",null,"Forbes Shire Council","Forbes ","Forbes Shire",10,108]
[null,12930,"Georges River (A)",null,"Georges River Council","Georges River","Georges River",3,2093]
[null,12950,"Gilgandra (A)",null,"Gilgandra Shire Council","Gilgandra ","Gilgandra Shire",9,109]
[null,13010,"Glen Innes Severn (A)",null,"Glen Innes Severn Shire Council","Glen Innes Severn","Glen Innes Severn",10,2053]
[null,13310,"Goulburn Mulwaree (A)",null,"Goulburn Mulwaree Council","Goulburn Mulwaree","Goulburn Mulwaree",4,2032]
[null,13340,"Greater Hume Shire (A)",null,"Greater Hume Shire Council","Greater Hume ","Greater Hume Shire",11,2049]
[null,13450,"Griffith (C)",null,"Griffith City Council","Griffith ","Griffith City",4,118]
[null,13550,"Gunnedah (A)",null,"Gunnedah Shire Council","Gunnedah ","Gunnedah Shire",11,120]
[null,13660,"Gwydir (A)",null,"Gwydir Shire Council","Gwydir ","Gwydir Shire",10,2039]
[null,13800,"Hawkesbury (C)",null,"Hawkesbury City Council","Hawkesbury ","Hawkesbury City",6,125]
[null,13850,"Hay (A)",null,"Hay Shire Council","Hay ","Hay Shire",9,126]
[null,13910,"Hilltops (A)",null,"Hilltops Council","Hilltops","Hilltops",11,2081]
[null,14000,"Hornsby (A)",null,"Hornsby, The Council of the Shire of","Hornsby ","Hornsby Shire",7,129]
[null,14100,"Hunters Hill (A)",null,"Hunters Hill, The Council of the Municipality of","Hunters Hill ","Hunters Hill ",2,131]
[null,14170,"Inner West (A)",null,"Inner West Council","Inner West","Inner West",3,2083]
[null,14220,"Inverell (A)",null,"Inverell Shire Council","Inverell ","Inverell Shire",11,133]
[null,14300,"Junee (A)",null,"Junee Shire Council","Junee ","Junee Shire",10,135]
[null,14350,"Kempsey (A)",null,"Kempsey Shire Council","Kempsey ","Kempsey Shire",4,136]
[null,14400,"Kiama (A)",null,"Kiama, The Council of the Municipality of","Kiama ","Kiama Municipal",4,137]
[null,14500,"Ku-ring-gai (A)",null,"Ku-ring-gai Municipal Council","Ku-ring-gai","Ku-ring-gai",3,139]
[null,14550,"Kyogle (A)",null,"Kyogle Council","Kyogle","Kyogle",10,140]
[null,14600,"Lachlan (A)",null,"Lachlan Shire Council","Lachlan ","Lachlan Shire",10,141]
[null,14650,"Lake Macquarie (C)",null,"Lake Macquarie City Council","Lake Macquarie ","Lake Macquarie City",5,142]
[null,14700,"Lane Cove (A)",null,"Lane Cove Council","Lane Cove ","Lane Cove ",2,143]
[null,14750,"Leeton (A)",null,"Leeton Shire Council","Leeton ","Leeton Shire",11,144]
[null,14850,"Lismore (C)",null,"Lismore City Council","Lismore ","Lismore City",4,146]
[null,14870,"Lithgow (C)",null,"Lithgow Council, City of","Lithgow ","Lithgow City",4,2044]
[null,14900,"Liverpool (C)",null,"Liverpool City Council","Liverpool ","Liverpool City",3,147]
[null,14920,"Liverpool Plains (A)",null,"Liverpool Plains Shire Council","Liverpool Plains ","Liverpool Plains Shire",10,2040]
[null,14950,"Lockhart (A)",null,"Lockhart Shire Council","Lockhart ","Lockhart Shire",9,148]
[null,15050,"Maitland (C)",null,"Maitland City Council","Maitland ","Maitland City",5,150]
[null,15240,"Mid-Coast (A)",null,"MidCoast Council","Mid-Coast","Mid-Coast",5,2084]
[null,15270,"Mid-Western Regional (A)",null,"Mid-Western Regional Council","Mid-Western Regional","Mid-Western Regional",4,2042]
[null,15300,"Moree Plains (A)",null,"Moree Plains Shire Council","Moree Plains ","Moree Plains Shire",11,155]
[null,15350,"Mosman (A)",null,"Mosman Municipal Council","Mosman ","Mosman ",2,156]
[null,15520,"Murray River (A)",null,"Murray River Council","Murray River","Murray River",11,2085]
[null,15560,"Murrumbidgee (A)",null,"Murrumbidgee Shire Council","Murrumbidgee (new)","Murrumbidgee ",9,2086]
[null,15650,"Muswellbrook (A)",null,"Muswellbrook Shire Council","Muswellbrook ","Muswellbrook Shire",11,162]
[null,15700,"Nambucca Valley (A)",null,"Nambucca Shire Council","Nambucca ","Nambucca Valley",11,163]
[null,15750,"Narrabri (A)",null,"Narrabri Shire Council","Narrabri ","Narrabri Shire",11,164]
[null,15800,"Narrandera (A)",null,"Narrandera Shire Council","Narrandera ","Narrandera Shire",10,165]
[null,15850,"Narromine (A)",null,"Narromine Shire Council","Narromine ","Narromine Shire",10,166]
[null,15900,"Newcastle (C)",null,"Newcastle City Council","Newcastle ","Newcastle City",5,167]
[null,15950,"North Sydney (A)",null,"North Sydney Council","North Sydney","North Sydney",3,168]
[null,15990,"Northern Beaches (A)",null,"Northern Beaches Council","Northern Beaches","Northern Beaches",3,2087]
[null,16100,"Oberon (A)",null,"Oberon Council","Oberon","Oberon",10,2045]
[null,16150,"Orange (C)",null,"Orange City Council","Orange ","Orange City",4,172]
[null,16200,"Parkes (A)",null,"Parkes Shire Council","Parkes ","Parkes Shire",11,173]
[null,16260,"Parramatta (C)",null,"City of Parramatta Council","Parramatta ","City of Parramatta",3,2089]
[null,16350,"Penrith (C)",null,"Penrith City Council","Penrith ","Penrith City",7,176]
[null,16380,"Port Macquarie-Hastings (A)",null,"Port Macquarie-Hastings Council","Port Macquarie-Hastings","Port Macquarie-Hastings",5,124]
[null,16400,"Port Stephens (A)",null,"Port Stephens Council","Port Stephens","Port Stephens",5,178]
[null,16490,"Queanbeyan-Palerang Regional (A)",null,"Queanbeyan-Palerang Regional Council","Queanbeyan-Palerang Regional","Queanbeyan-Palerang Regional",4,2095]
[null,16550,"Randwick (C)",null,"Randwick City Council","Randwick ","Randwick City",3,181]
[null,16610,"Richmond Valley (A)",null,"Richmond Valley Council","Richmond Valley","Richmond Valley",4,1981]
[null,16700,"Ryde (C)",null,"City of Ryde Council","Ryde ","City of Ryde ",3,184]
[null,16900,"Shellharbour (C)",null,"Shellharbour City Council","Shellharbour ","Shellharbour City",5,188]
[null,16950,"Shoalhaven (C)",null,"Shoalhaven City Council","Shoalhaven ","Shoalhaven City",5,189]
[null,17000,"Singleton (A)",null,"Singleton Shire Council","Singleton","Singleton",4,190]
[null,17040,"Snowy Monaro Regional (A)",null,"Snowy Monaro Regional Council","Snowy Monaro Regional","Snowy Monaro Regional",4,2096]
[null,17080,"Snowy Valleys (A)",null,"Snowy Valleys Council","Snowy Valleys","Snowy Valleys",11,2097]
[null,17100,"Strathfield (A)",null,"Strathfield Municipal Council","Strathfield ","Strathfield ",2,193]
[null,17150,"Sutherland Shire (A)",null,"Sutherland Shire Council","Sutherland ","Sutherland Shire",3,194]
[null,17200,"Sydney (C)",null,"City of Sydney Council","Sydney ","City of Sydney ",1,2029]
[null,17310,"Tamworth Regional (A)",null,"Tamworth Regional Council","Tamworth Regional","Tamworth Regional",4,2038]
[null,17350,"Temora (A)",null,"Temora Shire Council","Temora ","Temora Shire",10,198]
[null,17400,"Tenterfield (A)",null,"Tenterfield Shire Council","Tenterfield ","Tenterfield Shire",10,199]
[null,17420,"The Hills Shire (A)",null,"Hills Shire Council, The","Hills ","The Hills Shire",7,59]
[null,17550,"Tweed (A)",null,"Tweed Shire Council","Tweed ","Tweed Shire",5,202]
[null,17620,"Upper Hunter Shire (A)",null,"Upper Hunter Shire Council","Upper Hunter ","Upper Hunter Shire",11,2046]
[null,17640,"Upper Lachlan Shire (A)",null,"Upper Lachlan Shire Council","Upper Lachlan ","Upper Lachlan Shire",10,2035]
[null,17650,"Uralla (A)",null,"Uralla Shire Council","Uralla ","Uralla Shire",10,204]
[null,17750,"Wagga Wagga (C)",null,"Wagga Wagga City Council","Wagga Wagga ","Wagga Wagga City",4,206]
[null,17850,"Walcha (A)",null,"Walcha Council","Walcha","Walcha",9,208]
[null,17900,"Walgett (A)",null,"Walgett Shire Council","Walgett ","Walgett Shire",10,209]
[null,17950,"Warren (A)",null,"Warren Shire Council","Warren ","Warren Shire",9,210]
[null,18020,"Warrumbungle Shire (A)",null,"Warrumbungle Shire Council","Warrumbungle ","Warrumbungle Shire",10,2050]
[null,18050,"Waverley (A)",null,"Waverley Council","Waverley","Waverley",3,212]
[null,18100,"Weddin (A)",null,"Weddin Shire Council","Weddin ","Weddin Shire",9,213]
[null,18200,"Wentworth (A)",null,"Wentworth Shire Council","Wentworth ","Wentworth Shire",10,215]
[null,18250,"Willoughby (C)",null,"Willoughby City Council","Willoughby ","Willoughby City",3,216]
[null,18350,"Wingecarribee (A)",null,"Wingecarribee Shire Council","Wingecarribee ","Wingecarribee Shire",4,218]
[null,18400,"Wollondilly (A)",null,"Wollondilly Shire Council","Wollondilly ","Wollondilly Shire",6,219]
[null,18450,"Wollongong (C)",null,"Wollongong City Council","Wollongong ","Wollongong City",5,220]
[null,18500,"Woollahra (A)",null,"Woollahra Municipal Council","Woollahra ","Woollahra Municipal",2,221]
[null,18710,"Yass Valley (A)",null,"Yass Valley Council","Yass Valley","Yass Valley",11,2036]

{"sheet":"ABS pop T1","index":6,"n_rows":148,"n_cols":8,"rows_kept":148,"cut":false,"hidden":false,"merged":[]}
[]
[null,"Source:",null,"https://www.abs.gov.au/statistics/people/population/regional-population/latest-release#data-download"]
[]
[null,null,"Regional population, 2019-20"]
[null,null,"Released at 11.30am (Canberra time) 30 March 2021"]
[null,null,"Table 1. Estimated resident population, Local Government Areas, New South Wales"]
[]
[null,null,null,null,"ERP at 30 June"]
[null,null,null,null,2019,2020,null,{"$f":"'Supp val'!$C$7","v":"Org. Name"}]
[null,null,"LGA code","Local Government Area","no.","no."]
[]
[null,null,10050,"Albury (C)",54344,55055,null,{"$f":"INDEX(Names!$F$7:$F$134,MATCH(D12,Names!$C$7:$C$134,0))","v":"Albury "}]
[null,null,10180,"Armidale Regional (A)",29812,29704,null,{"$f":"INDEX(Names!$F$7:$F$134,MATCH(D13,Names!$C$7:$C$134,0))","v":"Armidale Regional"}]
[null,null,10250,"Ballina (A)",44622,45217,null,{"$f":"INDEX(Names!$F$7:$F$134,MATCH(D14,Names!$C$7:$C$134,0))","v":"Ballina "}]
[null,null,10300,"Balranald (A)",2338,2306,null,{"$f":"INDEX(Names!$F$7:$F$134,MATCH(D15,Names!$C$7:$C$134,0))","v":"Balranald "}]
[null,null,10470,"Bathurst Regional (A)",43612,43996,null,{"$f":"INDEX(Names!$F$7:$F$134,MATCH(D16,Names!$C$7:$C$134,0))","v":"Bathurst Regional"}]
[null,null,10500,"Bayside (A)",178351,181472,null,{"$f":"INDEX(Names!$F$7:$F$134,MATCH(D17,Names!$C$7:$C$134,0))","v":"Bayside"}]
[null,null,10550,"Bega Valley (A)",34473,34727,null,{"$f":"INDEX(Names!$F$7:$F$134,MATCH(D18,Names!$C$7:$C$134,0))","v":"Bega Valley "}]
[null,null,10600,"Bellingen (A)",12993,13141,null,{"$f":"INDEX(Names!$F$7:$F$134,MATCH(D19,Names!$C$7:$C$134,0))","v":"Bellingen "}]
[null,null,10650,"Berrigan (A)",8750,8784,null,{"$f":"INDEX(Names!$F$7:$F$134,MATCH(D20,Names!$C$7:$C$134,0))","v":"Berrigan "}]
[null,null,10750,"Blacktown (C)",374372,382831,null,{"$f":"INDEX(Names!$F$7:$F$134,MATCH(D21,Names!$C$7:$C$134,0))","v":"Blacktown "}]
[null,null,10800,"Bland (A)",5971,5937,null,{"$f":"INDEX(Names!$F$7:$F$134,MATCH(D22,Names!$C$7:$C$134,0))","v":"Bland "}]
[null,null,10850,"Blayney (A)",7378,7382,null,{"$f":"INDEX(Names!$F$7:$F$134,MATCH(D23,Names!$C$7:$C$134,0))","v":"Blayney "}]
[null,null,10900,"Blue Mountains (C)",79108,79195,null,{"$f":"INDEX(Names!$F$7:$F$134,MATCH(D24,Names!$C$7:$C$134,0))","v":"Blue Mountains "}]
[null,null,10950,"Bogan (A)",2580,2529,null,{"$f":"INDEX(Names!$F$7:$F$134,MATCH(D25,Names!$C$7:$C$134,0))","v":"Bogan "}]
[null,null,11150,"Bourke (A)",2590,2625,null,{"$f":"INDEX(Names!$F$7:$F$134,MATCH(D26,Names!$C$7:$C$134,0))","v":"Bourke "}]
[null,null,11200,"Brewarrina (A)",1611,1553,null,{"$f":"INDEX(Names!$F$7:$F$134,MATCH(D27,Names!$C$7:$C$134,0))","v":"Brewarrina "}]
[null,null,11250,"Broken Hill (C)",17477,17269,null,{"$f":"INDEX(Names!$F$7:$F$134,MATCH(D28,Names!$C$7:$C$134,0))","v":"Broken Hill "}]
[null,null,11300,"Burwood (A)",40596,40866,null,{"$f":"INDEX(Names!$F$7:$F$134,MATCH(D29,Names!$C$7:$C$134,0))","v":"Burwood"}]
[null,null,11350,"Byron (A)",35075,35773,null,{"$f":"INDEX(Names!$F$7:$F$134,MATCH(D30,Names!$C$7:$C$134,0))","v":"Byron "}]
[null,null,11400,"Cabonne (A)",13632,13677,null,{"$f":"INDEX(Names!$F$7:$F$134,MATCH(D31,Names!$C$7:$C$134,0))","v":"Cabonne"}]
[null,null,11450,"Camden (A)",101420,107806,null,{"$f":"INDEX(Names!$F$7:$F$134,MATCH(D32,Names!$C$7:$C$134,0))","v":"Camden"}]
[null,null,11500,"Campbelltown (C) (NSW)",170912,174078,null,{"$f":"INDEX(Names!$F$7:$F$134,MATCH(D33,Names!$C$7:$C$134,0))","v":"Campbelltown "}]
[null,null,11520,"Canada Bay (A)",96017,96550,null,{"$f":"INDEX(Names!$F$7:$F$134,MATCH(D34,Names!$C$7:$C$134,0))","v":"Canada Bay "}]
[null,null,11570,"Canterbury-Bankstown (A)",377836,380406,null,{"$f":"INDEX(Names!$F$7:$F$134,MATCH(D35,Names!$C$7:$C$134,0))","v":"Canterbury-Bankstown"}]
[null,null,11600,"Carrathool (A)",2798,2796,null,{"$f":"INDEX(Names!$F$7:$F$134,MATCH(D36,Names!$C$7:$C$134,0))","v":"Carrathool "}]
[null,null,11650,"Central Coast (C) (NSW)",343922,345809,null,{"$f":"INDEX(Names!$F$7:$F$134,MATCH(D37,Names!$C$7:$C$134,0))","v":"Central Coast"}]
[null,null,11700,"Central Darling (A)",1839,1829,null,{"$f":"INDEX(Names!$F$7:$F$134,MATCH(D38,Names!$C$7:$C$134,0))","v":"Central Darling "}]
[null,null,11720,"Cessnock (C)",59978,61256,null,{"$f":"INDEX(Names!$F$7:$F$134,MATCH(D39,Names!$C$7:$C$134,0))","v":"Cessnock "}]
[null,null,11730,"Clarence Valley (A)",51656,51730,null,{"$f":"INDEX(Names!$F$7:$F$134,MATCH(D40,Names!$C$7:$C$134,0))","v":"Clarence Valley"}]
[null,null,11750,"Cobar (A)",4572,4417,null,{"$f":"INDEX(Names!$F$7:$F$134,MATCH(D41,Names!$C$7:$C$134,0))","v":"Cobar "}]
[null,null,11800,"Coffs Harbour (C)",77265,77648,null,{"$f":"INDEX(Names!$F$7:$F$134,MATCH(D42,Names!$C$7:$C$134,0))","v":"Coffs Harbour "}]
[null,null,12000,"Coolamon (A)",4341,4291,null,{"$f":"INDEX(Names!$F$7:$F$134,MATCH(D43,Names!$C$7:$C$134,0))","v":"Coolamon "}]
[null,null,12150,"Coonamble (A)",3957,3907,null,{"$f":"INDEX(Names!$F$7:$F$134,MATCH(D44,Names!$C$7:$C$134,0))","v":"Coonamble "}]
[null,null,12160,"Cootamundra-Gundagai Regional (A)",11233,11225,null,{"$f":"INDEX(Names!$F$7:$F$134,MATCH(D45,Names!$C$7:$C$134,0))","v":"Cootamundra-Gundagai Regional"}]
[null,null,12350,"Cowra (A)",12741,12730,null,{"$f":"INDEX(Names!$F$7:$F$134,MATCH(D46,Names!$C$7:$C$134,0))","v":"Cowra "}]
[null,null,12380,"Cumberland (A)",241453,242674,null,{"$f":"INDEX(Names!$F$7:$F$134,MATCH(D47,Names!$C$7:$C$134,0))","v":"Cumberland"}]
[null,null,12390,"Dubbo Regional (A)",53710,54044,null,{"$f":"INDEX(Names!$F$7:$F$134,MATCH(D48,Names!$C$7:$C$134,0))","v":"Dubbo Regional"}]
[null,null,12700,"Dungog (A)",9422,9664,null,{"$f":"INDEX(Names!$F$7:$F$134,MATCH(D49,Names!$C$7:$C$134,0))","v":"Dungog "}]
[null,null,12730,"Edward River (A)",9083,9083,null,{"$f":"INDEX(Names!$F$7:$F$134,MATCH(D50,Names!$C$7:$C$134,0))","v":"Edward River"}]
[null,null,12750,"Eurobodalla (A)",38469,38952,null,{"$f":"INDEX(Names!$F$7:$F$134,MATCH(D51,Names!$C$7:$C$134,0))","v":"Eurobodalla "}]
[null,null,12850,"Fairfield (C)",211654,210825,null,{"$f":"INDEX(Names!$F$7:$F$134,MATCH(D52,Names!$C$7:$C$134,0))","v":"Fairfield "}]
[null,null,12870,"Federation (A)",12435,12598,null,{"$f":"INDEX(Names!$F$7:$F$134,MATCH(D53,Names!$C$7:$C$134,0))","v":"Federation"}]
[null,null,12900,"Forbes (A)",9904,9920,null,{"$f":"INDEX(Names!$F$7:$F$134,MATCH(D54,Names!$C$7:$C$134,0))","v":"Forbes "}]
[null,null,12930,"Georges River (A)",159431,160272,null,{"$f":"INDEX(Names!$F$7:$F$134,MATCH(D55,Names!$C$7:$C$134,0))","v":"Georges River"}]
[null,null,12950,"Gilgandra (A)",4239,4229,null,{"$f":"INDEX(Names!$F$7:$F$134,MATCH(D56,Names!$C$7:$C$134,0))","v":"Gilgandra "}]
[null,null,13010,"Glen Innes Severn (A)",8869,8873,null,{"$f":"INDEX(Names!$F$7:$F$134,MATCH(D57,Names!$C$7:$C$134,0))","v":"Glen Innes Severn"}]
[null,null,13310,"Goulburn Mulwaree (A)",31127,31554,null,{"$f":"INDEX(Names!$F$7:$F$134,MATCH(D58,Names!$C$7:$C$134,0))","v":"Goulburn Mulwaree"}]
[null,null,13340,"Greater Hume Shire (A)",10763,10841,null,{"$f":"INDEX(Names!$F$7:$F$134,MATCH(D59,Names!$C$7:$C$134,0))","v":"Greater Hume "}]
[null,null,13450,"Griffith (C)",27022,27155,null,{"$f":"INDEX(Names!$F$7:$F$134,MATCH(D60,Names!$C$7:$C$134,0))","v":"Griffith "}]
[null,null,13550,"Gunnedah (A)",12680,12690,null,{"$f":"INDEX(Names!$F$7:$F$134,MATCH(D61,Names!$C$7:$C$134,0))","v":"Gunnedah "}]
[null,null,13660,"Gwydir (A)",5352,5299,null,{"$f":"INDEX(Names!$F$7:$F$134,MATCH(D62,Names!$C$7:$C$134,0))","v":"Gwydir "}]
[null,null,13800,"Hawkesbury (C)",67288,67749,null,{"$f":"INDEX(Names!$F$7:$F$134,MATCH(D63,Names!$C$7:$C$134,0))","v":"Hawkesbury "}]
[null,null,13850,"Hay (A)",2948,2943,null,{"$f":"INDEX(Names!$F$7:$F$134,MATCH(D64,Names!$C$7:$C$134,0))","v":"Hay "}]
[null,null,13910,"Hilltops (A)",18701,18617,null,{"$f":"INDEX(Names!$F$7:$F$134,MATCH(D65,Names!$C$7:$C$134,0))","v":"Hilltops"}]
[null,null,14000,"Hornsby (A)",152004,152419,null,{"$f":"INDEX(Names!$F$7:$F$134,MATCH(D66,Names!$C$7:$C$134,0))","v":"Hornsby "}]
[null,null,14100,"Hunters Hill (A)",14975,14962,null,{"$f":"INDEX(Names!$F$7:$F$134,MATCH(D67,Names!$C$7:$C$134,0))","v":"Hunters Hill "}]
[null,null,14170,"Inner West (A)",200720,201880,null,{"$f":"INDEX(Names!$F$7:$F$134,MATCH(D68,Names!$C$7:$C$134,0))","v":"Inner West"}]
[null,null,14220,"Inverell (A)",17849,17780,null,{"$f":"INDEX(Names!$F$7:$F$134,MATCH(D69,Names!$C$7:$C$134,0))","v":"Inverell "}]
[null,null,14300,"Junee (A)",6683,6676,null,{"$f":"INDEX(Names!$F$7:$F$134,MATCH(D70,Names!$C$7:$C$134,0))","v":"Junee "}]
[null,null,14350,"Kempsey (A)",29742,29921,null,{"$f":"INDEX(Names!$F$7:$F$134,MATCH(D71,Names!$C$7:$C$134,0))","v":"Kempsey "}]
[null,null,14400,"Kiama (A)",23383,23685,null,{"$f":"INDEX(Names!$F$7:$F$134,MATCH(D72,Names!$C$7:$C$134,0))","v":"Kiama "}]
[null,null,14500,"Ku-ring-gai (A)",127079,127603,null,{"$f":"INDEX(Names!$F$7:$F$134,MATCH(D73,Names!$C$7:$C$134,0))","v":"Ku-ring-gai"}]
[null,null,14550,"Kyogle (A)",8796,8788,null,{"$f":"INDEX(Names!$F$7:$F$134,MATCH(D74,Names!$C$7:$C$134,0))","v":"Kyogle"}]
[null,null,14600,"Lachlan (A)",6160,6089,null,{"$f":"INDEX(Names!$F$7:$F$134,MATCH(D75,Names!$C$7:$C$134,0))","v":"Lachlan "}]
[null,null,14650,"Lake Macquarie (C)",205875,207775,null,{"$f":"INDEX(Names!$F$7:$F$134,MATCH(D76,Names!$C$7:$C$134,0))","v":"Lake Macquarie "}]
[null,null,14700,"Lane Cove (A)",40128,40534,null,{"$f":"INDEX(Names!$F$7:$F$134,MATCH(D77,Names!$C$7:$C$134,0))","v":"Lane Cove "}]
[null,null,14750,"Leeton (A)",11444,11343,null,{"$f":"INDEX(Names!$F$7:$F$134,MATCH(D78,Names!$C$7:$C$134,0))","v":"Leeton "}]
[null,null,14850,"Lismore (C)",43687,43667,null,{"$f":"INDEX(Names!$F$7:$F$134,MATCH(D79,Names!$C$7:$C$134,0))","v":"Lismore "}]
[null,null,14870,"Lithgow (C)",21603,21516,null,{"$f":"INDEX(Names!$F$7:$F$134,MATCH(D80,Names!$C$7:$C$134,0))","v":"Lithgow "}]
[null,null,14900,"Liverpool (C)",227545,231296,null,{"$f":"INDEX(Names!$F$7:$F$134,MATCH(D81,Names!$C$7:$C$134,0))","v":"Liverpool "}]
[null,null,14920,"Liverpool Plains (A)",7903,7853,null,{"$f":"INDEX(Names!$F$7:$F$134,MATCH(D82,Names!$C$7:$C$134,0))","v":"Liverpool Plains "}]
[null,null,14950,"Lockhart (A)",3285,3259,null,{"$f":"INDEX(Names!$F$7:$F$134,MATCH(D83,Names!$C$7:$C$134,0))","v":"Lockhart "}]
[null,null,15050,"Maitland (C)",85155,87395,null,{"$f":"INDEX(Names!$F$7:$F$134,MATCH(D84,Names!$C$7:$C$134,0))","v":"Maitland "}]
[null,null,15240,"Mid-Coast (A)",93826,94395,null,{"$f":"INDEX(Names!$F$7:$F$134,MATCH(D85,Names!$C$7:$C$134,0))","v":"Mid-Coast"}]
[null,null,15270,"Mid-Western Regional (A)",25248,25367,null,{"$f":"INDEX(Names!$F$7:$F$134,MATCH(D86,Names!$C$7:$C$134,0))","v":"Mid-Western Regional"}]
[null,null,15300,"Moree Plains (A)",13260,13077,null,{"$f":"INDEX(Names!$F$7:$F$134,MATCH(D87,Names!$C$7:$C$134,0))","v":"Moree Plains "}]
[null,null,15350,"Mosman (A)",30960,30785,null,{"$f":"INDEX(Names!$F$7:$F$134,MATCH(D88,Names!$C$7:$C$134,0))","v":"Mosman "}]
[null,null,15520,"Murray River (A)",12118,12330,null,{"$f":"INDEX(Names!$F$7:$F$134,MATCH(D89,Names!$C$7:$C$134,0))","v":"Murray River"}]
[null,null,15560,"Murrumbidgee (A)",3917,3916,null,{"$f":"INDEX(Names!$F$7:$F$134,MATCH(D90,Names!$C$7:$C$134,0))","v":"Murrumbidgee (new)"}]
[null,null,15650,"Muswellbrook (A)",16375,16355,null,{"$f":"INDEX(Names!$F$7:$F$134,MATCH(D91,Names!$C$7:$C$134,0))","v":"Muswellbrook "}]
[null,null,15700,"Nambucca Valley (A)",19802,19861,null,{"$f":"INDEX(Names!$F$7:$F$134,MATCH(D92,Names!$C$7:$C$134,0))","v":"Nambucca "}]
[null,null,15750,"Narrabri (A)",13134,13049,null,{"$f":"INDEX(Names!$F$7:$F$134,MATCH(D93,Names!$C$7:$C$134,0))","v":"Narrabri "}]
[null,null,15800,"Narrandera (A)",5898,5858,null,{"$f":"INDEX(Names!$F$7:$F$134,MATCH(D94,Names!$C$7:$C$134,0))","v":"Narrandera "}]
[null,null,15850,"Narromine (A)",6516,6460,null,{"$f":"INDEX(Names!$F$7:$F$134,MATCH(D95,Names!$C$7:$C$134,0))","v":"Narromine "}]
[null,null,15900,"Newcastle (C)",165541,167363,null,{"$f":"INDEX(Names!$F$7:$F$134,MATCH(D96,Names!$C$7:$C$134,0))","v":"Newcastle "}]
[null,null,15950,"North Sydney (A)",74957,75094,null,{"$f":"INDEX(Names!$F$7:$F$134,MATCH(D97,Names!$C$7:$C$134,0))","v":"North Sydney"}]
[null,null,15990,"Northern Beaches (A)",273409,274041,null,{"$f":"INDEX(Names!$F$7:$F$134,MATCH(D98,Names!$C$7:$C$134,0))","v":"Northern Beaches"}]
[null,null,16100,"Oberon (A)",5411,5419,null,{"$f":"INDEX(Names!$F$7:$F$134,MATCH(D99,Names!$C$7:$C$134,0))","v":"Oberon"}]
[null,null,16150,"Orange (C)",42445,42503,null,{"$f":"INDEX(Names!$F$7:$F$134,MATCH(D100,Names!$C$7:$C$134,0))","v":"Orange "}]
[null,null,16200,"Parkes (A)",14835,14728,null,{"$f":"INDEX(Names!$F$7:$F$134,MATCH(D101,Names!$C$7:$C$134,0))","v":"Parkes "}]
[null,null,16260,"Parramatta (C)",257094,260296,null,{"$f":"INDEX(Names!$F$7:$F$134,MATCH(D102,Names!$C$7:$C$134,0))","v":"Parramatta "}]
[null,null,16350,"Penrith (C)",212944,216282,null,{"$f":"INDEX(Names!$F$7:$F$134,MATCH(D103,Names!$C$7:$C$134,0))","v":"Penrith "}]
[null,null,16380,"Port Macquarie-Hastings (A)",84515,85952,null,{"$f":"INDEX(Names!$F$7:$F$134,MATCH(D104,Names!$C$7:$C$134,0))","v":"Port Macquarie-Hastings"}]
[null,null,16400,"Port Stephens (A)",73472,74506,null,{"$f":"INDEX(Names!$F$7:$F$134,MATCH(D105,Names!$C$7:$C$134,0))","v":"Port Stephens"}]
[null,null,16490,"Queanbeyan-Palerang Regional (A)",61089,62239,null,{"$f":"INDEX(Names!$F$7:$F$134,MATCH(D106,Names!$C$7:$C$134,0))","v":"Queanbeyan-Palerang Regional"}]
[null,null,16550,"Randwick (C)",155521,156619,null,{"$f":"INDEX(Names!$F$7:$F$134,MATCH(D107,Names!$C$7:$C$134,0))","v":"Randwick "}]
[null,null,16610,"Richmond Valley (A)",23462,23490,null,{"$f":"INDEX(Names!$F$7:$F$134,MATCH(D108,Names!$C$7:$C$134,0))","v":"Richmond Valley"}]
[null,null,16700,"Ryde (C)",131186,133224,null,{"$f":"INDEX(Names!$F$7:$F$134,MATCH(D109,Names!$C$7:$C$134,0))","v":"Ryde "}]
[null,null,16900,"Shellharbour (C)",73225,74622,null,{"$f":"INDEX(Names!$F$7:$F$134,MATCH(D110,Names!$C$7:$C$134,0))","v":"Shellharbour "}]
[null,null,16950,"Shoalhaven (C)",105637,107191,null,{"$f":"INDEX(Names!$F$7:$F$134,MATCH(D111,Names!$C$7:$C$134,0))","v":"Shoalhaven "}]
[null,null,17000,"Singleton (A)",23457,23380,null,{"$f":"INDEX(Names!$F$7:$F$134,MATCH(D112,Names!$C$7:$C$134,0))","v":"Singleton"}]
[null,null,17040,"Snowy Monaro Regional (A)",20793,20997,null,{"$f":"INDEX(Names!$F$7:$F$134,MATCH(D113,Names!$C$7:$C$134,0))","v":"Snowy Monaro Regional"}]
[null,null,17080,"Snowy Valleys (A)",14476,14412,null,{"$f":"INDEX(Names!$F$7:$F$134,MATCH(D114,Names!$C$7:$C$134,0))","v":"Snowy Valleys"}]
[null,null,17100,"Strathfield (A)",46896,47767,null,{"$f":"INDEX(Names!$F$7:$F$134,MATCH(D115,Names!$C$7:$C$134,0))","v":"Strathfield "}]
[null,null,17150,"Sutherland Shire (A)",230579,232369,null,{"$f":"INDEX(Names!$F$7:$F$134,MATCH(D116,Names!$C$7:$C$134,0))","v":"Sutherland "}]
[null,null,17200,"Sydney (C)",245942,248736,null,{"$f":"INDEX(Names!$F$7:$F$134,MATCH(D117,Names!$C$7:$C$134,0))","v":"Sydney "}]
[null,null,17310,"Tamworth Regional (A)",62531,62545,null,{"$f":"INDEX(Names!$F$7:$F$134,MATCH(D118,Names!$C$7:$C$134,0))","v":"Tamworth Regional"}]
[null,null,17350,"Temora (A)",6307,6274,null,{"$f":"INDEX(Names!$F$7:$F$134,MATCH(D119,Names!$C$7:$C$134,0))","v":"Temora "}]
[null,null,17400,"Tenterfield (A)",6594,6470,null,{"$f":"INDEX(Names!$F$7:$F$134,MATCH(D120,Names!$C$7:$C$134,0))","v":"Tenterfield "}]
[null,null,17420,"The Hills Shire (A)",177927,183791,null,{"$f":"INDEX(Names!$F$7:$F$134,MATCH(D121,Names!$C$7:$C$134,0))","v":"Hills "}]
[null,null,17550,"Tweed (A)",96985,98382,null,{"$f":"INDEX(Names!$F$7:$F$134,MATCH(D122,Names!$C$7:$C$134,0))","v":"Tweed "}]
[null,null,17620,"Upper Hunter Shire (A)",14178,14167,null,{"$f":"INDEX(Names!$F$7:$F$134,MATCH(D123,Names!$C$7:$C$134,0))","v":"Upper Hunter "}]
[null,null,17640,"Upper Lachlan Shire (A)",8059,8274,null,{"$f":"INDEX(Names!$F$7:$F$134,MATCH(D124,Names!$C$7:$C$134,0))","v":"Upper Lachlan "}]
[null,null,17650,"Uralla (A)",6011,5944,null,{"$f":"INDEX(Names!$F$7:$F$134,MATCH(D125,Names!$C$7:$C$134,0))","v":"Uralla "}]
[null,null,17750,"Wagga Wagga (C)",65249,65770,null,{"$f":"INDEX(Names!$F$7:$F$134,MATCH(D126,Names!$C$7:$C$134,0))","v":"Wagga Wagga "}]
[null,null,17850,"Walcha (A)",3134,3105,null,{"$f":"INDEX(Names!$F$7:$F$134,MATCH(D127,Names!$C$7:$C$134,0))","v":"Walcha"}]
[null,null,17900,"Walgett (A)",5952,5828,null,{"$f":"INDEX(Names!$F$7:$F$134,MATCH(D128,Names!$C$7:$C$134,0))","v":"Walgett "}]
[null,null,17950,"Warren (A)",2697,2716,null,{"$f":"INDEX(Names!$F$7:$F$134,MATCH(D129,Names!$C$7:$C$134,0))","v":"Warren "}]
[null,null,18020,"Warrumbungle Shire (A)",9277,9209,null,{"$f":"INDEX(Names!$F$7:$F$134,MATCH(D130,Names!$C$7:$C$134,0))","v":"Warrumbungle "}]
[null,null,18050,"Waverley (A)",74222,74276,null,{"$f":"INDEX(Names!$F$7:$F$134,MATCH(D131,Names!$C$7:$C$134,0))","v":"Waverley"}]
[null,null,18100,"Weddin (A)",3613,3596,null,{"$f":"INDEX(Names!$F$7:$F$134,MATCH(D132,Names!$C$7:$C$134,0))","v":"Weddin "}]
[null,null,18200,"Wentworth (A)",7053,7090,null,{"$f":"INDEX(Names!$F$7:$F$134,MATCH(D133,Names!$C$7:$C$134,0))","v":"Wentworth "}]
[null,null,18250,"Willoughby (C)",81109,81196,null,{"$f":"INDEX(Names!$F$7:$F$134,MATCH(D134,Names!$C$7:$C$134,0))","v":"Willoughby "}]
[null,null,18350,"Wingecarribee (A)",51127,51760,null,{"$f":"INDEX(Names!$F$7:$F$134,MATCH(D135,Names!$C$7:$C$134,0))","v":"Wingecarribee "}]
[null,null,18400,"Wollondilly (A)",53143,54005,null,{"$f":"INDEX(Names!$F$7:$F$134,MATCH(D136,Names!$C$7:$C$134,0))","v":"Wollondilly "}]
[null,null,18450,"Wollongong (C)",218076,219798,null,{"$f":"INDEX(Names!$F$7:$F$134,MATCH(D137,Names!$C$7:$C$134,0))","v":"Wollongong "}]
[null,null,18500,"Woollahra (A)",59345,59431,null,{"$f":"INDEX(Names!$F$7:$F$134,MATCH(D138,Names!$C$7:$C$134,0))","v":"Woollahra "}]
[null,null,18710,"Yass Valley (A)",17086,17321,null,{"$f":"INDEX(Names!$F$7:$F$134,MATCH(D139,Names!$C$7:$C$134,0))","v":"Yass Valley"}]
[]
[null,null,19399,"Unincorporated NSW",1026,961]
[]
[null,null,null,"TOTAL NEW SOUTH WALES",8087379,8167532]
[]
[]
[null,null,"Source: Regional population, 2019-20"]
[]
[null,null,"© Commonwealth of Australia 2021"]

{"sheet":"Supp val","index":7,"n_rows":135,"n_cols":5,"rows_kept":135,"cut":false,"hidden":false,"merged":[]}
[]
[null,"Sources","Annual LGA accounts (collated by OLG)"]
[null,null,"For Central Coast",null,"Financial Reports Central Coast Council 1 July 2019 to 30 June 2020, Special Schedules, p3"]
[]
[null,null,null,"Income before supplementary valuations in 2019-20","Supplemetary valuations in 2019-20"]
[null,null,null,"Schedule 9 - Last Year Notional General Income Yield - 2020-21","Schedule 9 - Plus or minus Adjustments - 2020-21"]
[null,"Org. Id","Org. Name","C454_Item11797","C454_Item11799"]
[null,2047,"Albury",43365000,391000]
[null,2079,"Armidale Regional",18786000,21000]
[null,54,"Ballina",24469000,500000]
[null,55,"Balranald",2510000,21000]
[null,2043,"Bathurst Regional",27518000,194000]
[null,2099,"Bayside",91069000,811000]
[null,60,"Bega Valley",24305000,225000]
[null,61,"Bellingen",8276000,45000]
[null,62,"Berrigan",5302000,12000]
[null,64,"Blacktown",175512000,4002000]
[null,65,"Bland",6701000,4000]
[null,66,"Blayney",8858000,3000]
[null,67,"Blue Mountains",69666000,16000]
[null,68,"Bogan",2913000,83000]
[null,72,"Bourke",1909000,-1000]
[null,73,"Brewarrina",1086000,0]
[null,74,"Broken Hill",15799000,89000]
[null,75,"Burwood",24061000,859000]
[null,76,"Byron",24828000,95000]
[null,77,"Cabonne",10418000,13000]
[null,78,"Camden",58290000,1186000]
[null,79,"Campbelltown",92982000,1238000]
[null,1989,"Canada Bay",39785000,35000]
[null,2080,"Canterbury Bankstown",169046000,935000]
[null,81,"Carrathool",3457000,0]
[null,2088,"Central Coast",170504000,438000]
[null,83,"Central Darling",835000,-3000]
[null,84,"Cessnock",39242000,829000]
[null,2037,"Clarence Valley",33583000,275000]
[null,85,"Cobar",4050000,14000]
[null,86,"Coffs Harbour",50109000,246000]
[null,90,"Coolamon",2451000,0]
[null,93,"Coonamble",4836000,-1000]
[null,2094,"Cootamundra-Gundagai Regional",7461000,-1000]
[null,97,"Cowra",6967000,15000]
[null,2090,"Cumberland",97919000,-515000]
[null,2098,"Dubbo Regional",37334000,229000]
[null,104,"Dungog",6546000,60000]
[null,2091,"Edward River",7461000,-40000]
[null,105,"Eurobodalla",30846000,86000]
[null,107,"Fairfield",84985000,313000]
[null,2092,"Federation",8015000,35000]
[null,108,"Forbes",7604000,22000]
[null,2093,"Georges River",70235000,440000]
[null,109,"Gilgandra",5077000,3000]
[null,2053,"Glen Innes Severn",7005000,27000]
[null,2032,"Goulburn Mulwaree",20628000,280000]
[null,2049,"Greater Hume",8740000,69000]
[null,118,"Griffith",17405000,91000]
[null,120,"Gunnedah",13279000,-9000]
[null,2039,"Gwydir",8007000,21000]
[null,125,"Hawkesbury",38392000,219000]
[null,126,"Hay",2424000,8000]
[null,59,"Hills",74273000,1816000]
[null,2081,"Hilltops",13489000,0]
[null,129,"Hornsby",70266000,325000]
[null,131,"Hunters Hill",9519000,14000]
[null,2083,"Inner West",122109000,29000]
[null,133,"Inverell",13548000,449000]
[null,135,"Junee",4059000,21000]
[null,136,"Kempsey",20685000,105000]
[null,137,"Kiama",17874000,75000]
[null,139,"Ku-ring-gai",66563000,581000]
[null,140,"Kyogle",7322000,50000]
[null,141,"Lachlan",7513000,4000]
[null,142,"Lake Macquarie",138672000,1214000]
[null,143,"Lane Cove",24991000,600000]
[null,144,"Leeton",7467000,9000]
[null,146,"Lismore",31037000,90000]
[null,2044,"Lithgow",13885000,3000]
[null,147,"Liverpool",103541000,1413000]
[null,2040,"Liverpool Plains",7496000,18000]
[null,148,"Lockhart",2477000,1000]
[null,150,"Maitland",67478000,2094000]
[null,2084,"Mid-Coast",79971000,308000]
[null,2042,"Mid-Western Regional",27731000,137000]
[null,155,"Moree Plains",23507000,-8000]
[null,156,"Mosman",20587000,6000]
[null,2085,"Murray River",10545000,97000]
[null,2086,"Murrumbidgee",4330000,-4000]
[null,162,"Muswellbrook",17722000,939000]
[null,163,"Nambucca Valley",11258000,78000]
[null,164,"Narrabri",13538000,6000]
[null,165,"Narrandera",4950000,1000]
[null,166,"Narromine",5872000,-8000]
[null,167,"Newcastle",159676000,961000]
[null,168,"North Sydney",48530000,-131000]
[null,2087,"Northern Beaches",167900000,852000]
[null,2045,"Oberon",4560000,16000]
[null,172,"Orange",34283000,268000]
[null,173,"Parkes",14104000,-13000]
[null,2089,"Parramatta",148650000,2312000]
[null,176,"Penrith",128469000,1060000]
[null,124,"Port Macquarie-Hastings",52287000,371000]
[null,178,"Port Stephens",43572000,334000]
[null,2095,"Queanbeyan-Palerang Regional",37531000,737000]
[null,181,"Randwick",87430000,69000]
[null,1981,"Richmond Valley",13175000,41000]
[null,184,"Ryde",70973000,2047000]
[null,188,"Shellharbour",49667000,266000]
[null,189,"Shoalhaven",77640000,387000]
[null,190,"Singleton",22122000,296000]
[null,2096,"Snowy Monaro Regional",16311000,140000]
[null,2097,"Snowy Valleys",9409000,10000]
[null,193,"Strathfield",18421000,261000]
[null,194,"Sutherland",130839000,1151000]
[null,2029,"Sydney",305065000,1471000]
[null,2038,"Tamworth Regional",37073000,240000]
[null,198,"Temora",4042000,3000]
[null,199,"Tenterfield",4598000,0]
[null,202,"Tweed",63741000,250000]
[null,2046,"Upper Hunter",11098000,18000]
[null,2035,"Upper Lachlan",7325000,70000]
[null,204,"Uralla",3909000,0]
[null,206,"Wagga Wagga",45251000,496000]
[null,208,"Walcha",3485000,0]
[null,209,"Walgett",5662000,1000]
[null,210,"Warren",4901000,5000]
[null,2050,"Warrumbungle",8153000,6000]
[null,212,"Waverley",46068000,-75000]
[null,213,"Weddin",2835000,-7000]
[null,215,"Wentworth",5271000,54000]
[null,216,"Willoughby",51651000,28000]
[null,218,"Wingecarribee",50857000,391000]
[null,219,"Wollondilly",38393000,407000]
[null,220,"Wollongong",170562000,827000]
[null,221,"Woollahra",40337000,71000]
[null,2036,"Yass Valley",10933000,86000]

{"sheet":"Pop calcs","index":8,"n_rows":138,"n_cols":10,"rows_kept":138,"cut":false,"hidden":false,"merged":[]}
[]
[null,"Population factor calculations"]
[null,null,null,{"$f":"'Rate Peg'!D5","v":2022}]
[null,null,null,{"$f":"\"Population factor for Rate Peg from 1 July \"&D3","v":"Population factor for Rate Peg from 1 July 2022"}]
[]
[]
[]
[]
[]
[null,{"$f":"'Supp val'!B7","v":"Org. Id"},{"$f":"'Supp val'!C7","v":"Org. Name"},{"$f":"\"ERP as at 30 June \"&'ABS pop T1'!E9","v":"ERP as at 30 June 2019"},{"$f":"\"ERP as at 30 June \"&'ABS pop T1'!F9","v":"ERP as at 30 June 2020"},"Change in population (unrounded)",{"$f":"'Supp val'!D6","v":"Schedule 9 - Last Year Notional General Income Yield - 2020-21"},{"$f":"'Supp val'!E6","v":"Schedule 9 - Plus or minus Adjustments - 2020-21"},"Supplementary valuations percentage (unrounded)","Population factor (unrounded)"]
[null,{"$f":"Names!I7","v":2047},{"$f":"Names!F7","v":"Albury "},{"$f":"INDEX('ABS pop T1'!E$12:E$139,MATCH($C11,'ABS pop T1'!$H$12:$H$139,0))","v":54344},{"$f":"INDEX('ABS pop T1'!F$12:F$139,MATCH($C11,'ABS pop T1'!$H$12:$H$139,0))","v":55055},{"$f":"MAX(0,E11/D11-1)","v":1.3083321065803011E-2},{"$f":"INDEX('Supp val'!D$8:D$135,MATCH($B11,'Supp val'!$B$8:$B$135,0))","v":43365000},{"$f":"INDEX('Supp val'!E$8:E$135,MATCH($B11,'Supp val'!$B$8:$B$135,0))","v":391000},{"$f":"MAX(0,H11/G11)","v":9.0164879511126488E-3},{"$f":"MAX(0,F11-I11)","v":4.066833114690362E-3}]
[null,{"$f":"Names!I8","v":2079},{"$f":"Names!F8","v":"Armidale Regional"},{"$f":"INDEX('ABS pop T1'!E$12:E$139,MATCH($C12,'ABS pop T1'!$H$12:$H$139,0))","v":29812},{"$f":"INDEX('ABS pop T1'!F$12:F$139,MATCH($C12,'ABS pop T1'!$H$12:$H$139,0))","v":29704},{"$f":"MAX(0,E12/D12-1)","v":0},{"$f":"INDEX('Supp val'!D$8:D$135,MATCH($B12,'Supp val'!$B$8:$B$135,0))","v":18786000},{"$f":"INDEX('Supp val'!E$8:E$135,MATCH($B12,'Supp val'!$B$8:$B$135,0))","v":21000},{"$f":"MAX(0,H12/G12)","v":1.1178537208559566E-3},{"$f":"MAX(0,F12-I12)","v":0}]
[null,{"$f":"Names!I9","v":54},{"$f":"Names!F9","v":"Ballina "},{"$f":"INDEX('ABS pop T1'!E$12:E$139,MATCH($C13,'ABS pop T1'!$H$12:$H$139,0))","v":44622},{"$f":"INDEX('ABS pop T1'!F$12:F$139,MATCH($C13,'ABS pop T1'!$H$12:$H$139,0))","v":45217},1.3334229752140159E-2,{"$f":"INDEX('Supp val'!D$8:D$135,MATCH($B13,'Supp val'!$B$8:$B$135,0))","v":24469000},{"$f":"INDEX('Supp val'!E$8:E$135,MATCH($B13,'Supp val'!$B$8:$B$135,0))","v":500000},2.0434018554088846E-2,0]
[null,{"$f":"Names!I10","v":55},{"$f":"Names!F10","v":"Balranald "},{"$f":"INDEX('ABS pop T1'!E$12:E$139,MATCH($C14,'ABS pop T1'!$H$12:$H$139,0))","v":2338},{"$f":"INDEX('ABS pop T1'!F$12:F$139,MATCH($C14,'ABS pop T1'!$H$12:$H$139,0))","v":2306},0,{"$f":"INDEX('Supp val'!D$8:D$135,MATCH($B14,'Supp val'!$B$8:$B$135,0))","v":2510000},{"$f":"INDEX('Supp val'!E$8:E$135,MATCH($B14,'Supp val'!$B$8:$B$135,0))","v":21000},{"$f":"MAX(0,H14/G14)","v":8.3665338645418329E-3},0]
[null,{"$f":"Names!I11","v":2043},{"$f":"Names!F11","v":"Bathurst Regional"},{"$f":"INDEX('ABS pop T1'!E$12:E$139,MATCH($C15,'ABS pop T1'!$H$12:$H$139,0))","v":43612},{"$f":"INDEX('ABS pop T1'!F$12:F$139,MATCH($C15,'ABS pop T1'!$H$12:$H$139,0))","v":43996},8.8049160781435987E-3,{"$f":"INDEX('Supp val'!D$8:D$135,MATCH($B15,'Supp val'!$B$8:$B$135,0))","v":27518000},{"$f":"INDEX('Supp val'!E$8:E$135,MATCH($B15,'Supp val'!$B$8:$B$135,0))","v":194000},7.0499309542844685E-3,1.7549851238591301E-3]
[null,{"$f":"Names!I12","v":2099},{"$f":"Names!F12","v":"Bayside"},{"$f":"INDEX('ABS pop T1'!E$12:E$139,MATCH($C16,'ABS pop T1'!$H$12:$H$139,0))","v":178351},{"$f":"INDEX('ABS pop T1'!F$12:F$139,MATCH($C16,'ABS pop T1'!$H$12:$H$139,0))","v":181472},1.7499201013731369E-2,{"$f":"INDEX('Supp val'!D$8:D$135,MATCH($B16,'Supp val'!$B$8:$B$135,0))","v":91069000},{"$f":"INDEX('Supp val'!E$8:E$135,MATCH($B16,'Supp val'!$B$8:$B$135,0))","v":811000},8.9053355148294155E-3,8.5938654989019536E-3]
[null,{"$f":"Names!I13","v":60},{"$f":"Names!F13","v":"Bega Valley "},{"$f":"INDEX('ABS pop T1'!E$12:E$139,MATCH($C17,'ABS pop T1'!$H$12:$H$139,0))","v":34473},{"$f":"INDEX('ABS pop T1'!F$12:F$139,MATCH($C17,'ABS pop T1'!$H$12:$H$139,0))","v":34727},7.3680851681026116E-3,{"$f":"INDEX('Supp val'!D$8:D$135,MATCH($B17,'Supp val'!$B$8:$B$135,0))","v":24305000},{"$f":"INDEX('Supp val'!E$8:E$135,MATCH($B17,'Supp val'!$B$8:$B$135,0))","v":225000},9.2573544538160878E-3,0]
[null,{"$f":"Names!I14","v":61},{"$f":"Names!F14","v":"Bellingen "},{"$f":"INDEX('ABS pop T1'!E$12:E$139,MATCH($C18,'ABS pop T1'!$H$12:$H$139,0))","v":12993},{"$f":"INDEX('ABS pop T1'!F$12:F$139,MATCH($C18,'ABS pop T1'!$H$12:$H$139,0))","v":13141},1.1390748864773315E-2,{"$f":"INDEX('Supp val'!D$8:D$135,MATCH($B18,'Supp val'!$B$8:$B$135,0))","v":8276000},{"$f":"INDEX('Supp val'!E$8:E$135,MATCH($B18,'Supp val'!$B$8:$B$135,0))","v":45000},5.4374093765103913E-3,5.9533394882629233E-3]
[null,{"$f":"Names!I15","v":62},{"$f":"Names!F15","v":"Berrigan "},{"$f":"INDEX('ABS pop T1'!E$12:E$139,MATCH($C19,'ABS pop T1'!$H$12:$H$139,0))","v":8750},{"$f":"INDEX('ABS pop T1'!F$12:F$139,MATCH($C19,'ABS pop T1'!$H$12:$H$139,0))","v":8784},3.8857142857142701E-3,{"$f":"INDEX('Supp val'!D$8:D$135,MATCH($B19,'Supp val'!$B$8:$B$135,0))","v":5302000},{"$f":"INDEX('Supp val'!E$8:E$135,MATCH($B19,'Supp val'!$B$8:$B$135,0))","v":12000},{"$f":"MAX(0,H19/G19)","v":2.2632968691059978E-3},1.6224174166082723E-3]
[null,{"$f":"Names!I16","v":64},{"$f":"Names!F16","v":"Blacktown "},{"$f":"INDEX('ABS pop T1'!E$12:E$139,MATCH($C20,'ABS pop T1'!$H$12:$H$139,0))","v":374372},{"$f":"INDEX('ABS pop T1'!F$12:F$139,MATCH($C20,'ABS pop T1'!$H$12:$H$139,0))","v":382831},2.2595172715908163E-2,{"$f":"INDEX('Supp val'!D$8:D$135,MATCH($B20,'Supp val'!$B$8:$B$135,0))","v":175512000},{"$f":"INDEX('Supp val'!E$8:E$135,MATCH($B20,'Supp val'!$B$8:$B$135,0))","v":4002000},2.2801859701900726E-2,0]
[null,{"$f":"Names!I17","v":65},{"$f":"Names!F17","v":"Bland "},{"$f":"INDEX('ABS pop T1'!E$12:E$139,MATCH($C21,'ABS pop T1'!$H$12:$H$139,0))","v":5971},{"$f":"INDEX('ABS pop T1'!F$12:F$139,MATCH($C21,'ABS pop T1'!$H$12:$H$139,0))","v":5937},0,{"$f":"INDEX('Supp val'!D$8:D$135,MATCH($B21,'Supp val'!$B$8:$B$135,0))","v":6701000},{"$f":"INDEX('Supp val'!E$8:E$135,MATCH($B21,'Supp val'!$B$8:$B$135,0))","v":4000},5.9692583196537831E-4,0]
[null,{"$f":"Names!I18","v":66},{"$f":"Names!F18","v":"Blayney "},{"$f":"INDEX('ABS pop T1'!E$12:E$139,MATCH($C22,'ABS pop T1'!$H$12:$H$139,0))","v":7378},{"$f":"INDEX('ABS pop T1'!F$12:F$139,MATCH($C22,'ABS pop T1'!$H$12:$H$139,0))","v":7382},5.4215234480881058E-4,{"$f":"INDEX('Supp val'!D$8:D$135,MATCH($B22,'Supp val'!$B$8:$B$135,0))","v":8858000},{"$f":"INDEX('Supp val'!E$8:E$135,MATCH($B22,'Supp val'!$B$8:$B$135,0))","v":3000},3.3867690223526756E-4,2.0347544257354303E-4]
[null,{"$f":"Names!I19","v":67},{"$f":"Names!F19","v":"Blue Mountains "},{"$f":"INDEX('ABS pop T1'!E$12:E$139,MATCH($C23,'ABS pop T1'!$H$12:$H$139,0))","v":79108},{"$f":"INDEX('ABS pop T1'!F$12:F$139,MATCH($C23,'ABS pop T1'!$H$12:$H$139,0))","v":79195},1.0997623502047027E-3,{"$f":"INDEX('Supp val'!D$8:D$135,MATCH($B23,'Supp val'!$B$8:$B$135,0))","v":69666000},{"$f":"INDEX('Supp val'!E$8:E$135,MATCH($B23,'Supp val'!$B$8:$B$135,0))","v":16000},2.2966726954324921E-4,8.7009508066145352E-4]
[null,{"$f":"Names!I20","v":68},{"$f":"Names!F20","v":"Bogan "},{"$f":"INDEX('ABS pop T1'!E$12:E$139,MATCH($C24,'ABS pop T1'!$H$12:$H$139,0))","v":2580},{"$f":"INDEX('ABS pop T1'!F$12:F$139,MATCH($C24,'ABS pop T1'!$H$12:$H$139,0))","v":2529},0,{"$f":"INDEX('Supp val'!D$8:D$135,MATCH($B24,'Supp val'!$B$8:$B$135,0))","v":2913000},{"$f":"INDEX('Supp val'!E$8:E$135,MATCH($B24,'Supp val'!$B$8:$B$135,0))","v":83000},2.8492962581531067E-2,0]
[null,{"$f":"Names!I21","v":72},{"$f":"Names!F21","v":"Bourke "},{"$f":"INDEX('ABS pop T1'!E$12:E$139,MATCH($C25,'ABS pop T1'!$H$12:$H$139,0))","v":2590},{"$f":"INDEX('ABS pop T1'!F$12:F$139,MATCH($C25,'ABS pop T1'!$H$12:$H$139,0))","v":2625},1.3513513513513598E-2,{"$f":"INDEX('Supp val'!D$8:D$135,MATCH($B25,'Supp val'!$B$8:$B$135,0))","v":1909000},{"$f":"INDEX('Supp val'!E$8:E$135,MATCH($B25,'Supp val'!$B$8:$B$135,0))","v":-1000},0,1.3513513513513598E-2]
[null,{"$f":"Names!I22","v":73},{"$f":"Names!F22","v":"Brewarrina "},{"$f":"INDEX('ABS pop T1'!E$12:E$139,MATCH($C26,'ABS pop T1'!$H$12:$H$139,0))","v":1611},{"$f":"INDEX('ABS pop T1'!F$12:F$139,MATCH($C26,'ABS pop T1'!$H$12:$H$139,0))","v":1553},0,{"$f":"INDEX('Supp val'!D$8:D$135,MATCH($B26,'Supp val'!$B$8:$B$135,0))","v":1086000},{"$f":"INDEX('Supp val'!E$8:E$135,MATCH($B26,'Supp val'!$B$8:$B$135,0))","v":0},0,0]
[null,{"$f":"Names!I23","v":74},{"$f":"Names!F23","v":"Broken Hill "},{"$f":"INDEX('ABS pop T1'!E$12:E$139,MATCH($C27,'ABS pop T1'!$H$12:$H$139,0))","v":17477},{"$f":"INDEX('ABS pop T1'!F$12:F$139,MATCH($C27,'ABS pop T1'!$H$12:$H$139,0))","v":17269},0,{"$f":"INDEX('Supp val'!D$8:D$135,MATCH($B27,'Supp val'!$B$8:$B$135,0))","v":15799000},{"$f":"INDEX('Supp val'!E$8:E$135,MATCH($B27,'Supp val'!$B$8:$B$135,0))","v":89000},5.6332679283498952E-3,0]
[null,{"$f":"Names!I24","v":75},{"$f":"Names!F24","v":"Burwood"},{"$f":"INDEX('ABS pop T1'!E$12:E$139,MATCH($C28,'ABS pop T1'!$H$12:$H$139,0))","v":40596},{"$f":"INDEX('ABS pop T1'!F$12:F$139,MATCH($C28,'ABS pop T1'!$H$12:$H$139,0))","v":40866},6.6509015666567084E-3,{"$f":"INDEX('Supp val'!D$8:D$135,MATCH($B28,'Supp val'!$B$8:$B$135,0))","v":24061000},{"$f":"INDEX('Supp val'!E$8:E$135,MATCH($B28,'Supp val'!$B$8:$B$135,0))","v":859000},3.5700926811021987E-2,0]
[null,{"$f":"Names!I25","v":76},{"$f":"Names!F25","v":"Byron "},{"$f":"INDEX('ABS pop T1'!E$12:E$139,MATCH($C29,'ABS pop T1'!$H$12:$H$139,0))","v":35075},{"$f":"INDEX('ABS pop T1'!F$12:F$139,MATCH($C29,'ABS pop T1'!$H$12:$H$139,0))","v":35773},1.9900213827512392E-2,{"$f":"INDEX('Supp val'!D$8:D$135,MATCH($B29,'Supp val'!$B$8:$B$135,0))","v":24828000},{"$f":"INDEX('Supp val'!E$8:E$135,MATCH($B29,'Supp val'!$B$8:$B$135,0))","v":95000},3.8263251168036087E-3,1.6073888710708785E-2]
[null,{"$f":"Names!I26","v":77},{"$f":"Names!F26","v":"Cabonne"},{"$f":"INDEX('ABS pop T1'!E$12:E$139,MATCH($C30,'ABS pop T1'!$H$12:$H$139,0))","v":13632},{"$f":"INDEX('ABS pop T1'!F$12:F$139,MATCH($C30,'ABS pop T1'!$H$12:$H$139,0))","v":13677},3.3010563380282409E-3,{"$f":"INDEX('Supp val'!D$8:D$135,MATCH($B30,'Supp val'!$B$8:$B$135,0))","v":10418000},{"$f":"INDEX('Supp val'!E$8:E$135,MATCH($B30,'Supp val'!$B$8:$B$135,0))","v":13000},1.2478402764446151E-3,2.0532160615836259E-3]
[null,{"$f":"Names!I27","v":78},{"$f":"Names!F27","v":"Camden"},{"$f":"INDEX('ABS pop T1'!E$12:E$139,MATCH($C31,'ABS pop T1'!$H$12:$H$139,0))","v":101420},{"$f":"INDEX('ABS pop T1'!F$12:F$139,MATCH($C31,'ABS pop T1'!$H$12:$H$139,0))","v":107806},6.2965884440938646E-2,{"$f":"INDEX('Supp val'!D$8:D$135,MATCH($B31,'Supp val'!$B$8:$B$135,0))","v":58290000},{"$f":"INDEX('Supp val'!E$8:E$135,MATCH($B31,'Supp val'!$B$8:$B$135,0))","v":1186000},2.0346543146337281E-2,4.2619341294601362E-2]
[null,{"$f":"Names!I28","v":79},{"$f":"Names!F28","v":"Campbelltown "},{"$f":"INDEX('ABS pop T1'!E$12:E$139,MATCH($C32,'ABS pop T1'!$H$12:$H$139,0))","v":170912},{"$f":"INDEX('ABS pop T1'!F$12:F$139,MATCH($C32,'ABS pop T1'!$H$12:$H$139,0))","v":174078},1.8524152780378111E-2,{"$f":"INDEX('Supp val'!D$8:D$135,MATCH($B32,'Supp val'!$B$8:$B$135,0))","v":92982000},{"$f":"INDEX('Supp val'!E$8:E$135,MATCH($B32,'Supp val'!$B$8:$B$135,0))","v":1238000},1.3314404938590265E-2,5.2097478417878467E-3]
[null,{"$f":"Names!I29","v":1989},{"$f":"Names!F29","v":"Canada Bay "},{"$f":"INDEX('ABS pop T1'!E$12:E$139,MATCH($C33,'ABS pop T1'!$H$12:$H$139,0))","v":96017},{"$f":"INDEX('ABS pop T1'!F$12:F$139,MATCH($C33,'ABS pop T1'!$H$12:$H$139,0))","v":96550},5.5511003259840486E-3,{"$f":"INDEX('Supp val'!D$8:D$135,MATCH($B33,'Supp val'!$B$8:$B$135,0))","v":39785000},{"$f":"INDEX('Supp val'!E$8:E$135,MATCH($B33,'Supp val'!$B$8:$B$135,0))","v":35000},8.7972854090737713E-4,4.6713717850766718E-3]
[null,{"$f":"Names!I30","v":2080},{"$f":"Names!F30","v":"Canterbury-Bankstown"},{"$f":"INDEX('ABS pop T1'!E$12:E$139,MATCH($C34,'ABS pop T1'!$H$12:$H$139,0))","v":377836},{"$f":"INDEX('ABS pop T1'!F$12:F$139,MATCH($C34,'ABS pop T1'!$H$12:$H$139,0))","v":380406},6.8018928847437543E-3,{"$f":"INDEX('Supp val'!D$8:D$135,MATCH($B34,'Supp val'!$B$8:$B$135,0))","v":169046000},{"$f":"INDEX('Supp val'!E$8:E$135,MATCH($B34,'Supp val'!$B$8:$B$135,0))","v":935000},5.5310388888231603E-3,1.270853995920594E-3]
[null,{"$f":"Names!I31","v":81},{"$f":"Names!F31","v":"Carrathool "},{"$f":"INDEX('ABS pop T1'!E$12:E$139,MATCH($C35,'ABS pop T1'!$H$12:$H$139,0))","v":2798},{"$f":"INDEX('ABS pop T1'!F$12:F$139,MATCH($C35,'ABS pop T1'!$H$12:$H$139,0))","v":2796},0,{"$f":"INDEX('Supp val'!D$8:D$135,MATCH($B35,'Supp val'!$B$8:$B$135,0))","v":3457000},{"$f":"INDEX('Supp val'!E$8:E$135,MATCH($B35,'Supp val'!$B$8:$B$135,0))","v":0},0,0]
[null,{"$f":"Names!I32","v":2088},{"$f":"Names!F32","v":"Central Coast"},{"$f":"INDEX('ABS pop T1'!E$12:E$139,MATCH($C36,'ABS pop T1'!$H$12:$H$139,0))","v":343922},{"$f":"INDEX('ABS pop T1'!F$12:F$139,MATCH($C36,'ABS pop T1'!$H$12:$H$139,0))","v":345809},5.4867091956896097E-3,{"$f":"INDEX('Supp val'!D$8:D$135,MATCH($B36,'Supp val'!$B$8:$B$135,0))","v":170504000},{"$f":"INDEX('Supp val'!E$8:E$135,MATCH($B36,'Supp val'!$B$8:$B$135,0))","v":438000},2.56885468962605E-3,2.9178545060635597E-3]
[null,{"$f":"Names!I33","v":83},{"$f":"Names!F33","v":"Central Darling "},{"$f":"INDEX('ABS pop T1'!E$12:E$139,MATCH($C37,'ABS pop T1'!$H$12:$H$139,0))","v":1839},{"$f":"INDEX('ABS pop T1'!F$12:F$139,MATCH($C37,'ABS pop T1'!$H$12:$H$139,0))","v":1829},0,{"$f":"INDEX('Supp val'!D$8:D$135,MATCH($B37,'Supp val'!$B$8:$B$135,0))","v":835000},{"$f":"INDEX('Supp val'!E$8:E$135,MATCH($B37,'Supp val'!$B$8:$B$135,0))","v":-3000},0,0]
[null,{"$f":"Names!I34","v":84},{"$f":"Names!F34","v":"Cessnock "},{"$f":"INDEX('ABS pop T1'!E$12:E$139,MATCH($C38,'ABS pop T1'!$H$12:$H$139,0))","v":59978},{"$f":"INDEX('ABS pop T1'!F$12:F$139,MATCH($C38,'ABS pop T1'!$H$12:$H$139,0))","v":61256},2.1307812864717057E-2,{"$f":"INDEX('Supp val'!D$8:D$135,MATCH($B38,'Supp val'!$B$8:$B$135,0))","v":39242000},{"$f":"INDEX('Supp val'!E$8:E$135,MATCH($B38,'Supp val'!$B$8:$B$135,0))","v":829000},2.1125324906987413E-2,1.8248795772964413E-4]
[null,{"$f":"Names!I35","v":2037},{"$f":"Names!F35","v":"Clarence Valley"},{"$f":"INDEX('ABS pop T1'!E$12:E$139,MATCH($C39,'ABS pop T1'!$H$12:$H$139,0))","v":51656},{"$f":"INDEX('ABS pop T1'!F$12:F$139,MATCH($C39,'ABS pop T1'!$H$12:$H$139,0))","v":51730},1.4325538175623542E-3,{"$f":"INDEX('Supp val'!D$8:D$135,MATCH($B39,'Supp val'!$B$8:$B$135,0))","v":33583000},{"$f":"INDEX('Supp val'!E$8:E$135,MATCH($B39,'Supp val'!$B$8:$B$135,0))","v":275000},8.1886668850311168E-3,0]
[null,{"$f":"Names!I36","v":85},{"$f":"Names!F36","v":"Cobar "},{"$f":"INDEX('ABS pop T1'!E$12:E$139,MATCH($C40,'ABS pop T1'!$H$12:$H$139,0))","v":4572},{"$f":"INDEX('ABS pop T1'!F$12:F$139,MATCH($C40,'ABS pop T1'!$H$12:$H$139,0))","v":4417},0,{"$f":"INDEX('Supp val'!D$8:D$135,MATCH($B40,'Supp val'!$B$8:$B$135,0))","v":4050000},{"$f":"INDEX('Supp val'!E$8:E$135,MATCH($B40,'Supp val'!$B$8:$B$135,0))","v":14000},3.4567901234567903E-3,0]
[null,{"$f":"Names!I37","v":86},{"$f":"Names!F37","v":"Coffs Harbour "},{"$f":"INDEX('ABS pop T1'!E$12:E$139,MATCH($C41,'ABS pop T1'!$H$12:$H$139,0))","v":77265},{"$f":"INDEX('ABS pop T1'!F$12:F$139,MATCH($C41,'ABS pop T1'!$H$12:$H$139,0))","v":77648},4.9569662848638618E-3,{"$f":"INDEX('Supp val'!D$8:D$135,MATCH($B41,'Supp val'!$B$8:$B$135,0))","v":50109000},{"$f":"INDEX('Supp val'!E$8:E$135,MATCH($B41,'Supp val'!$B$8:$B$135,0))","v":246000},4.9092977309465368E-3,4.7668553917325045E-5]
[null,{"$f":"Names!I38","v":90},{"$f":"Names!F38","v":"Coolamon "},{"$f":"INDEX('ABS pop T1'!E$12:E$139,MATCH($C42,'ABS pop T1'!$H$12:$H$139,0))","v":4341},{"$f":"INDEX('ABS pop T1'!F$12:F$139,MATCH($C42,'ABS pop T1'!$H$12:$H$139,0))","v":4291},0,{"$f":"INDEX('Supp val'!D$8:D$135,MATCH($B42,'Supp val'!$B$8:$B$135,0))","v":2451000},{"$f":"INDEX('Supp val'!E$8:E$135,MATCH($B42,'Supp val'!$B$8:$B$135,0))","v":0},0,0]
[null,{"$f":"Names!I39","v":93},{"$f":"Names!F39","v":"Coonamble "},{"$f":"INDEX('ABS pop T1'!E$12:E$139,MATCH($C43,'ABS pop T1'!$H$12:$H$139,0))","v":3957},{"$f":"INDEX('ABS pop T1'!F$12:F$139,MATCH($C43,'ABS pop T1'!$H$12:$H$139,0))","v":3907},0,{"$f":"INDEX('Supp val'!D$8:D$135,MATCH($B43,'Supp val'!$B$8:$B$135,0))","v":4836000},{"$f":"INDEX('Supp val'!E$8:E$135,MATCH($B43,'Supp val'!$B$8:$B$135,0))","v":-1000},0,0]
[null,{"$f":"Names!I40","v":2094},{"$f":"Names!F40","v":"Cootamundra-Gundagai Regional"},{"$f":"INDEX('ABS pop T1'!E$12:E$139,MATCH($C44,'ABS pop T1'!$H$12:$H$139,0))","v":11233},{"$f":"INDEX('ABS pop T1'!F$12:F$139,MATCH($C44,'ABS pop T1'!$H$12:$H$139,0))","v":11225},0,{"$f":"INDEX('Supp val'!D$8:D$135,MATCH($B44,'Supp val'!$B$8:$B$135,0))","v":7461000},{"$f":"INDEX('Supp val'!E$8:E$135,MATCH($B44,'Supp val'!$B$8:$B$135,0))","v":-1000},0,0]
[null,{"$f":"Names!I41","v":97},{"$f":"Names!F41","v":"Cowra "},{"$f":"INDEX('ABS pop T1'!E$12:E$139,MATCH($C45,'ABS pop T1'!$H$12:$H$139,0))","v":12741},{"$f":"INDEX('ABS pop T1'!F$12:F$139,MATCH($C45,'ABS pop T1'!$H$12:$H$139,0))","v":12730},0,{"$f":"INDEX('Supp val'!D$8:D$135,MATCH($B45,'Supp val'!$B$8:$B$135,0))","v":6967000},{"$f":"INDEX('Supp val'!E$8:E$135,MATCH($B45,'Supp val'!$B$8:$B$135,0))","v":15000},2.1530070331563082E-3,0]
[null,{"$f":"Names!I42","v":2090},{"$f":"Names!F42","v":"Cumberland"},{"$f":"INDEX('ABS pop T1'!E$12:E$139,MATCH($C46,'ABS pop T1'!$H$12:$H$139,0))","v":241453},{"$f":"INDEX('ABS pop T1'!F$12:F$139,MATCH($C46,'ABS pop T1'!$H$12:$H$139,0))","v":242674},5.0568847767473724E-3,{"$f":"INDEX('Supp val'!D$8:D$135,MATCH($B46,'Supp val'!$B$8:$B$135,0))","v":97919000},{"$f":"INDEX('Supp val'!E$8:E$135,MATCH($B46,'Supp val'!$B$8:$B$135,0))","v":-515000},0,5.0568847767473724E-3]
[null,{"$f":"Names!I43","v":2098},{"$f":"Names!F43","v":"Dubbo Regional"},{"$f":"INDEX('ABS pop T1'!E$12:E$139,MATCH($C47,'ABS pop T1'!$H$12:$H$139,0))","v":53710},{"$f":"INDEX('ABS pop T1'!F$12:F$139,MATCH($C47,'ABS pop T1'!$H$12:$H$139,0))","v":54044},6.2185812697821419E-3,{"$f":"INDEX('Supp val'!D$8:D$135,MATCH($B47,'Supp val'!$B$8:$B$135,0))","v":37334000},{"$f":"INDEX('Supp val'!E$8:E$135,MATCH($B47,'Supp val'!$B$8:$B$135,0))","v":229000},6.1338190389457333E-3,8.4762230836408527E-5]
[null,{"$f":"Names!I44","v":104},{"$f":"Names!F44","v":"Dungog "},{"$f":"INDEX('ABS pop T1'!E$12:E$139,MATCH($C48,'ABS pop T1'!$H$12:$H$139,0))","v":9422},{"$f":"INDEX('ABS pop T1'!F$12:F$139,MATCH($C48,'ABS pop T1'!$H$12:$H$139,0))","v":9664},2.5684568032264821E-2,{"$f":"INDEX('Supp val'!D$8:D$135,MATCH($B48,'Supp val'!$B$8:$B$135,0))","v":6546000},{"$f":"INDEX('Supp val'!E$8:E$135,MATCH($B48,'Supp val'!$B$8:$B$135,0))","v":60000},9.1659028414298807E-3,1.651866519083494E-2]
[null,{"$f":"Names!I45","v":2091},{"$f":"Names!F45","v":"Edward River"},{"$f":"INDEX('ABS pop T1'!E$12:E$139,MATCH($C49,'ABS pop T1'!$H$12:$H$139,0))","v":9083},{"$f":"INDEX('ABS pop T1'!F$12:F$139,MATCH($C49,'ABS pop T1'!$H$12:$H$139,0))","v":9083},0,{"$f":"INDEX('Supp val'!D$8:D$135,MATCH($B49,'Supp val'!$B$8:$B$135,0))","v":7461000},{"$f":"INDEX('Supp val'!E$8:E$135,MATCH($B49,'Supp val'!$B$8:$B$135,0))","v":-40000},0,0]
[null,{"$f":"Names!I46","v":105},{"$f":"Names!F46","v":"Eurobodalla "},{"$f":"INDEX('ABS pop T1'!E$12:E$139,MATCH($C50,'ABS pop T1'!$H$12:$H$139,0))","v":38469},{"$f":"INDEX('ABS pop T1'!F$12:F$139,MATCH($C50,'ABS pop T1'!$H$12:$H$139,0))","v":38952},1.2555564220541271E-2,{"$f":"INDEX('Supp val'!D$8:D$135,MATCH($B50,'Supp val'!$B$8:$B$135,0))","v":30846000},{"$f":"INDEX('Supp val'!E$8:E$135,MATCH($B50,'Supp val'!$B$8:$B$135,0))","v":86000},2.788043830642547E-3,9.7675203898987244E-3]
[null,{"$f":"Names!I47","v":107},{"$f":"Names!F47","v":"Fairfield "},{"$f":"INDEX('ABS pop T1'!E$12:E$139,MATCH($C51,'ABS pop T1'!$H$12:$H$139,0))","v":211654},{"$f":"INDEX('ABS pop T1'!F$12:F$139,MATCH($C51,'ABS pop T1'!$H$12:$H$139,0))","v":210825},0,{"$f":"INDEX('Supp val'!D$8:D$135,MATCH($B51,'Supp val'!$B$8:$B$135,0))","v":84985000},{"$f":"INDEX('Supp val'!E$8:E$135,MATCH($B51,'Supp val'!$B$8:$B$135,0))","v":313000},3.6830028828616817E-3,0]
[null,{"$f":"Names!I48","v":2092},{"$f":"Names!F48","v":"Federation"},{"$f":"INDEX('ABS pop T1'!E$12:E$139,MATCH($C52,'ABS pop T1'!$H$12:$H$139,0))","v":12435},{"$f":"INDEX('ABS pop T1'!F$12:F$139,MATCH($C52,'ABS pop T1'!$H$12:$H$139,0))","v":12598},1.3108162444712468E-2,{"$f":"INDEX('Supp val'!D$8:D$135,MATCH($B52,'Supp val'!$B$8:$B$135,0))","v":8015000},{"$f":"INDEX('Supp val'!E$8:E$135,MATCH($B52,'Supp val'!$B$8:$B$135,0))","v":35000},4.3668122270742356E-3,8.7413502176382323E-3]
[null,{"$f":"Names!I49","v":108},{"$f":"Names!F49","v":"Forbes "},{"$f":"INDEX('ABS pop T1'!E$12:E$139,MATCH($C53,'ABS pop T1'!$H$12:$H$139,0))","v":9904},{"$f":"INDEX('ABS pop T1'!F$12:F$139,MATCH($C53,'ABS pop T1'!$H$12:$H$139,0))","v":9920},1.615508885298933E-3,{"$f":"INDEX('Supp val'!D$8:D$135,MATCH($B53,'Supp val'!$B$8:$B$135,0))","v":7604000},{"$f":"INDEX('Supp val'!E$8:E$135,MATCH($B53,'Supp val'!$B$8:$B$135,0))","v":22000},2.8932140978432403E-3,0]
[null,{"$f":"Names!I50","v":2093},{"$f":"Names!F50","v":"Georges River"},{"$f":"INDEX('ABS pop T1'!E$12:E$139,MATCH($C54,'ABS pop T1'!$H$12:$H$139,0))","v":159431},{"$f":"INDEX('ABS pop T1'!F$12:F$139,MATCH($C54,'ABS pop T1'!$H$12:$H$139,0))","v":160272},5.2750092516511415E-3,{"$f":"INDEX('Supp val'!D$8:D$135,MATCH($B54,'Supp val'!$B$8:$B$135,0))","v":70235000},{"$f":"INDEX('Supp val'!E$8:E$135,MATCH($B54,'Supp val'!$B$8:$B$135,0))","v":440000},6.2646828504306969E-3,0]
[null,{"$f":"Names!I51","v":109},{"$f":"Names!F51","v":"Gilgandra "},{"$f":"INDEX('ABS pop T1'!E$12:E$139,MATCH($C55,'ABS pop T1'!$H$12:$H$139,0))","v":4239},{"$f":"INDEX('ABS pop T1'!F$12:F$139,MATCH($C55,'ABS pop T1'!$H$12:$H$139,0))","v":4229},0,{"$f":"INDEX('Supp val'!D$8:D$135,MATCH($B55,'Supp val'!$B$8:$B$135,0))","v":5077000},{"$f":"INDEX('Supp val'!E$8:E$135,MATCH($B55,'Supp val'!$B$8:$B$135,0))","v":3000},5.9090013787669888E-4,0]
[null,{"$f":"Names!I52","v":2053},{"$f":"Names!F52","v":"Glen Innes Severn"},{"$f":"INDEX('ABS pop T1'!E$12:E$139,MATCH($C56,'ABS pop T1'!$H$12:$H$139,0))","v":8869},{"$f":"INDEX('ABS pop T1'!F$12:F$139,MATCH($C56,'ABS pop T1'!$H$12:$H$139,0))","v":8873},4.5100913293483202E-4,{"$f":"INDEX('Supp val'!D$8:D$135,MATCH($B56,'Supp val'!$B$8:$B$135,0))","v":7005000},{"$f":"INDEX('Supp val'!E$8:E$135,MATCH($B56,'Supp val'!$B$8:$B$135,0))","v":27000},3.854389721627409E-3,0]
[null,{"$f":"Names!I53","v":2032},{"$f":"Names!F53","v":"Goulburn Mulwaree"},{"$f":"INDEX('ABS pop T1'!E$12:E$139,MATCH($C57,'ABS pop T1'!$H$12:$H$139,0))","v":31127},{"$f":"INDEX('ABS pop T1'!F$12:F$139,MATCH($C57,'ABS pop T1'!$H$12:$H$139,0))","v":31554},1.3717994024480262E-2,{"$f":"INDEX('Supp val'!D$8:D$135,MATCH($B57,'Supp val'!$B$8:$B$135,0))","v":20628000},{"$f":"INDEX('Supp val'!E$8:E$135,MATCH($B57,'Supp val'!$B$8:$B$135,0))","v":280000},1.357378320729106E-2,1.4421081718920224E-4]
[null,{"$f":"Names!I54","v":2049},{"$f":"Names!F54","v":"Greater Hume "},{"$f":"INDEX('ABS pop T1'!E$12:E$139,MATCH($C58,'ABS pop T1'!$H$12:$H$139,0))","v":10763},{"$f":"INDEX('ABS pop T1'!F$12:F$139,MATCH($C58,'ABS pop T1'!$H$12:$H$139,0))","v":10841},7.2470500789743042E-3,{"$f":"INDEX('Supp val'!D$8:D$135,MATCH($B58,'Supp val'!$B$8:$B$135,0))","v":8740000},{"$f":"INDEX('Supp val'!E$8:E$135,MATCH($B58,'Supp val'!$B$8:$B$135,0))","v":69000},7.8947368421052634E-3,0]
[null,{"$f":"Names!I55","v":118},{"$f":"Names!F55","v":"Griffith "},{"$f":"INDEX('ABS pop T1'!E$12:E$139,MATCH($C59,'ABS pop T1'!$H$12:$H$139,0))","v":27022},{"$f":"INDEX('ABS pop T1'!F$12:F$139,MATCH($C59,'ABS pop T1'!$H$12:$H$139,0))","v":27155},4.9219154762785156E-3,{"$f":"INDEX('Supp val'!D$8:D$135,MATCH($B59,'Supp val'!$B$8:$B$135,0))","v":17405000},{"$f":"INDEX('Supp val'!E$8:E$135,MATCH($B59,'Supp val'!$B$8:$B$135,0))","v":91000},5.2283826486641772E-3,0]
[null,{"$f":"Names!I56","v":120},{"$f":"Names!F56","v":"Gunnedah "},{"$f":"INDEX('ABS pop T1'!E$12:E$139,MATCH($C60,'ABS pop T1'!$H$12:$H$139,0))","v":12680},{"$f":"INDEX('ABS pop T1'!F$12:F$139,MATCH($C60,'ABS pop T1'!$H$12:$H$139,0))","v":12690},7.8864353312302349E-4,{"$f":"INDEX('Supp val'!D$8:D$135,MATCH($B60,'Supp val'!$B$8:$B$135,0))","v":13279000},{"$f":"INDEX('Supp val'!E$8:E$135,MATCH($B60,'Supp val'!$B$8:$B$135,0))","v":-9000},0,7.8864353312302349E-4]
[null,{"$f":"Names!I57","v":2039},{"$f":"Names!F57","v":"Gwydir "},{"$f":"INDEX('ABS pop T1'!E$12:E$139,MATCH($C61,'ABS pop T1'!$H$12:$H$139,0))","v":5352},{"$f":"INDEX('ABS pop T1'!F$12:F$139,MATCH($C61,'ABS pop T1'!$H$12:$H$139,0))","v":5299},0,{"$f":"INDEX('Supp val'!D$8:D$135,MATCH($B61,'Supp val'!$B$8:$B$135,0))","v":8007000},{"$f":"INDEX('Supp val'!E$8:E$135,MATCH($B61,'Supp val'!$B$8:$B$135,0))","v":21000},2.6227051330086175E-3,0]
[null,{"$f":"Names!I58","v":125},{"$f":"Names!F58","v":"Hawkesbury "},{"$f":"INDEX('ABS pop T1'!E$12:E$139,MATCH($C62,'ABS pop T1'!$H$12:$H$139,0))","v":67288},{"$f":"INDEX('ABS pop T1'!F$12:F$139,MATCH($C62,'ABS pop T1'!$H$12:$H$139,0))","v":67749},6.8511473070977935E-3,{"$f":"INDEX('Supp val'!D$8:D$135,MATCH($B62,'Supp val'!$B$8:$B$135,0))","v":38392000},{"$f":"INDEX('Supp val'!E$8:E$135,MATCH($B62,'Supp val'!$B$8:$B$135,0))","v":219000},5.7043133986247139E-3,1.1468339084730796E-3]
[null,{"$f":"Names!I59","v":126},{"$f":"Names!F59","v":"Hay "},{"$f":"INDEX('ABS pop T1'!E$12:E$139,MATCH($C63,'ABS pop T1'!$H$12:$H$139,0))","v":2948},{"$f":"INDEX('ABS pop T1'!F$12:F$139,MATCH($C63,'ABS pop T1'!$H$12:$H$139,0))","v":2943},0,{"$f":"INDEX('Supp val'!D$8:D$135,MATCH($B63,'Supp val'!$B$8:$B$135,0))","v":2424000},{"$f":"INDEX('Supp val'!E$8:E$135,MATCH($B63,'Supp val'!$B$8:$B$135,0))","v":8000},3.3003300330033004E-3,0]
[null,{"$f":"Names!I60","v":2081},{"$f":"Names!F60","v":"Hilltops"},{"$f":"INDEX('ABS pop T1'!E$12:E$139,MATCH($C64,'ABS pop T1'!$H$12:$H$139,0))","v":18701},{"$f":"INDEX('ABS pop T1'!F$12:F$139,MATCH($C64,'ABS pop T1'!$H$12:$H$139,0))","v":18617},0,{"$f":"INDEX('Supp val'!D$8:D$135,MATCH($B64,'Supp val'!$B$8:$B$135,0))","v":13489000},{"$f":"INDEX('Supp val'!E$8:E$135,MATCH($B64,'Supp val'!$B$8:$B$135,0))","v":0},0,0]
[null,{"$f":"Names!I61","v":129},{"$f":"Names!F61","v":"Hornsby "},{"$f":"INDEX('ABS pop T1'!E$12:E$139,MATCH($C65,'ABS pop T1'!$H$12:$H$139,0))","v":152004},{"$f":"INDEX('ABS pop T1'!F$12:F$139,MATCH($C65,'ABS pop T1'!$H$12:$H$139,0))","v":152419},2.7301913107549147E-3,{"$f":"INDEX('Supp val'!D$8:D$135,MATCH($B65,'Supp val'!$B$8:$B$135,0))","v":70266000},{"$f":"INDEX('Supp val'!E$8:E$135,MATCH($B65,'Supp val'!$B$8:$B$135,0))","v":325000},4.6252810747730057E-3,0]
[null,{"$f":"Names!I62","v":131},{"$f":"Names!F62","v":"Hunters Hill "},{"$f":"INDEX('ABS pop T1'!E$12:E$139,MATCH($C66,'ABS pop T1'!$H$12:$H$139,0))","v":14975},{"$f":"INDEX('ABS pop T1'!F$12:F$139,MATCH($C66,'ABS pop T1'!$H$12:$H$139,0))","v":14962},0,{"$f":"INDEX('Supp val'!D$8:D$135,MATCH($B66,'Supp val'!$B$8:$B$135,0))","v":9519000},{"$f":"INDEX('Supp val'!E$8:E$135,MATCH($B66,'Supp val'!$B$8:$B$135,0))","v":14000},1.4707427250761635E-3,0]
[null,{"$f":"Names!I63","v":2083},{"$f":"Names!F63","v":"Inner West"},{"$f":"INDEX('ABS pop T1'!E$12:E$139,MATCH($C67,'ABS pop T1'!$H$12:$H$139,0))","v":200720},{"$f":"INDEX('ABS pop T1'!F$12:F$139,MATCH($C67,'ABS pop T1'!$H$12:$H$139,0))","v":201880},5.7791948983658692E-3,{"$f":"INDEX('Supp val'!D$8:D$135,MATCH($B67,'Supp val'!$B$8:$B$135,0))","v":122109000},{"$f":"INDEX('Supp val'!E$8:E$135,MATCH($B67,'Supp val'!$B$8:$B$135,0))","v":29000},2.374927319034633E-4,5.5417021664624063E-3]
[null,{"$f":"Names!I64","v":133},{"$f":"Names!F64","v":"Inverell "},{"$f":"INDEX('ABS pop T1'!E$12:E$139,MATCH($C68,'ABS pop T1'!$H$12:$H$139,0))","v":17849},{"$f":"INDEX('ABS pop T1'!F$12:F$139,MATCH($C68,'ABS pop T1'!$H$12:$H$139,0))","v":17780},0,{"$f":"INDEX('Supp val'!D$8:D$135,MATCH($B68,'Supp val'!$B$8:$B$135,0))","v":13548000},{"$f":"INDEX('Supp val'!E$8:E$135,MATCH($B68,'Supp val'!$B$8:$B$135,0))","v":449000},3.3141423088278714E-2,0]
[null,{"$f":"Names!I65","v":135},{"$f":"Names!F65","v":"Junee "},{"$f":"INDEX('ABS pop T1'!E$12:E$139,MATCH($C69,'ABS pop T1'!$H$12:$H$139,0))","v":6683},{"$f":"INDEX('ABS pop T1'!F$12:F$139,MATCH($C69,'ABS pop T1'!$H$12:$H$139,0))","v":6676},0,{"$f":"INDEX('Supp val'!D$8:D$135,MATCH($B69,'Supp val'!$B$8:$B$135,0))","v":4059000},{"$f":"INDEX('Supp val'!E$8:E$135,MATCH($B69,'Supp val'!$B$8:$B$135,0))","v":21000},5.1736881005173688E-3,0]
[null,{"$f":"Names!I66","v":136},{"$f":"Names!F66","v":"Kempsey "},{"$f":"INDEX('ABS pop T1'!E$12:E$139,MATCH($C70,'ABS pop T1'!$H$12:$H$139,0))","v":29742},{"$f":"INDEX('ABS pop T1'!F$12:F$139,MATCH($C70,'ABS pop T1'!$H$12:$H$139,0))","v":29921},6.0184251227219931E-3,{"$f":"INDEX('Supp val'!D$8:D$135,MATCH($B70,'Supp val'!$B$8:$B$135,0))","v":20685000},{"$f":"INDEX('Supp val'!E$8:E$135,MATCH($B70,'Supp val'!$B$8:$B$135,0))","v":105000},5.076142131979695E-3,9.4228299074229811E-4]
[null,{"$f":"Names!I67","v":137},{"$f":"Names!F67","v":"Kiama "},{"$f":"INDEX('ABS pop T1'!E$12:E$139,MATCH($C71,'ABS pop T1'!$H$12:$H$139,0))","v":23383},{"$f":"INDEX('ABS pop T1'!F$12:F$139,MATCH($C71,'ABS pop T1'!$H$12:$H$139,0))","v":23685},1.2915365864089257E-2,{"$f":"INDEX('Supp val'!D$8:D$135,MATCH($B71,'Supp val'!$B$8:$B$135,0))","v":17874000},{"$f":"INDEX('Supp val'!E$8:E$135,MATCH($B71,'Supp val'!$B$8:$B$135,0))","v":75000},4.1960389392413566E-3,8.7193269248478991E-3]
[null,{"$f":"Names!I68","v":139},{"$f":"Names!F68","v":"Ku-ring-gai"},{"$f":"INDEX('ABS pop T1'!E$12:E$139,MATCH($C72,'ABS pop T1'!$H$12:$H$139,0))","v":127079},{"$f":"INDEX('ABS pop T1'!F$12:F$139,MATCH($C72,'ABS pop T1'!$H$12:$H$139,0))","v":127603},4.1234192903627509E-3,{"$f":"INDEX('Supp val'!D$8:D$135,MATCH($B72,'Supp val'!$B$8:$B$135,0))","v":66563000},{"$f":"INDEX('Supp val'!E$8:E$135,MATCH($B72,'Supp val'!$B$8:$B$135,0))","v":581000},8.7285729309075615E-3,0]
[null,{"$f":"Names!I69","v":140},{"$f":"Names!F69","v":"Kyogle"},{"$f":"INDEX('ABS pop T1'!E$12:E$139,MATCH($C73,'ABS pop T1'!$H$12:$H$139,0))","v":8796},{"$f":"INDEX('ABS pop T1'!F$12:F$139,MATCH($C73,'ABS pop T1'!$H$12:$H$139,0))","v":8788},0,{"$f":"INDEX('Supp val'!D$8:D$135,MATCH($B73,'Supp val'!$B$8:$B$135,0))","v":7322000},{"$f":"INDEX('Supp val'!E$8:E$135,MATCH($B73,'Supp val'!$B$8:$B$135,0))","v":50000},6.8287353182190655E-3,0]
[null,{"$f":"Names!I70","v":141},{"$f":"Names!F70","v":"Lachlan "},{"$f":"INDEX('ABS pop T1'!E$12:E$139,MATCH($C74,'ABS pop T1'!$H$12:$H$139,0))","v":6160},{"$f":"INDEX('ABS pop T1'!F$12:F$139,MATCH($C74,'ABS pop T1'!$H$12:$H$139,0))","v":6089},0,{"$f":"INDEX('Supp val'!D$8:D$135,MATCH($B74,'Supp val'!$B$8:$B$135,0))","v":7513000},{"$f":"INDEX('Supp val'!E$8:E$135,MATCH($B74,'Supp val'!$B$8:$B$135,0))","v":4000},5.324104884866232E-4,0]
[null,{"$f":"Names!I71","v":142},{"$f":"Names!F71","v":"Lake Macquarie "},{"$f":"INDEX('ABS pop T1'!E$12:E$139,MATCH($C75,'ABS pop T1'!$H$12:$H$139,0))","v":205875},{"$f":"INDEX('ABS pop T1'!F$12:F$139,MATCH($C75,'ABS pop T1'!$H$12:$H$139,0))","v":207775},9.2289010321797704E-3,{"$f":"INDEX('Supp val'!D$8:D$135,MATCH($B75,'Supp val'!$B$8:$B$135,0))","v":138672000},{"$f":"INDEX('Supp val'!E$8:E$135,MATCH($B75,'Supp val'!$B$8:$B$135,0))","v":1214000},8.7544709818853129E-3,4.7443005029445748E-4]
[null,{"$f":"Names!I72","v":143},{"$f":"Names!F72","v":"Lane Cove "},{"$f":"INDEX('ABS pop T1'!E$12:E$139,MATCH($C76,'ABS pop T1'!$H$12:$H$139,0))","v":40128},{"$f":"INDEX('ABS pop T1'!F$12:F$139,MATCH($C76,'ABS pop T1'!$H$12:$H$139,0))","v":40534},{"$f":"MAX(0,E76/D76-1)","v":1.0117623604465775E-2},{"$f":"INDEX('Supp val'!D$8:D$135,MATCH($B76,'Supp val'!$B$8:$B$135,0))","v":24991000},{"$f":"INDEX('Supp val'!E$8:E$135,MATCH($B76,'Supp val'!$B$8:$B$135,0))","v":600000},{"$f":"MAX(0,H76/G76)","v":2.4008643111520147E-2},{"$f":"MAX(0,F76-I76)","v":0}]
[null,{"$f":"Names!I73","v":144},{"$f":"Names!F73","v":"Leeton "},{"$f":"INDEX('ABS pop T1'!E$12:E$139,MATCH($C77,'ABS pop T1'!$H$12:$H$139,0))","v":11444},{"$f":"INDEX('ABS pop T1'!F$12:F$139,MATCH($C77,'ABS pop T1'!$H$12:$H$139,0))","v":11343},0,{"$f":"INDEX('Supp val'!D$8:D$135,MATCH($B77,'Supp val'!$B$8:$B$135,0))","v":7467000},{"$f":"INDEX('Supp val'!E$8:E$135,MATCH($B77,'Supp val'!$B$8:$B$135,0))","v":9000},1.2053033346725592E-3,0]
[null,{"$f":"Names!I74","v":146},{"$f":"Names!F74","v":"Lismore "},{"$f":"INDEX('ABS pop T1'!E$12:E$139,MATCH($C78,'ABS pop T1'!$H$12:$H$139,0))","v":43687},{"$f":"INDEX('ABS pop T1'!F$12:F$139,MATCH($C78,'ABS pop T1'!$H$12:$H$139,0))","v":43667},0,{"$f":"INDEX('Supp val'!D$8:D$135,MATCH($B78,'Supp val'!$B$8:$B$135,0))","v":31037000},{"$f":"INDEX('Supp val'!E$8:E$135,MATCH($B78,'Supp val'!$B$8:$B$135,0))","v":90000},2.899764796855366E-3,0]
[null,{"$f":"Names!I75","v":2044},{"$f":"Names!F75","v":"Lithgow "},{"$f":"INDEX('ABS pop T1'!E$12:E$139,MATCH($C79,'ABS pop T1'!$H$12:$H$139,0))","v":21603},{"$f":"INDEX('ABS pop T1'!F$12:F$139,MATCH($C79,'ABS pop T1'!$H$12:$H$139,0))","v":21516},0,{"$f":"INDEX('Supp val'!D$8:D$135,MATCH($B79,'Supp val'!$B$8:$B$135,0))","v":13885000},{"$f":"INDEX('Supp val'!E$8:E$135,MATCH($B79,'Supp val'!$B$8:$B$135,0))","v":3000},2.1606049693914295E-4,0]
[null,{"$f":"Names!I76","v":147},{"$f":"Names!F76","v":"Liverpool "},{"$f":"INDEX('ABS pop T1'!E$12:E$139,MATCH($C80,'ABS pop T1'!$H$12:$H$139,0))","v":227545},{"$f":"INDEX('ABS pop T1'!F$12:F$139,MATCH($C80,'ABS pop T1'!$H$12:$H$139,0))","v":231296},1.648465138763755E-2,{"$f":"INDEX('Supp val'!D$8:D$135,MATCH($B80,'Supp val'!$B$8:$B$135,0))","v":103541000},{"$f":"INDEX('Supp val'!E$8:E$135,MATCH($B80,'Supp val'!$B$8:$B$135,0))","v":1413000},1.3646767946996843E-2,2.8378834406407073E-3]
[null,{"$f":"Names!I77","v":2040},{"$f":"Names!F77","v":"Liverpool Plains "},{"$f":"INDEX('ABS pop T1'!E$12:E$139,MATCH($C81,'ABS pop T1'!$H$12:$H$139,0))","v":7903},{"$f":"INDEX('ABS pop T1'!F$12:F$139,MATCH($C81,'ABS pop T1'!$H$12:$H$139,0))","v":7853},0,{"$f":"INDEX('Supp val'!D$8:D$135,MATCH($B81,'Supp val'!$B$8:$B$135,0))","v":7496000},{"$f":"INDEX('Supp val'!E$8:E$135,MATCH($B81,'Supp val'!$B$8:$B$135,0))","v":18000},2.4012806830309499E-3,0]
[null,{"$f":"Names!I78","v":148},{"$f":"Names!F78","v":"Lockhart "},{"$f":"INDEX('ABS pop T1'!E$12:E$139,MATCH($C82,'ABS pop T1'!$H$12:$H$139,0))","v":3285},{"$f":"INDEX('ABS pop T1'!F$12:F$139,MATCH($C82,'ABS pop T1'!$H$12:$H$139,0))","v":3259},0,{"$f":"INDEX('Supp val'!D$8:D$135,MATCH($B82,'Supp val'!$B$8:$B$135,0))","v":2477000},{"$f":"INDEX('Supp val'!E$8:E$135,MATCH($B82,'Supp val'!$B$8:$B$135,0))","v":1000},4.0371417036737988E-4,0]
[null,{"$f":"Names!I79","v":150},{"$f":"Names!F79","v":"Maitland "},{"$f":"INDEX('ABS pop T1'!E$12:E$139,MATCH($C83,'ABS pop T1'!$H$12:$H$139,0))","v":85155},{"$f":"INDEX('ABS pop T1'!F$12:F$139,MATCH($C83,'ABS pop T1'!$H$12:$H$139,0))","v":87395},2.630497328401149E-2,{"$f":"INDEX('Supp val'!D$8:D$135,MATCH($B83,'Supp val'!$B$8:$B$135,0))","v":67478000},{"$f":"INDEX('Supp val'!E$8:E$135,MATCH($B83,'Supp val'!$B$8:$B$135,0))","v":2094000},3.1032336465218295E-2,0]
[null,{"$f":"Names!I80","v":2084},{"$f":"Names!F80","v":"Mid-Coast"},{"$f":"INDEX('ABS pop T1'!E$12:E$139,MATCH($C84,'ABS pop T1'!$H$12:$H$139,0))","v":93826},{"$f":"INDEX('ABS pop T1'!F$12:F$139,MATCH($C84,'ABS pop T1'!$H$12:$H$139,0))","v":94395},6.064417112527476E-3,{"$f":"INDEX('Supp val'!D$8:D$135,MATCH($B84,'Supp val'!$B$8:$B$135,0))","v":79971000},{"$f":"INDEX('Supp val'!E$8:E$135,MATCH($B84,'Supp val'!$B$8:$B$135,0))","v":308000},3.851396131097523E-3,2.2130209814299529E-3]
[null,{"$f":"Names!I81","v":2042},{"$f":"Names!F81","v":"Mid-Western Regional"},{"$f":"INDEX('ABS pop T1'!E$12:E$139,MATCH($C85,'ABS pop T1'!$H$12:$H$139,0))","v":25248},{"$f":"INDEX('ABS pop T1'!F$12:F$139,MATCH($C85,'ABS pop T1'!$H$12:$H$139,0))","v":25367},4.7132446134348083E-3,{"$f":"INDEX('Supp val'!D$8:D$135,MATCH($B85,'Supp val'!$B$8:$B$135,0))","v":27731000},{"$f":"INDEX('Supp val'!E$8:E$135,MATCH($B85,'Supp val'!$B$8:$B$135,0))","v":137000},4.9403194980346902E-3,0]
[null,{"$f":"Names!I82","v":155},{"$f":"Names!F82","v":"Moree Plains "},{"$f":"INDEX('ABS pop T1'!E$12:E$139,MATCH($C86,'ABS pop T1'!$H$12:$H$139,0))","v":13260},{"$f":"INDEX('ABS pop T1'!F$12:F$139,MATCH($C86,'ABS pop T1'!$H$12:$H$139,0))","v":13077},0,{"$f":"INDEX('Supp val'!D$8:D$135,MATCH($B86,'Supp val'!$B$8:$B$135,0))","v":23507000},{"$f":"INDEX('Supp val'!E$8:E$135,MATCH($B86,'Supp val'!$B$8:$B$135,0))","v":-8000},0,0]
[null,{"$f":"Names!I83","v":156},{"$f":"Names!F83","v":"Mosman "},{"$f":"INDEX('ABS pop T1'!E$12:E$139,MATCH($C87,'ABS pop T1'!$H$12:$H$139,0))","v":30960},{"$f":"INDEX('ABS pop T1'!F$12:F$139,MATCH($C87,'ABS pop T1'!$H$12:$H$139,0))","v":30785},0,{"$f":"INDEX('Supp val'!D$8:D$135,MATCH($B87,'Supp val'!$B$8:$B$135,0))","v":20587000},{"$f":"INDEX('Supp val'!E$8:E$135,MATCH($B87,'Supp val'!$B$8:$B$135,0))","v":6000},2.9144605819206293E-4,0]
[null,{"$f":"Names!I84","v":2085},{"$f":"Names!F84","v":"Murray River"},{"$f":"INDEX('ABS pop T1'!E$12:E$139,MATCH($C88,'ABS pop T1'!$H$12:$H$139,0))","v":12118},{"$f":"INDEX('ABS pop T1'!F$12:F$139,MATCH($C88,'ABS pop T1'!$H$12:$H$139,0))","v":12330},1.7494636078560832E-2,{"$f":"INDEX('Supp val'!D$8:D$135,MATCH($B88,'Supp val'!$B$8:$B$135,0))","v":10545000},{"$f":"INDEX('Supp val'!E$8:E$135,MATCH($B88,'Supp val'!$B$8:$B$135,0))","v":97000},9.1986723565670933E-3,8.295963721993739E-3]
[null,{"$f":"Names!I85","v":2086},{"$f":"Names!F85","v":"Murrumbidgee (new)"},{"$f":"INDEX('ABS pop T1'!E$12:E$139,MATCH($C89,'ABS pop T1'!$H$12:$H$139,0))","v":3917},{"$f":"INDEX('ABS pop T1'!F$12:F$139,MATCH($C89,'ABS pop T1'!$H$12:$H$139,0))","v":3916},0,{"$f":"INDEX('Supp val'!D$8:D$135,MATCH($B89,'Supp val'!$B$8:$B$135,0))","v":4330000},{"$f":"INDEX('Supp val'!E$8:E$135,MATCH($B89,'Supp val'!$B$8:$B$135,0))","v":-4000},0,0]
[null,{"$f":"Names!I86","v":162},{"$f":"Names!F86","v":"Muswellbrook "},{"$f":"INDEX('ABS pop T1'!E$12:E$139,MATCH($C90,'ABS pop T1'!$H$12:$H$139,0))","v":16375},{"$f":"INDEX('ABS pop T1'!F$12:F$139,MATCH($C90,'ABS pop T1'!$H$12:$H$139,0))","v":16355},0,{"$f":"INDEX('Supp val'!D$8:D$135,MATCH($B90,'Supp val'!$B$8:$B$135,0))","v":17722000},{"$f":"INDEX('Supp val'!E$8:E$135,MATCH($B90,'Supp val'!$B$8:$B$135,0))","v":939000},5.2984990407403225E-2,0]
[null,{"$f":"Names!I87","v":163},{"$f":"Names!F87","v":"Nambucca "},{"$f":"INDEX('ABS pop T1'!E$12:E$139,MATCH($C91,'ABS pop T1'!$H$12:$H$139,0))","v":19802},{"$f":"INDEX('ABS pop T1'!F$12:F$139,MATCH($C91,'ABS pop T1'!$H$12:$H$139,0))","v":19861},2.9794970205030413E-3,{"$f":"INDEX('Supp val'!D$8:D$135,MATCH($B91,'Supp val'!$B$8:$B$135,0))","v":11258000},{"$f":"INDEX('Supp val'!E$8:E$135,MATCH($B91,'Supp val'!$B$8:$B$135,0))","v":78000},6.9284064665127024E-3,0]
[null,{"$f":"Names!I88","v":164},{"$f":"Names!F88","v":"Narrabri "},{"$f":"INDEX('ABS pop T1'!E$12:E$139,MATCH($C92,'ABS pop T1'!$H$12:$H$139,0))","v":13134},{"$f":"INDEX('ABS pop T1'!F$12:F$139,MATCH($C92,'ABS pop T1'!$H$12:$H$139,0))","v":13049},0,{"$f":"INDEX('Supp val'!D$8:D$135,MATCH($B92,'Supp val'!$B$8:$B$135,0))","v":13538000},{"$f":"INDEX('Supp val'!E$8:E$135,MATCH($B92,'Supp val'!$B$8:$B$135,0))","v":6000},4.4319692716797166E-4,0]
[null,{"$f":"Names!I89","v":165},{"$f":"Names!F89","v":"Narrandera "},{"$f":"INDEX('ABS pop T1'!E$12:E$139,MATCH($C93,'ABS pop T1'!$H$12:$H$139,0))","v":5898},{"$f":"INDEX('ABS pop T1'!F$12:F$139,MATCH($C93,'ABS pop T1'!$H$12:$H$139,0))","v":5858},0,{"$f":"INDEX('Supp val'!D$8:D$135,MATCH($B93,'Supp val'!$B$8:$B$135,0))","v":4950000},{"$f":"INDEX('Supp val'!E$8:E$135,MATCH($B93,'Supp val'!$B$8:$B$135,0))","v":1000},2.0202020202020202E-4,0]
[null,{"$f":"Names!I90","v":166},{"$f":"Names!F90","v":"Narromine "},{"$f":"INDEX('ABS pop T1'!E$12:E$139,MATCH($C94,'ABS pop T1'!$H$12:$H$139,0))","v":6516},{"$f":"INDEX('ABS pop T1'!F$12:F$139,MATCH($C94,'ABS pop T1'!$H$12:$H$139,0))","v":6460},0,{"$f":"INDEX('Supp val'!D$8:D$135,MATCH($B94,'Supp val'!$B$8:$B$135,0))","v":5872000},{"$f":"INDEX('Supp val'!E$8:E$135,MATCH($B94,'Supp val'!$B$8:$B$135,0))","v":-8000},0,0]
[null,{"$f":"Names!I91","v":167},{"$f":"Names!F91","v":"Newcastle "},{"$f":"INDEX('ABS pop T1'!E$12:E$139,MATCH($C95,'ABS pop T1'!$H$12:$H$139,0))","v":165541},{"$f":"INDEX('ABS pop T1'!F$12:F$139,MATCH($C95,'ABS pop T1'!$H$12:$H$139,0))","v":167363},1.1006336798738747E-2,{"$f":"INDEX('Supp val'!D$8:D$135,MATCH($B95,'Supp val'!$B$8:$B$135,0))","v":159676000},{"$f":"INDEX('Supp val'!E$8:E$135,MATCH($B95,'Supp val'!$B$8:$B$135,0))","v":961000},6.0184373356045994E-3,4.9878994631341479E-3]
[null,{"$f":"Names!I92","v":168},{"$f":"Names!F92","v":"North Sydney"},{"$f":"INDEX('ABS pop T1'!E$12:E$139,MATCH($C96,'ABS pop T1'!$H$12:$H$139,0))","v":74957},{"$f":"INDEX('ABS pop T1'!F$12:F$139,MATCH($C96,'ABS pop T1'!$H$12:$H$139,0))","v":75094},1.827714556345672E-3,{"$f":"INDEX('Supp val'!D$8:D$135,MATCH($B96,'Supp val'!$B$8:$B$135,0))","v":48530000},{"$f":"INDEX('Supp val'!E$8:E$135,MATCH($B96,'Supp val'!$B$8:$B$135,0))","v":-131000},0,1.827714556345672E-3]
[null,{"$f":"Names!I93","v":2087},{"$f":"Names!F93","v":"Northern Beaches"},{"$f":"INDEX('ABS pop T1'!E$12:E$139,MATCH($C97,'ABS pop T1'!$H$12:$H$139,0))","v":273409},{"$f":"INDEX('ABS pop T1'!F$12:F$139,MATCH($C97,'ABS pop T1'!$H$12:$H$139,0))","v":274041},2.3115552158121666E-3,{"$f":"INDEX('Supp val'!D$8:D$135,MATCH($B97,'Supp val'!$B$8:$B$135,0))","v":167900000},{"$f":"INDEX('Supp val'!E$8:E$135,MATCH($B97,'Supp val'!$B$8:$B$135,0))","v":852000},5.0744490768314474E-3,0]
[null,{"$f":"Names!I94","v":2045},{"$f":"Names!F94","v":"Oberon"},{"$f":"INDEX('ABS pop T1'!E$12:E$139,MATCH($C98,'ABS pop T1'!$H$12:$H$139,0))","v":5411},{"$f":"INDEX('ABS pop T1'!F$12:F$139,MATCH($C98,'ABS pop T1'!$H$12:$H$139,0))","v":5419},1.4784697837737504E-3,{"$f":"INDEX('Supp val'!D$8:D$135,MATCH($B98,'Supp val'!$B$8:$B$135,0))","v":4560000},{"$f":"INDEX('Supp val'!E$8:E$135,MATCH($B98,'Supp val'!$B$8:$B$135,0))","v":16000},3.5087719298245615E-3,0]
[null,{"$f":"Names!I95","v":172},{"$f":"Names!F95","v":"Orange "},{"$f":"INDEX('ABS pop T1'!E$12:E$139,MATCH($C99,'ABS pop T1'!$H$12:$H$139,0))","v":42445},{"$f":"INDEX('ABS pop T1'!F$12:F$139,MATCH($C99,'ABS pop T1'!$H$12:$H$139,0))","v":42503},1.3664742608081593E-3,{"$f":"INDEX('Supp val'!D$8:D$135,MATCH($B99,'Supp val'!$B$8:$B$135,0))","v":34283000},{"$f":"INDEX('Supp val'!E$8:E$135,MATCH($B99,'Supp val'!$B$8:$B$135,0))","v":268000},7.8172855351048617E-3,0]
[null,{"$f":"Names!I96","v":173},{"$f":"Names!F96","v":"Parkes "},{"$f":"INDEX('ABS pop T1'!E$12:E$139,MATCH($C100,'ABS pop T1'!$H$12:$H$139,0))","v":14835},{"$f":"INDEX('ABS pop T1'!F$12:F$139,MATCH($C100,'ABS pop T1'!$H$12:$H$139,0))","v":14728},0,{"$f":"INDEX('Supp val'!D$8:D$135,MATCH($B100,'Supp val'!$B$8:$B$135,0))","v":14104000},{"$f":"INDEX('Supp val'!E$8:E$135,MATCH($B100,'Supp val'!$B$8:$B$135,0))","v":-13000},0,0]
[null,{"$f":"Names!I97","v":2089},{"$f":"Names!F97","v":"Parramatta "},{"$f":"INDEX('ABS pop T1'!E$12:E$139,MATCH($C101,'ABS pop T1'!$H$12:$H$139,0))","v":257094},{"$f":"INDEX('ABS pop T1'!F$12:F$139,MATCH($C101,'ABS pop T1'!$H$12:$H$139,0))","v":260296},1.2454588594055016E-2,{"$f":"INDEX('Supp val'!D$8:D$135,MATCH($B101,'Supp val'!$B$8:$B$135,0))","v":148650000},{"$f":"INDEX('Supp val'!E$8:E$135,MATCH($B101,'Supp val'!$B$8:$B$135,0))","v":2312000},1.5553313151698622E-2,0]
[null,{"$f":"Names!I98","v":176},{"$f":"Names!F98","v":"Penrith "},{"$f":"INDEX('ABS pop T1'!E$12:E$139,MATCH($C102,'ABS pop T1'!$H$12:$H$139,0))","v":212944},{"$f":"INDEX('ABS pop T1'!F$12:F$139,MATCH($C102,'ABS pop T1'!$H$12:$H$139,0))","v":216282},1.5675482756029702E-2,{"$f":"INDEX('Supp val'!D$8:D$135,MATCH($B102,'Supp val'!$B$8:$B$135,0))","v":128469000},{"$f":"INDEX('Supp val'!E$8:E$135,MATCH($B102,'Supp val'!$B$8:$B$135,0))","v":1060000},8.2510177552561313E-3,7.4244650007735703E-3]
[null,{"$f":"Names!I99","v":124},{"$f":"Names!F99","v":"Port Macquarie-Hastings"},{"$f":"INDEX('ABS pop T1'!E$12:E$139,MATCH($C103,'ABS pop T1'!$H$12:$H$139,0))","v":84515},{"$f":"INDEX('ABS pop T1'!F$12:F$139,MATCH($C103,'ABS pop T1'!$H$12:$H$139,0))","v":85952},1.7002898893687446E-2,{"$f":"INDEX('Supp val'!D$8:D$135,MATCH($B103,'Supp val'!$B$8:$B$135,0))","v":52287000},{"$f":"INDEX('Supp val'!E$8:E$135,MATCH($B103,'Supp val'!$B$8:$B$135,0))","v":371000},7.0954539369250487E-3,9.9074449567623964E-3]
[null,{"$f":"Names!I100","v":178},{"$f":"Names!F100","v":"Port Stephens"},{"$f":"INDEX('ABS pop T1'!E$12:E$139,MATCH($C104,'ABS pop T1'!$H$12:$H$139,0))","v":73472},{"$f":"INDEX('ABS pop T1'!F$12:F$139,MATCH($C104,'ABS pop T1'!$H$12:$H$139,0))","v":74506},1.4073388501742112E-2,{"$f":"INDEX('Supp val'!D$8:D$135,MATCH($B104,'Supp val'!$B$8:$B$135,0))","v":43572000},{"$f":"INDEX('Supp val'!E$8:E$135,MATCH($B104,'Supp val'!$B$8:$B$135,0))","v":334000},7.6654732396952167E-3,6.4079152620468956E-3]
[null,{"$f":"Names!I101","v":2095},{"$f":"Names!F101","v":"Queanbeyan-Palerang Regional"},{"$f":"INDEX('ABS pop T1'!E$12:E$139,MATCH($C105,'ABS pop T1'!$H$12:$H$139,0))","v":61089},{"$f":"INDEX('ABS pop T1'!F$12:F$139,MATCH($C105,'ABS pop T1'!$H$12:$H$139,0))","v":62239},1.8824993042937388E-2,{"$f":"INDEX('Supp val'!D$8:D$135,MATCH($B105,'Supp val'!$B$8:$B$135,0))","v":37531000},{"$f":"INDEX('Supp val'!E$8:E$135,MATCH($B105,'Supp val'!$B$8:$B$135,0))","v":737000},1.9637099997335535E-2,0]
[null,{"$f":"Names!I102","v":181},{"$f":"Names!F102","v":"Randwick "},{"$f":"INDEX('ABS pop T1'!E$12:E$139,MATCH($C106,'ABS pop T1'!$H$12:$H$139,0))","v":155521},{"$f":"INDEX('ABS pop T1'!F$12:F$139,MATCH($C106,'ABS pop T1'!$H$12:$H$139,0))","v":156619},7.0601397881957517E-3,{"$f":"INDEX('Supp val'!D$8:D$135,MATCH($B106,'Supp val'!$B$8:$B$135,0))","v":87430000},{"$f":"INDEX('Supp val'!E$8:E$135,MATCH($B106,'Supp val'!$B$8:$B$135,0))","v":69000},7.8920279080407188E-4,6.2709369973916801E-3]
[null,{"$f":"Names!I103","v":1981},{"$f":"Names!F103","v":"Richmond Valley"},{"$f":"INDEX('ABS pop T1'!E$12:E$139,MATCH($C107,'ABS pop T1'!$H$12:$H$139,0))","v":23462},{"$f":"INDEX('ABS pop T1'!F$12:F$139,MATCH($C107,'ABS pop T1'!$H$12:$H$139,0))","v":23490},1.1934191458529142E-3,{"$f":"INDEX('Supp val'!D$8:D$135,MATCH($B107,'Supp val'!$B$8:$B$135,0))","v":13175000},{"$f":"INDEX('Supp val'!E$8:E$135,MATCH($B107,'Supp val'!$B$8:$B$135,0))","v":41000},3.1119544592030359E-3,0]
[null,{"$f":"Names!I104","v":184},{"$f":"Names!F104","v":"Ryde "},{"$f":"INDEX('ABS pop T1'!E$12:E$139,MATCH($C108,'ABS pop T1'!$H$12:$H$139,0))","v":131186},{"$f":"INDEX('ABS pop T1'!F$12:F$139,MATCH($C108,'ABS pop T1'!$H$12:$H$139,0))","v":133224},1.5535194304270306E-2,{"$f":"INDEX('Supp val'!D$8:D$135,MATCH($B108,'Supp val'!$B$8:$B$135,0))","v":70973000},{"$f":"INDEX('Supp val'!E$8:E$135,MATCH($B108,'Supp val'!$B$8:$B$135,0))","v":2047000},2.8841953982500387E-2,0]
[null,{"$f":"Names!I105","v":188},{"$f":"Names!F105","v":"Shellharbour "},{"$f":"INDEX('ABS pop T1'!E$12:E$139,MATCH($C109,'ABS pop T1'!$H$12:$H$139,0))","v":73225},{"$f":"INDEX('ABS pop T1'!F$12:F$139,MATCH($C109,'ABS pop T1'!$H$12:$H$139,0))","v":74622},1.9078183680437011E-2,{"$f":"INDEX('Supp val'!D$8:D$135,MATCH($B109,'Supp val'!$B$8:$B$135,0))","v":49667000},{"$f":"INDEX('Supp val'!E$8:E$135,MATCH($B109,'Supp val'!$B$8:$B$135,0))","v":266000},5.3556687539009808E-3,1.372251492653603E-2]
[null,{"$f":"Names!I106","v":189},{"$f":"Names!F106","v":"Shoalhaven "},{"$f":"INDEX('ABS pop T1'!E$12:E$139,MATCH($C110,'ABS pop T1'!$H$12:$H$139,0))","v":105637},{"$f":"INDEX('ABS pop T1'!F$12:F$139,MATCH($C110,'ABS pop T1'!$H$12:$H$139,0))","v":107191},1.4710754754489352E-2,{"$f":"INDEX('Supp val'!D$8:D$135,MATCH($B110,'Supp val'!$B$8:$B$135,0))","v":77640000},{"$f":"INDEX('Supp val'!E$8:E$135,MATCH($B110,'Supp val'!$B$8:$B$135,0))","v":387000},4.9845440494590415E-3,9.7262107050303109E-3]
[null,{"$f":"Names!I107","v":190},{"$f":"Names!F107","v":"Singleton"},{"$f":"INDEX('ABS pop T1'!E$12:E$139,MATCH($C111,'ABS pop T1'!$H$12:$H$139,0))","v":23457},{"$f":"INDEX('ABS pop T1'!F$12:F$139,MATCH($C111,'ABS pop T1'!$H$12:$H$139,0))","v":23380},0,{"$f":"INDEX('Supp val'!D$8:D$135,MATCH($B111,'Supp val'!$B$8:$B$135,0))","v":22122000},{"$f":"INDEX('Supp val'!E$8:E$135,MATCH($B111,'Supp val'!$B$8:$B$135,0))","v":296000},1.3380345357562608E-2,0]
[null,{"$f":"Names!I108","v":2096},{"$f":"Names!F108","v":"Snowy Monaro Regional"},{"$f":"INDEX('ABS pop T1'!E$12:E$139,MATCH($C112,'ABS pop T1'!$H$12:$H$139,0))","v":20793},{"$f":"INDEX('ABS pop T1'!F$12:F$139,MATCH($C112,'ABS pop T1'!$H$12:$H$139,0))","v":20997},9.810994084547664E-3,{"$f":"INDEX('Supp val'!D$8:D$135,MATCH($B112,'Supp val'!$B$8:$B$135,0))","v":16311000},{"$f":"INDEX('Supp val'!E$8:E$135,MATCH($B112,'Supp val'!$B$8:$B$135,0))","v":140000},8.5831647354546008E-3,1.2278293490930632E-3]
[null,{"$f":"Names!I109","v":2097},{"$f":"Names!F109","v":"Snowy Valleys"},{"$f":"INDEX('ABS pop T1'!E$12:E$139,MATCH($C113,'ABS pop T1'!$H$12:$H$139,0))","v":14476},{"$f":"INDEX('ABS pop T1'!F$12:F$139,MATCH($C113,'ABS pop T1'!$H$12:$H$139,0))","v":14412},0,{"$f":"INDEX('Supp val'!D$8:D$135,MATCH($B113,'Supp val'!$B$8:$B$135,0))","v":9409000},{"$f":"INDEX('Supp val'!E$8:E$135,MATCH($B113,'Supp val'!$B$8:$B$135,0))","v":10000},1.0628122010840685E-3,0]
[null,{"$f":"Names!I110","v":193},{"$f":"Names!F110","v":"Strathfield "},{"$f":"INDEX('ABS pop T1'!E$12:E$139,MATCH($C114,'ABS pop T1'!$H$12:$H$139,0))","v":46896},{"$f":"INDEX('ABS pop T1'!F$12:F$139,MATCH($C114,'ABS pop T1'!$H$12:$H$139,0))","v":47767},1.8573012623677831E-2,{"$f":"INDEX('Supp val'!D$8:D$135,MATCH($B114,'Supp val'!$B$8:$B$135,0))","v":18421000},{"$f":"INDEX('Supp val'!E$8:E$135,MATCH($B114,'Supp val'!$B$8:$B$135,0))","v":261000},1.4168611910319744E-2,4.4044007133580872E-3]
[null,{"$f":"Names!I111","v":194},{"$f":"Names!F111","v":"Sutherland "},{"$f":"INDEX('ABS pop T1'!E$12:E$139,MATCH($C115,'ABS pop T1'!$H$12:$H$139,0))","v":230579},{"$f":"INDEX('ABS pop T1'!F$12:F$139,MATCH($C115,'ABS pop T1'!$H$12:$H$139,0))","v":232369},7.7630660207563817E-3,{"$f":"INDEX('Supp val'!D$8:D$135,MATCH($B115,'Supp val'!$B$8:$B$135,0))","v":130839000},{"$f":"INDEX('Supp val'!E$8:E$135,MATCH($B115,'Supp val'!$B$8:$B$135,0))","v":1151000},8.7970712096546132E-3,0]
[null,{"$f":"Names!I112","v":2029},{"$f":"Names!F112","v":"Sydney "},{"$f":"INDEX('ABS pop T1'!E$12:E$139,MATCH($C116,'ABS pop T1'!$H$12:$H$139,0))","v":245942},{"$f":"INDEX('ABS pop T1'!F$12:F$139,MATCH($C116,'ABS pop T1'!$H$12:$H$139,0))","v":248736},1.1360402046010742E-2,{"$f":"INDEX('Supp val'!D$8:D$135,MATCH($B116,'Supp val'!$B$8:$B$135,0))","v":305065000},{"$f":"INDEX('Supp val'!E$8:E$135,MATCH($B116,'Supp val'!$B$8:$B$135,0))","v":1471000},4.8219231966957861E-3,6.5384788493149564E-3]
[null,{"$f":"Names!I113","v":2038},{"$f":"Names!F113","v":"Tamworth Regional"},{"$f":"INDEX('ABS pop T1'!E$12:E$139,MATCH($C117,'ABS pop T1'!$H$12:$H$139,0))","v":62531},{"$f":"INDEX('ABS pop T1'!F$12:F$139,MATCH($C117,'ABS pop T1'!$H$12:$H$139,0))","v":62545},2.2388895108016449E-4,{"$f":"INDEX('Supp val'!D$8:D$135,MATCH($B117,'Supp val'!$B$8:$B$135,0))","v":37073000},{"$f":"INDEX('Supp val'!E$8:E$135,MATCH($B117,'Supp val'!$B$8:$B$135,0))","v":240000},6.4737140236830037E-3,0]
[null,{"$f":"Names!I114","v":198},{"$f":"Names!F114","v":"Temora "},{"$f":"INDEX('ABS pop T1'!E$12:E$139,MATCH($C118,'ABS pop T1'!$H$12:$H$139,0))","v":6307},{"$f":"INDEX('ABS pop T1'!F$12:F$139,MATCH($C118,'ABS pop T1'!$H$12:$H$139,0))","v":6274},0,{"$f":"INDEX('Supp val'!D$8:D$135,MATCH($B118,'Supp val'!$B$8:$B$135,0))","v":4042000},{"$f":"INDEX('Supp val'!E$8:E$135,MATCH($B118,'Supp val'!$B$8:$B$135,0))","v":3000},7.4220682830282035E-4,0]
[null,{"$f":"Names!I115","v":199},{"$f":"Names!F115","v":"Tenterfield "},{"$f":"INDEX('ABS pop T1'!E$12:E$139,MATCH($C119,'ABS pop T1'!$H$12:$H$139,0))","v":6594},{"$f":"INDEX('ABS pop T1'!F$12:F$139,MATCH($C119,'ABS pop T1'!$H$12:$H$139,0))","v":6470},0,{"$f":"INDEX('Supp val'!D$8:D$135,MATCH($B119,'Supp val'!$B$8:$B$135,0))","v":4598000},{"$f":"INDEX('Supp val'!E$8:E$135,MATCH($B119,'Supp val'!$B$8:$B$135,0))","v":0},0,0]
[null,{"$f":"Names!I116","v":59},{"$f":"Names!F116","v":"Hills "},{"$f":"INDEX('ABS pop T1'!E$12:E$139,MATCH($C120,'ABS pop T1'!$H$12:$H$139,0))","v":177927},{"$f":"INDEX('ABS pop T1'!F$12:F$139,MATCH($C120,'ABS pop T1'!$H$12:$H$139,0))","v":183791},3.2957336435729179E-2,{"$f":"INDEX('Supp val'!D$8:D$135,MATCH($B120,'Supp val'!$B$8:$B$135,0))","v":74273000},{"$f":"INDEX('Supp val'!E$8:E$135,MATCH($B120,'Supp val'!$B$8:$B$135,0))","v":1816000},2.4450338615647677E-2,8.5069978200815015E-3]
[null,{"$f":"Names!I117","v":202},{"$f":"Names!F117","v":"Tweed "},{"$f":"INDEX('ABS pop T1'!E$12:E$139,MATCH($C121,'ABS pop T1'!$H$12:$H$139,0))","v":96985},{"$f":"INDEX('ABS pop T1'!F$12:F$139,MATCH($C121,'ABS pop T1'!$H$12:$H$139,0))","v":98382},1.4404289323091124E-2,{"$f":"INDEX('Supp val'!D$8:D$135,MATCH($B121,'Supp val'!$B$8:$B$135,0))","v":63741000},{"$f":"INDEX('Supp val'!E$8:E$135,MATCH($B121,'Supp val'!$B$8:$B$135,0))","v":250000},3.9221223388399935E-3,1.048216698425113E-2]
[null,{"$f":"Names!I118","v":2046},{"$f":"Names!F118","v":"Upper Hunter "},{"$f":"INDEX('ABS pop T1'!E$12:E$139,MATCH($C122,'ABS pop T1'!$H$12:$H$139,0))","v":14178},{"$f":"INDEX('ABS pop T1'!F$12:F$139,MATCH($C122,'ABS pop T1'!$H$12:$H$139,0))","v":14167},0,{"$f":"INDEX('Supp val'!D$8:D$135,MATCH($B122,'Supp val'!$B$8:$B$135,0))","v":11098000},{"$f":"INDEX('Supp val'!E$8:E$135,MATCH($B122,'Supp val'!$B$8:$B$135,0))","v":18000},1.6219138583528565E-3,0]
[null,{"$f":"Names!I119","v":2035},{"$f":"Names!F119","v":"Upper Lachlan "},{"$f":"INDEX('ABS pop T1'!E$12:E$139,MATCH($C123,'ABS pop T1'!$H$12:$H$139,0))","v":8059},{"$f":"INDEX('ABS pop T1'!F$12:F$139,MATCH($C123,'ABS pop T1'!$H$12:$H$139,0))","v":8274},2.6678247921578357E-2,{"$f":"INDEX('Supp val'!D$8:D$135,MATCH($B123,'Supp val'!$B$8:$B$135,0))","v":7325000},{"$f":"INDEX('Supp val'!E$8:E$135,MATCH($B123,'Supp val'!$B$8:$B$135,0))","v":70000},9.5563139931740607E-3,1.7121933928404297E-2]
[null,{"$f":"Names!I120","v":204},{"$f":"Names!F120","v":"Uralla "},{"$f":"INDEX('ABS pop T1'!E$12:E$139,MATCH($C124,'ABS pop T1'!$H$12:$H$139,0))","v":6011},{"$f":"INDEX('ABS pop T1'!F$12:F$139,MATCH($C124,'ABS pop T1'!$H$12:$H$139,0))","v":5944},0,{"$f":"INDEX('Supp val'!D$8:D$135,MATCH($B124,'Supp val'!$B$8:$B$135,0))","v":3909000},{"$f":"INDEX('Supp val'!E$8:E$135,MATCH($B124,'Supp val'!$B$8:$B$135,0))","v":0},0,0]
[null,{"$f":"Names!I121","v":206},{"$f":"Names!F121","v":"Wagga Wagga "},{"$f":"INDEX('ABS pop T1'!E$12:E$139,MATCH($C125,'ABS pop T1'!$H$12:$H$139,0))","v":65249},{"$f":"INDEX('ABS pop T1'!F$12:F$139,MATCH($C125,'ABS pop T1'!$H$12:$H$139,0))","v":65770},7.9847967018651378E-3,{"$f":"INDEX('Supp val'!D$8:D$135,MATCH($B125,'Supp val'!$B$8:$B$135,0))","v":45251000},{"$f":"INDEX('Supp val'!E$8:E$135,MATCH($B125,'Supp val'!$B$8:$B$135,0))","v":496000},1.0961083732956178E-2,0]
[null,{"$f":"Names!I122","v":208},{"$f":"Names!F122","v":"Walcha"},{"$f":"INDEX('ABS pop T1'!E$12:E$139,MATCH($C126,'ABS pop T1'!$H$12:$H$139,0))","v":3134},{"$f":"INDEX('ABS pop T1'!F$12:F$139,MATCH($C126,'ABS pop T1'!$H$12:$H$139,0))","v":3105},0,{"$f":"INDEX('Supp val'!D$8:D$135,MATCH($B126,'Supp val'!$B$8:$B$135,0))","v":3485000},{"$f":"INDEX('Supp val'!E$8:E$135,MATCH($B126,'Supp val'!$B$8:$B$135,0))","v":0},0,0]
[null,{"$f":"Names!I123","v":209},{"$f":"Names!F123","v":"Walgett "},{"$f":"INDEX('ABS pop T1'!E$12:E$139,MATCH($C127,'ABS pop T1'!$H$12:$H$139,0))","v":5952},{"$f":"INDEX('ABS pop T1'!F$12:F$139,MATCH($C127,'ABS pop T1'!$H$12:$H$139,0))","v":5828},0,{"$f":"INDEX('Supp val'!D$8:D$135,MATCH($B127,'Supp val'!$B$8:$B$135,0))","v":5662000},{"$f":"INDEX('Supp val'!E$8:E$135,MATCH($B127,'Supp val'!$B$8:$B$135,0))","v":1000},1.7661603673613564E-4,0]
[null,{"$f":"Names!I124","v":210},{"$f":"Names!F124","v":"Warren "},{"$f":"INDEX('ABS pop T1'!E$12:E$139,MATCH($C128,'ABS pop T1'!$H$12:$H$139,0))","v":2697},{"$f":"INDEX('ABS pop T1'!F$12:F$139,MATCH($C128,'ABS pop T1'!$H$12:$H$139,0))","v":2716},7.0448646644418744E-3,{"$f":"INDEX('Supp val'!D$8:D$135,MATCH($B128,'Supp val'!$B$8:$B$135,0))","v":4901000},{"$f":"INDEX('Supp val'!E$8:E$135,MATCH($B128,'Supp val'!$B$8:$B$135,0))","v":5000},1.0201999591920017E-3,6.0246647052498731E-3]
[null,{"$f":"Names!I125","v":2050},{"$f":"Names!F125","v":"Warrumbungle "},{"$f":"INDEX('ABS pop T1'!E$12:E$139,MATCH($C129,'ABS pop T1'!$H$12:$H$139,0))","v":9277},{"$f":"INDEX('ABS pop T1'!F$12:F$139,MATCH($C129,'ABS pop T1'!$H$12:$H$139,0))","v":9209},0,{"$f":"INDEX('Supp val'!D$8:D$135,MATCH($B129,'Supp val'!$B$8:$B$135,0))","v":8153000},{"$f":"INDEX('Supp val'!E$8:E$135,MATCH($B129,'Supp val'!$B$8:$B$135,0))","v":6000},7.3592542622347601E-4,0]
[null,{"$f":"Names!I126","v":212},{"$f":"Names!F126","v":"Waverley"},{"$f":"INDEX('ABS pop T1'!E$12:E$139,MATCH($C130,'ABS pop T1'!$H$12:$H$139,0))","v":74222},{"$f":"INDEX('ABS pop T1'!F$12:F$139,MATCH($C130,'ABS pop T1'!$H$12:$H$139,0))","v":74276},7.27547088464231E-4,{"$f":"INDEX('Supp val'!D$8:D$135,MATCH($B130,'Supp val'!$B$8:$B$135,0))","v":46068000},{"$f":"INDEX('Supp val'!E$8:E$135,MATCH($B130,'Supp val'!$B$8:$B$135,0))","v":-75000},0,7.27547088464231E-4]
[null,{"$f":"Names!I127","v":213},{"$f":"Names!F127","v":"Weddin "},{"$f":"INDEX('ABS pop T1'!E$12:E$139,MATCH($C131,'ABS pop T1'!$H$12:$H$139,0))","v":3613},{"$f":"INDEX('ABS pop T1'!F$12:F$139,MATCH($C131,'ABS pop T1'!$H$12:$H$139,0))","v":3596},0,{"$f":"INDEX('Supp val'!D$8:D$135,MATCH($B131,'Supp val'!$B$8:$B$135,0))","v":2835000},{"$f":"INDEX('Supp val'!E$8:E$135,MATCH($B131,'Supp val'!$B$8:$B$135,0))","v":-7000},0,0]
[null,{"$f":"Names!I128","v":215},{"$f":"Names!F128","v":"Wentworth "},{"$f":"INDEX('ABS pop T1'!E$12:E$139,MATCH($C132,'ABS pop T1'!$H$12:$H$139,0))","v":7053},{"$f":"INDEX('ABS pop T1'!F$12:F$139,MATCH($C132,'ABS pop T1'!$H$12:$H$139,0))","v":7090},5.2459946122218604E-3,{"$f":"INDEX('Supp val'!D$8:D$135,MATCH($B132,'Supp val'!$B$8:$B$135,0))","v":5271000},{"$f":"INDEX('Supp val'!E$8:E$135,MATCH($B132,'Supp val'!$B$8:$B$135,0))","v":54000},1.0244735344336939E-2,0]
[null,{"$f":"Names!I129","v":216},{"$f":"Names!F129","v":"Willoughby "},{"$f":"INDEX('ABS pop T1'!E$12:E$139,MATCH($C133,'ABS pop T1'!$H$12:$H$139,0))","v":81109},{"$f":"INDEX('ABS pop T1'!F$12:F$139,MATCH($C133,'ABS pop T1'!$H$12:$H$139,0))","v":81196},1.0726306575101763E-3,{"$f":"INDEX('Supp val'!D$8:D$135,MATCH($B133,'Supp val'!$B$8:$B$135,0))","v":51651000},{"$f":"INDEX('Supp val'!E$8:E$135,MATCH($B133,'Supp val'!$B$8:$B$135,0))","v":28000},5.4209986253896342E-4,5.3053079497121286E-4]
[null,{"$f":"Names!I130","v":218},{"$f":"Names!F130","v":"Wingecarribee "},{"$f":"INDEX('ABS pop T1'!E$12:E$139,MATCH($C134,'ABS pop T1'!$H$12:$H$139,0))","v":51127},{"$f":"INDEX('ABS pop T1'!F$12:F$139,MATCH($C134,'ABS pop T1'!$H$12:$H$139,0))","v":51760},1.2380933753202816E-2,{"$f":"INDEX('Supp val'!D$8:D$135,MATCH($B134,'Supp val'!$B$8:$B$135,0))","v":50857000},{"$f":"INDEX('Supp val'!E$8:E$135,MATCH($B134,'Supp val'!$B$8:$B$135,0))","v":391000},7.6882238433254027E-3,4.6927099098774136E-3]
[null,{"$f":"Names!I131","v":219},{"$f":"Names!F131","v":"Wollondilly "},{"$f":"INDEX('ABS pop T1'!E$12:E$139,MATCH($C135,'ABS pop T1'!$H$12:$H$139,0))","v":53143},{"$f":"INDEX('ABS pop T1'!F$12:F$139,MATCH($C135,'ABS pop T1'!$H$12:$H$139,0))","v":54005},1.6220386504337325E-2,{"$f":"INDEX('Supp val'!D$8:D$135,MATCH($B135,'Supp val'!$B$8:$B$135,0))","v":38393000},{"$f":"INDEX('Supp val'!E$8:E$135,MATCH($B135,'Supp val'!$B$8:$B$135,0))","v":407000},1.0600890787383117E-2,5.6194957169542082E-3]
[null,{"$f":"Names!I132","v":220},{"$f":"Names!F132","v":"Wollongong "},{"$f":"INDEX('ABS pop T1'!E$12:E$139,MATCH($C136,'ABS pop T1'!$H$12:$H$139,0))","v":218076},{"$f":"INDEX('ABS pop T1'!F$12:F$139,MATCH($C136,'ABS pop T1'!$H$12:$H$139,0))","v":219798},7.8963297199141635E-3,{"$f":"INDEX('Supp val'!D$8:D$135,MATCH($B136,'Supp val'!$B$8:$B$135,0))","v":170562000},{"$f":"INDEX('Supp val'!E$8:E$135,MATCH($B136,'Supp val'!$B$8:$B$135,0))","v":827000},4.8486767275243018E-3,3.0476529923898618E-3]
[null,{"$f":"Names!I133","v":221},{"$f":"Names!F133","v":"Woollahra "},{"$f":"INDEX('ABS pop T1'!E$12:E$139,MATCH($C137,'ABS pop T1'!$H$12:$H$139,0))","v":59345},{"$f":"INDEX('ABS pop T1'!F$12:F$139,MATCH($C137,'ABS pop T1'!$H$12:$H$139,0))","v":59431},1.449153256382063E-3,{"$f":"INDEX('Supp val'!D$8:D$135,MATCH($B137,'Supp val'!$B$8:$B$135,0))","v":40337000},{"$f":"INDEX('Supp val'!E$8:E$135,MATCH($B137,'Supp val'!$B$8:$B$135,0))","v":71000},1.7601705630066688E-3,0]
[null,{"$f":"Names!I134","v":2036},{"$f":"Names!F134","v":"Yass Valley"},{"$f":"INDEX('ABS pop T1'!E$12:E$139,MATCH($C138,'ABS pop T1'!$H$12:$H$139,0))","v":17086},{"$f":"INDEX('ABS pop T1'!F$12:F$139,MATCH($C138,'ABS pop T1'!$H$12:$H$139,0))","v":17321},1.3753950602832798E-2,{"$f":"INDEX('Supp val'!D$8:D$135,MATCH($B138,'Supp val'!$B$8:$B$135,0))","v":10933000},{"$f":"INDEX('Supp val'!E$8:E$135,MATCH($B138,'Supp val'!$B$8:$B$135,0))","v":86000},7.8660934784597087E-3,5.8878571243730898E-3]