{"text_format":"1","workbook":"xlsx","n_sheets":9,"sheets":["Examples","QA Scope","QA log","timing","Rate Peg","Names","ABS pop T1","Supp val","Pop calcs"],"not_rendered":{"charts":15,"images":0,"macros":0,"external_links":0,"defined_names":6,"comments":2,"pivot_tables":0},"unopened":[],"bounds":{"document_bytes":16777216,"sheet_cells":100000,"rows_first":2000,"rows_last":500,"rows_between":2000,"halvings":0,"cell_chars":16384,"cell_head_chars":4096},"cells_cut":0,"cells_raw":0,"read":"whole","date_system":"1900"}

{"sheet":"Examples","index":0,"n_rows":42,"n_cols":27,"rows_kept":42,"cut":false,"hidden":true,"merged":[]}
[]
[null,"IPART colour codes for models, spreadsheets and information requests"]
[null,"NB  ALWAYS DESCRIBE THE COLOUR CODE USED IN YOUR MODEL "]
[null,"Note: If you use the formats for the inputs provided in this template, input cells will always be unprotected even when you protect the worksheet"]
[null,null,null,null,null,null,null,"use this column cell to \"paint\" input cells for numbers (NOT for percentages)"]
[null,null,null,null,null,null,null,null,"use this column cell to \"paint\" input cells for percentages (NOT numbers)"]
[null,"Models and spreadsheets"]
[null,null,null,null,null,null,"numbers","%"]
[null,"Inputs",null,null,null,null,4232,0.08]
[null,"Inputs with default values, default values are shown in italics next to or below ",null,null,null,null,34345,0.08]
[null,"Hard-coded values used that should not be changed, eg credit ratings or '1' at the start of an index series."]
[null,"Key outputs"]
[null,"Links from other files (green)"]
[null,"Error check (check =0)"]
[null,"Error warnings, messages and unusual calculation assumptions"]
[null,"Indicate change in formula across row with a double red line"]
[null,"Note:  You can combine options for inputs, eg:",null,null,"Inputs can be links to other files "]
[null,null,null,null,"You can drawn attention to unusual inputs "]
[]
[null,null,null,null,null,null,null,"use this column cell to \"paint\" input cells for numbers (NOT for percentages)"]
[null,"Information Requests",null,null,null,null,null,null,"use this column cell to \"paint\" input cells for percentages (NOT numbers)"]
[null,null,null,null,null,null,"numbers","%"]
[null,"Inputs for historical years (actual values)",null,null,null,null,234,0.24]
[null,"Forecast inputs",null,null,null,null,6667,0.05]
[null,"Error warnings and messages"]
[null,"Error check (check =0)"]
[]
[null,"QA notes - annotation or documenation by QA staff"]
[]
[]
["User Instructions - IPART CHARTS"]
[]
[null,"Blue","Mid Grey","Pale Blue","Green","Charcoal","Orange","Purple","Pink",null,null,"Blue","Mid Grey","Pale Blue","Green","Charcoal","Orange",null,"X value","1st Y value","2nd Y value",null,null,"Black","Red 100%","Red 70%","Grey 40%"]
["1975-76",36.19,36.880000000000003,21.56,5.36,3.01,10,3.01,10,null,"1975-76",33.19,36.880000000000003,21.56,5.36,3.01,10,null,1.8,10,17,null,"1975-76",33.19,36.880000000000003,21.56,5.36]
["1983-84",39.39,32.020000000000003,21.6,7.01,3.36,12,3.36,12,null,"1983-84",39.39,32.020000000000003,21.6,7.01,3.36,12,null,2.2999999999999998,12,9,null,"1983-84",39.39,32.020000000000003,21.6,7.01]
["1988-89",42.78,29.91,18.350000000000001,6.33,2.63,14,2.63,14,null,"1988-89",42.78,29.91,18.350000000000001,6.33,2.63,14,null,3.7,16,14,null,"1988-89",42.78,29.91,18.350000000000001,6.33]
["1993-94",42.13,26.53,21.6,7.01,2.72,16,2.72,16,null,"1993-94",42.13,26.53,21.6,7.01,2.72,16,null,4.0999999999999996,8,23,null,"1993-94",42.13,26.53,21.6,7.01]
["1996-97",41.69,24.76,23.98,7,2.57,18,2.57,18,null,"1996-97",41.69,24.76,23.98,7,2.57,18,null,5.5,14,27,null,"1996-97",41.69,24.76,23.98,7]
["1997-98",39.39,32.020000000000003,21.6,7.01,3.36,12,3.36,12,null,"1997-98",39.39,32.020000000000003,21.6,7.01,3.36,12,null,null,null,null,null,"1997-98",39.39,32.020000000000003,21.6,7.01]
["1998-99",42.13,26.53,21.6,7.01,2.72,16,2.72,16,null,"1998-99",42.13,26.53,21.6,7.01,2.72,16,null,null,null,null,null,"1998-99",42.13,26.53,21.6,7.01]
["1999-00",45,22,26,8,2,20,2,20,null,"1999-00",45,22,26,8,2,20,null,null,null,null,null,"1999-00",45,22,26,8]
["–  en rule for when needed"]

{"sheet":"QA Scope","index":1,"n_rows":106,"n_cols":9,"rows_kept":106,"cut":false,"hidden":true,"merged":[]}
[]
[null,"Review that the QA is for",null,null,"2023-24 Rate peg"]
[null,"Name of model",null,null,"Table of rate pegs"]
[null,"File name(s):  "]
[]
[]
[]
[null,"Name of modeller"]
[null,"Planned date of QA:",null,null,"2022-09-27"]
[null,"Risk rating for the review:",null,null,"Medium"]
[null,"Note: low risk models do not require independent QA, however the modeller should indicate in section 2.3 what steps have been taken to ensure accuracy of results."]
[]
[null,"1. PURPOSE OF MODEL"]
[null,"The modeller provides a concise summary of the model's purpose(s)"]
[null,"Calculates the rate peg and population factors. For more information see 'Overview & instructions' worksheet"]
[]
[]
[]
[]
[]
[null,"2. CONTEXT AND SCOPE OF QA"]
[null,"The modeller provides information about the context of the QA and the scope of work.",null,null,null,null,null,null,"DO NOT DELETE"]
[null,null,null,null,null,null,null,null,"Yes"]
[null,"2.1 The model/spreadsheet is for (context)",null,null,null,null,null,null,"No "]
[null,null,null,null,null,null,null,null,"NA"]
[]
[null,null,null,null,null,null,null,null,"High"]
[null,null,null,null,null,null,null,null,"Medium"]
[null,null,null,null,null,null,null,null,"Low"]
[null,null,null,null,null,null,null,null,"select"]
[]
[]
[]
[]
[]
[null,"2.2 The scope of the QA is to check"]
[]
[null,null,"Logic checks",null,null,"Input checks"]
[]
[]
[]
[]
[]
[]
[]
[]
[]
[]
[]
[]
[]
[null,"* provide details of requirements for \"simplified duplication of analysis\" and/or \"sampling of inputs\" in section 2.3 below."]
[]
[]
[null,"2.3 Detailed scope of QA"]
[null,"Specify clearly how to identify what needs to be checked (e.g. \"check all calculations and inputs highlighted in green on the following worksheets: …\")"]
[null,"For \"simplified duplications of analysis\" (if applicable), specify how you and the QAer have agreed the analysis will be duplicated"]
[null,"For \"sampling of inputs\" (if applicable), specify how you and the QAer have agreed the inputs will be sampled"]
[]
[null,"Rate Peg worksheet"]
[null,null,"We need for you to check that the calcualtions on this worksheet match the logic of those in the matching table in the 'pop factors' worksheet of model D22/19313.",null,null,null,null,"a"]
[null,null,"we need for you to check that the final outputs (ie the rate peg column) matches the rate peg column in the 'pop factors' worksheet of model D22/19313",null,null,null,null,"a"]
[null,"Names worksheet"]
[null,null,"We need for you to check that the inputs on this sheet match those on the 'Names' sheet of D22/19313",null,null,null,null,"a"]
[null,"ABS pop T1 worksheet"]
[null,null,"We need for you to check that the inputs on this sheet match those on the 'ABS pop T1' sheet of D22/19313",null,null,null,null,"a"]
[null,"Supp val worksheet"]
[null,null,"We need for you to check that the inputs on this sheet match those on the 'Supp Val' sheet of D22/19313",null,null,null,null,"a"]
[null,"Pop calcs worksheet"]
[null,null,"We need for you to check that the calcualtions on this worksheet match the logic of those in the matching table in the 'pop calcs' worksheet of model D22/19313.",null,null,null,null,"a"]
[]
[]
[]
[]
[]
[null,"3. QA CHECK LIST"]
[]
[null,"3.1 Pre-QA check list (for both medium and high risk QAs)"]
[]
[null,null,"Select an option"]
[]
[null,null,"Yes","Is the model consistent with good modelling practice?"]
[null,null,"Yes","Tables, inputs and outputs are clearly labelled, e.g.:"]
[null,null,null,"–     Units e.g. $m, $’000, $ or cents, kL, MWh, GJ, etc"]
[null,null,null,"–     Nominal or real"]
[null,null,null,"–     Including or excluding GST"]
[null,null,"Yes","The QAer can easily identify the parts of the model that need to be checked"]
[null,null,"Yes","The model inputs reflect Tribunal decisions or information from the source documents or related models"]
[null,null,"Yes","The source documents (or references) have all been located and provided to the QAer/s"]
[]
[null,null,"No ","Has the QA scope been reviewed by the Chief Modeller? (Only applicable for external models and high risk price determinations)"]
[]
[]
[null,"3.2 QA check list (for RStudio scripts only)"]
[]
[null,null,"NA","Code was rerun successfully; or an alternative calculation successfully replicated results"]
[null,null,"NA","Code is easy to follow, with comments highlighting different sections in code"]
[null,null,"NA","Variable names are easy to understand"]
[null,null,"NA","Test variables are used to check that data is not duplicated or excluded in error when joining data sources"]
[null,null,"NA","If this QA is an update to an existing RStudio script, changes are highlighted and easy to find (e.g. a text comparison tool is used to compare scripts before and after change)"]
[]
[]
[null,"4  INDUSTRY TEAM REMINDER – POST QA SIGN OFF IN CM9"]
[]
[null,"Has the post-QA deliverable been CM9ed?"]
[null,"Has the QA been signed off via action tracking in CM9 by the QA analyst and Director?"]

{"sheet":"QA log","index":2,"n_rows":36,"n_cols":14,"rows_kept":36,"cut":false,"hidden":true,"merged":[]}
[]
[null,"DETAILS OF ISSUES FOUND IN THE QA "]
[null,"Item no.","Date checked (Month and Year)","QAed by","What is the issue?","Category","Where in model? ","Where … continued (optional)","Responses by industry team /model developer (industry team should prioritise red cells, i.e. calculation or data errors)","QA signoff"]
[null,null,"Required only if QA is staggered over along period","required only if there is more than one QAer",null,"Select the type of issue from the drop-down box (see notes in column N)","e.g. worksheet(s),  and rows/columns, or table numbers. May refer to highlighted areas in worksheet(s)","Optional 2nd column, e.g. with cell reference area in (or link to) relevant worksheet","Changed / not changed & reason",null,null,null,"Categories for drop-down box.  DO NOT DELETE","Notes on when to use the categories"]
[null,1,null,null,"Potentially inconsistent formula: Yass Valley\nMissing ROUND function. This may be a carry over issue from D22/19313 > Pop factors > G141.\nHowever, when round function utilised, no changes to rate peg (incl pop factors).","Calculation or data error","Rate Peg > G141",null,"I've fixed the formula - Ed.","JM",null,null,"Calculation or data error","The formula logical is flawed, contains a cell reference error or contains another error (e.g. bracket is in the wrong place), or there is a data input problem"]
[null,{"$f":"B5+1","v":2},null,null,"Names\nD22/19313 > Names > F97 = \"Parramatta\"\n\nNames > F197 = \"Parramatta (new)\"","Documentation, formatting or structure","Names > F97",null,"That is okay, the \"(new)\" identifier is for internal reference only we can remove it from the names list here - Ed.","JM",null,null,"Documentation, formatting or structure","Model is not structured efficiently, not consistent with IPART colour coding and formatting, or there is a labelling issue"]
[null,{"$f":"B6+1","v":3},null,null,"ABS pop T1\nD22/19313 > ABS pop T1 > O102 = \"Parramatta (new)\"\n \nABS pop T1 > H102 = \"Parramatta\"","Documentation, formatting or structure","ABS pop T1 > H102",null,"That is okay, the \"(new)\" identifier is for internal reference only we can remove it from the names list here - Ed.","JM"]
[null,4,null,null,"I changed the name for Murrumbidgee council in column F of the names sheet from \"Murrumbidgee (new)\" to just \"Murrumbidgee\"","Documentation, formatting or structure","Names F85",null,"Kisoo, can you please check if this is okay (ie. have I added in a Typo or added in a reference error) - Ed.","JM"]
[null,5]
[null,6]
[null,7]
[null,8]
[null,9]
[null,10]
[null,11]
[null,12]
[null,13]
[null,14]
[null,15]
[null,16]
[null,17]
[null,18]
[null,19]
[null,20]
[null,21]
[null,22]
[null,23]
[null,24]
[null,25]
[null,26]
[null,27]
[null,28]
[null,29]
[null,30]
[null,"END OF LOG"]
[null,"IF A LONGER LOG IS REQUIRED, INSERT NEW ROWS ABOVE ITEM 29 AND REDO THE NUMBERING"]

{"sheet":"timing","index":3,"n_rows":19,"n_cols":13,"rows_kept":19,"cut":false,"hidden":true,"merged":[]}
[]
[]
[null,"Timing for population factor"]
[]
[null,"Rate peg on 1 July ",null,null,2022,{"$f":"E5+1","v":2023},2024,2025,2026,2027,2028,2029]
[null,"FY",null,null,{"$f":"E5&\"-\"&RIGHT(F5,2)","v":"2022-23"},"2023-24","2024-25","2025-26","2026-27","2027-28","2028-29"]
[]
[null,"ABS release dates"]
[null,"Regional population, 2019-20","March 2021",null,"to 30 June 2020"]
[null,"Regional population, 2020-21","March 2022",null,null,"to June 2021","Initial census release date Oct 2022 - updated 2020-21 ERP?"]
[null,"Census - 2021-22","early to mid 2023",null,null,null,"as at Aug 2021",null,null,null,null,null,"https://www.abs.gov.au/census/2021-data-releases"]
[null,"Regional population, 2022-23","March 2024",null,null,null,null,"to June 2023"]
[null,"Regional population, 2023-24","March 2025",null,null,null,null,null,"to June 2024"]
[null,"Regional population, 2024-25","March 2026",null,null,null,null,null,null,"to June 2025"]
[null,"Regional population, 2025-26","March 2027",null,null,null,null,null,null,null,"to June 2026"]
[]
[]
[]
[null,"Supp val for year",null,null,"2019-20","2020-21","2021-22","2022-23","2023-24","2024-25","2025-26"]

{"sheet":"Rate Peg","index":4,"n_rows":141,"n_cols":8,"rows_kept":141,"cut":false,"hidden":false,"merged":[]}
[]
[null,"Population factors and final Rate Peg for 2023-24"]
[]
[null,"Rate peg before population factor ",null,3.6999999999999998E-2]
[null,"Rate peg from 1 July",null,2023]
[]
[]
[]
[]
[]
[]
[]
[null,{"$f":"'Supp val'!B6","v":"Org. Id"},"Council","Change in population ","Supplementary valuations percentage",null,"Population factor","Rate Peg (including population factor)"]
[null,{"$f":"Names!I7","v":2047},{"$f":"Names!F7","v":"Albury "},{"$f":"'Pop calcs'!F11","v":1.2678000581226367E-2},{"$f":"'Pop calcs'!I11","v":1.6488413547237075E-2},null,{"$f":"IFERROR(MAX(0,ROUND(D14-E14,3)),0)","v":0},{"$f":"ROUND($D$4+G14,3)","v":3.6999999999999998E-2}]
[null,{"$f":"Names!I8","v":2079},{"$f":"Names!F8","v":"Armidale Regional"},{"$f":"'Pop calcs'!F12","v":0},{"$f":"'Pop calcs'!I12","v":1.5570664867389837E-3},null,{"$f":"IFERROR(MAX(0,ROUND(D15-E15,3)),0)","v":0},{"$f":"ROUND($D$4+G15,3)","v":3.6999999999999998E-2}]
[null,{"$f":"Names!I9","v":54},{"$f":"Names!F9","v":"Ballina "},{"$f":"'Pop calcs'!F13","v":1.2206718117688586E-2},{"$f":"'Pop calcs'!I13","v":1.0294002963425095E-2},null,2E-3,3.9E-2]
[null,{"$f":"Names!I10","v":55},{"$f":"Names!F10","v":"Balranald "},{"$f":"'Pop calcs'!F14","v":0},{"$f":"'Pop calcs'!I14","v":0},null,0,3.6999999999999998E-2]
[null,{"$f":"Names!I11","v":2043},{"$f":"Names!F11","v":"Bathurst Regional"},{"$f":"'Pop calcs'!F15","v":1.2387771337651898E-2},{"$f":"'Pop calcs'!I15","v":1.1176718684099536E-2},null,1E-3,3.7999999999999999E-2]
[null,{"$f":"Names!I12","v":2099},{"$f":"Names!F12","v":"Bayside"},{"$f":"'Pop calcs'!F16","v":5.0924522582600495E-3},{"$f":"'Pop calcs'!I16","v":7.3827000499261733E-3},null,0,3.6999999999999998E-2]
[null,{"$f":"Names!I13","v":60},{"$f":"Names!F13","v":"Bega Valley "},{"$f":"'Pop calcs'!F17","v":9.0987618773394896E-3},{"$f":"'Pop calcs'!I17","v":4.7645517350909236E-3},null,4.0000000000000001E-3,4.1000000000000002E-2]
[null,{"$f":"Names!I14","v":61},{"$f":"Names!F14","v":"Bellingen "},{"$f":"'Pop calcs'!F18","v":8.0657434180491094E-3},{"$f":"'Pop calcs'!I18","v":4.6882325363338024E-4},null,8.0000000000000002E-3,4.4999999999999998E-2]
[null,{"$f":"Names!I15","v":62},{"$f":"Names!F15","v":"Berrigan "},{"$f":"'Pop calcs'!F19","v":2.845759817871274E-3},{"$f":"'Pop calcs'!I19","v":2.9352412401394239E-3},null,0,3.6999999999999998E-2]
[null,{"$f":"Names!I16","v":64},{"$f":"Names!F16","v":"Blacktown "},{"$f":"'Pop calcs'!F20","v":1.1296305972098963E-2},{"$f":"'Pop calcs'!I20","v":2.3725868201688885E-2},null,0,3.6999999999999998E-2]
[null,{"$f":"Names!I17","v":65},{"$f":"Names!F17","v":"Bland "},{"$f":"'Pop calcs'!F21","v":0},{"$f":"'Pop calcs'!I21","v":0},null,0,3.6999999999999998E-2]
[null,{"$f":"Names!I18","v":66},{"$f":"Names!F18","v":"Blayney "},{"$f":"'Pop calcs'!F22","v":3.522080736927613E-3},{"$f":"'Pop calcs'!I22","v":3.4144729595770459E-3},null,0,3.6999999999999998E-2]
[null,{"$f":"Names!I19","v":67},{"$f":"Names!F19","v":"Blue Mountains "},{"$f":"'Pop calcs'!F23","v":0},{"$f":"'Pop calcs'!I23","v":2.2391715065425791E-4},null,0,3.6999999999999998E-2]
[null,{"$f":"Names!I20","v":68},{"$f":"Names!F20","v":"Bogan "},{"$f":"'Pop calcs'!F24","v":0},{"$f":"'Pop calcs'!I24","v":0},null,0,3.6999999999999998E-2]
[null,{"$f":"Names!I21","v":72},{"$f":"Names!F21","v":"Bourke "},{"$f":"'Pop calcs'!F25","v":0},{"$f":"'Pop calcs'!I25","v":0},null,0,3.6999999999999998E-2]
[null,{"$f":"Names!I22","v":73},{"$f":"Names!F22","v":"Brewarrina "},{"$f":"'Pop calcs'!F26","v":0},{"$f":"'Pop calcs'!I26","v":0},null,0,3.6999999999999998E-2]
[null,{"$f":"Names!I23","v":74},{"$f":"Names!F23","v":"Broken Hill "},{"$f":"'Pop calcs'!F27","v":0},{"$f":"'Pop calcs'!I27","v":0},null,0,3.6999999999999998E-2]
[null,{"$f":"Names!I24","v":75},{"$f":"Names!F24","v":"Burwood"},{"$f":"'Pop calcs'!F28","v":0},{"$f":"'Pop calcs'!I28","v":3.6874855957593914E-3},null,0,3.6999999999999998E-2]
[null,{"$f":"Names!I25","v":76},{"$f":"Names!F25","v":"Byron "},{"$f":"'Pop calcs'!F29","v":1.2439897126244048E-2},{"$f":"'Pop calcs'!I29","v":3.1736549303662772E-3},null,8.9999999999999993E-3,4.5999999999999999E-2]
[null,{"$f":"Names!I26","v":77},{"$f":"Names!F26","v":"Cabonne"},{"$f":"'Pop calcs'!F30","v":5.9219184091241495E-3},{"$f":"'Pop calcs'!I30","v":2.3349210796675072E-3},null,4.0000000000000001E-3,4.1000000000000002E-2]
[null,{"$f":"Names!I27","v":78},{"$f":"Names!F27","v":"Camden"},{"$f":"'Pop calcs'!F31","v":6.2330120504281217E-2},{"$f":"'Pop calcs'!I31","v":3.1256658635328054E-2},null,3.1E-2,6.8000000000000005E-2]
[null,{"$f":"Names!I28","v":79},{"$f":"Names!F28","v":"Campbelltown "},{"$f":"'Pop calcs'!F32","v":9.3763465571228277E-3},{"$f":"'Pop calcs'!I32","v":5.4244867959295645E-3},null,4.0000000000000001E-3,4.1000000000000002E-2]
[null,{"$f":"Names!I29","v":1989},{"$f":"Names!F29","v":"Canada Bay "},{"$f":"'Pop calcs'!F33","v":0},{"$f":"'Pop calcs'!I33","v":9.0326055027905618E-3},null,0,3.6999999999999998E-2]
[null,{"$f":"Names!I30","v":2080},{"$f":"Names!F30","v":"Canterbury-Bankstown"},{"$f":"'Pop calcs'!F34","v":0},{"$f":"'Pop calcs'!I34","v":3.5568610127874892E-4},null,0,3.6999999999999998E-2]
[null,{"$f":"Names!I31","v":81},{"$f":"Names!F31","v":"Carrathool "},{"$f":"'Pop calcs'!F35","v":0},{"$f":"'Pop calcs'!I35","v":0},null,0,3.6999999999999998E-2]
[null,{"$f":"Names!I32","v":2088},{"$f":"Names!F32","v":"Central Coast"},{"$f":"'Pop calcs'!F36","v":3.8748705966722419E-3},{"$f":"'Pop calcs'!I36","v":2.7014858171994596E-3},null,1E-3,3.7999999999999999E-2]
[null,{"$f":"Names!I33","v":83},{"$f":"Names!F33","v":"Central Darling "},{"$f":"'Pop calcs'!F37","v":2.7337342810278553E-3},{"$f":"'Pop calcs'!I37","v":5.8343057176196032E-3},null,0,3.6999999999999998E-2]
[null,{"$f":"Names!I34","v":84},{"$f":"Names!F34","v":"Cessnock "},{"$f":"'Pop calcs'!F38","v":2.8797179051847976E-2},{"$f":"'Pop calcs'!I38","v":2.7720465082408913E-2},null,1E-3,3.7999999999999999E-2]
[null,{"$f":"Names!I35","v":2037},{"$f":"Names!F35","v":"Clarence Valley"},{"$f":"'Pop calcs'!F39","v":2.4316226925678919E-2},{"$f":"'Pop calcs'!I39","v":7.0830826450801292E-3},null,1.7000000000000001E-2,5.3999999999999999E-2]
[null,{"$f":"Names!I36","v":85},{"$f":"Names!F36","v":"Cobar "},{"$f":"'Pop calcs'!F40","v":0},{"$f":"'Pop calcs'!I40","v":0},null,0,3.6999999999999998E-2]
[null,{"$f":"Names!I37","v":86},{"$f":"Names!F37","v":"Coffs Harbour "},{"$f":"'Pop calcs'!F41","v":5.6921353234342664E-3},{"$f":"'Pop calcs'!I41","v":4.6124515692585232E-3},null,1E-3,3.7999999999999999E-2]
[null,{"$f":"Names!I38","v":90},{"$f":"Names!F38","v":"Coolamon "},{"$f":"'Pop calcs'!F42","v":3.029596830575576E-3},{"$f":"'Pop calcs'!I42","v":4.3754972155926808E-3},null,0,3.6999999999999998E-2]
[null,{"$f":"Names!I39","v":93},{"$f":"Names!F39","v":"Coonamble "},{"$f":"'Pop calcs'!F43","v":0},{"$f":"'Pop calcs'!I43","v":0},null,0,{"$f":"ROUND($D$4+G46,3)","v":3.6999999999999998E-2}]
[null,{"$f":"Names!I40","v":2094},{"$f":"Names!F40","v":"Cootamundra-Gundagai Regional"},{"$f":"'Pop calcs'!F44","v":0},{"$f":"'Pop calcs'!I44","v":3.3969166448915601E-3},null,0,3.6999999999999998E-2]
[null,{"$f":"Names!I41","v":97},{"$f":"Names!F41","v":"Cowra "},{"$f":"'Pop calcs'!F45","v":4.1627395538799128E-3},{"$f":"'Pop calcs'!I45","v":2.6532607177768468E-3},null,2E-3,3.9E-2]
[null,{"$f":"Names!I42","v":2090},{"$f":"Names!F42","v":"Cumberland"},{"$f":"'Pop calcs'!F46","v":0},{"$f":"'Pop calcs'!I46","v":0},null,0,3.6999999999999998E-2]
[null,{"$f":"Names!I43","v":2098},{"$f":"Names!F43","v":"Dubbo Regional"},{"$f":"'Pop calcs'!F47","v":2.8125751716225889E-3},{"$f":"'Pop calcs'!I47","v":1.1337927447666103E-2},null,0,3.6999999999999998E-2]
[null,{"$f":"Names!I44","v":104},{"$f":"Names!F44","v":"Dungog "},{"$f":"'Pop calcs'!F48","v":1.2417218543046449E-2},{"$f":"'Pop calcs'!I48","v":5.2645433008686494E-3},null,7.0000000000000001E-3,4.3999999999999997E-2]
[null,{"$f":"Names!I45","v":2091},{"$f":"Names!F45","v":"Edward River"},{"$f":"'Pop calcs'!F49","v":8.1461911052400637E-3},{"$f":"'Pop calcs'!I49","v":8.0851637245654229E-4},null,7.0000000000000001E-3,4.3999999999999997E-2]
[null,{"$f":"Names!I46","v":105},{"$f":"Names!F46","v":"Eurobodalla "},{"$f":"'Pop calcs'!F50","v":1.039607772672424E-2},{"$f":"'Pop calcs'!I50","v":4.2555874286795067E-3},null,6.0000000000000001E-3,4.2999999999999997E-2]
[null,{"$f":"Names!I47","v":107},{"$f":"Names!F47","v":"Fairfield "},{"$f":"'Pop calcs'!F51","v":0},{"$f":"'Pop calcs'!I51","v":4.7191370720782487E-3},null,0,3.6999999999999998E-2]
[null,{"$f":"Names!I48","v":2092},{"$f":"Names!F48","v":"Federation"},{"$f":"'Pop calcs'!F52","v":1.0714285714285676E-2},{"$f":"'Pop calcs'!I52","v":4.3615216864550518E-3},null,6.0000000000000001E-3,4.2999999999999997E-2]
[null,{"$f":"Names!I49","v":108},{"$f":"Names!F49","v":"Forbes "},{"$f":"'Pop calcs'!F53","v":1.310351779054475E-3},{"$f":"'Pop calcs'!I53","v":5.1209832287799257E-4},null,1E-3,3.7999999999999999E-2]
[null,{"$f":"Names!I50","v":2093},{"$f":"Names!F50","v":"Georges River"},{"$f":"'Pop calcs'!F54","v":0},{"$f":"'Pop calcs'!I54","v":3.6975945017182132E-3},null,0,3.6999999999999998E-2]
[null,{"$f":"Names!I51","v":109},{"$f":"Names!F51","v":"Gilgandra "},{"$f":"'Pop calcs'!F55","v":0},{"$f":"'Pop calcs'!I55","v":3.0716068343252063E-3},null,0,3.6999999999999998E-2]
[null,{"$f":"Names!I52","v":2053},{"$f":"Names!F52","v":"Glen Innes Severn"},{"$f":"'Pop calcs'!F56","v":0},{"$f":"'Pop calcs'!I56","v":0},null,0,3.6999999999999998E-2]
[null,{"$f":"Names!I53","v":2032},{"$f":"Names!F53","v":"Goulburn Mulwaree"},{"$f":"'Pop calcs'!F57","v":7.6693921531343356E-3},{"$f":"'Pop calcs'!I57","v":1.4545624619989711E-2},null,0,3.6999999999999998E-2]
[null,{"$f":"Names!I54","v":2049},{"$f":"Names!F54","v":"Greater Hume "},{"$f":"'Pop calcs'!F58","v":1.6417635122671026E-2},{"$f":"'Pop calcs'!I58","v":5.9760956175298804E-3},null,0.01,4.7E-2]
[null,{"$f":"Names!I55","v":118},{"$f":"Names!F55","v":"Griffith "},{"$f":"'Pop calcs'!F59","v":6.9971274950275664E-4},{"$f":"'Pop calcs'!I59","v":3.6779047088325439E-3},null,0,3.6999999999999998E-2]
[null,{"$f":"Names!I56","v":120},{"$f":"Names!F56","v":"Gunnedah "},{"$f":"'Pop calcs'!F60","v":1.8914020017337663E-3},{"$f":"'Pop calcs'!I60","v":1.3217799970627112E-3},null,1E-3,3.7999999999999999E-2]
[null,{"$f":"Names!I57","v":2039},{"$f":"Names!F57","v":"Gwydir "},{"$f":"'Pop calcs'!F61","v":4.529156444612159E-3},{"$f":"'Pop calcs'!I61","v":9.7122738861235884E-4},null,4.0000000000000001E-3,4.1000000000000002E-2]
[null,{"$f":"Names!I58","v":125},{"$f":"Names!F58","v":"Hawkesbury "},{"$f":"'Pop calcs'!F62","v":3.8969665657981878E-3},{"$f":"'Pop calcs'!I62","v":3.6660359508041626E-3},null,0,3.6999999999999998E-2]
[null,{"$f":"Names!I59","v":126},{"$f":"Names!F59","v":"Hay "},{"$f":"'Pop calcs'!F63","v":3.3967391304345895E-4},{"$f":"'Pop calcs'!I63","v":4.8328634716069269E-3},null,0,3.6999999999999998E-2]
[null,{"$f":"Names!I60","v":2081},{"$f":"Names!F60","v":"Hilltops"},{"$f":"'Pop calcs'!F64","v":0},{"$f":"'Pop calcs'!I64","v":0},null,0,3.6999999999999998E-2]
[null,{"$f":"Names!I61","v":129},{"$f":"Names!F61","v":"Hornsby "},{"$f":"'Pop calcs'!F65","v":0},{"$f":"'Pop calcs'!I65","v":2.2645990693050165E-3},null,0,3.6999999999999998E-2]
[null,{"$f":"Names!I62","v":131},{"$f":"Names!F62","v":"Hunters Hill "},{"$f":"'Pop calcs'!F66","v":0},{"$f":"'Pop calcs'!I66","v":0},null,0,3.6999999999999998E-2]
[null,{"$f":"Names!I63","v":2083},{"$f":"Names!F63","v":"Inner West"},{"$f":"'Pop calcs'!F67","v":0},{"$f":"'Pop calcs'!I67","v":0},null,0,3.6999999999999998E-2]
[null,{"$f":"Names!I64","v":133},{"$f":"Names!F64","v":"Inverell "},{"$f":"'Pop calcs'!F68","v":0},{"$f":"'Pop calcs'!I68","v":2.3678529145483669E-3},null,0,3.6999999999999998E-2]
[null,{"$f":"Names!I65","v":135},{"$f":"Names!F65","v":"Junee "},{"$f":"'Pop calcs'!F69","v":9.2869982025165498E-3},{"$f":"'Pop calcs'!I69","v":8.1242532855436075E-3},null,1E-3,3.7999999999999999E-2]
[null,{"$f":"Names!I66","v":136},{"$f":"Names!F66","v":"Kempsey "},{"$f":"'Pop calcs'!F70","v":5.6814384065235757E-3},{"$f":"'Pop calcs'!I70","v":1.0363423212192262E-2},null,0,3.6999999999999998E-2]
[null,{"$f":"Names!I67","v":137},{"$f":"Names!F67","v":"Kiama "},{"$f":"'Pop calcs'!F71","v":1.3552881570614295E-2},{"$f":"'Pop calcs'!I71","v":0},null,1.4E-2,5.0999999999999997E-2]
[null,{"$f":"Names!I68","v":139},{"$f":"Names!F68","v":"Ku-ring-gai"},{"$f":"'Pop calcs'!F72","v":0},{"$f":"'Pop calcs'!I72","v":4.4274122138512678E-3},null,0,3.6999999999999998E-2]
[null,{"$f":"Names!I69","v":140},{"$f":"Names!F69","v":"Kyogle"},{"$f":"'Pop calcs'!F73","v":5.9164865172374181E-3},{"$f":"'Pop calcs'!I73","v":1.855041738439115E-3},null,4.0000000000000001E-3,4.1000000000000002E-2]
[null,{"$f":"Names!I70","v":141},{"$f":"Names!F70","v":"Lachlan "},{"$f":"'Pop calcs'!F74","v":0},{"$f":"'Pop calcs'!I74","v":0},null,0,3.6999999999999998E-2]
[null,{"$f":"Names!I71","v":142},{"$f":"Names!F71","v":"Lake Macquarie "},{"$f":"'Pop calcs'!F75","v":1.0818979416025387E-2},{"$f":"'Pop calcs'!I75","v":1.2536498003498233E-2},null,0,{"$f":"ROUND($D$4+G78,3)","v":3.6999999999999998E-2}]
[null,{"$f":"Names!I72","v":143},{"$f":"Names!F72","v":"Lane Cove "},{"$f":"'Pop calcs'!F76","v":0},{"$f":"'Pop calcs'!I76","v":1.1782592170277461E-3},null,{"$f":"IFERROR(MAX(0,ROUND(D79-E79,3)),0)","v":0},3.6999999999999998E-2]
[null,{"$f":"Names!I73","v":144},{"$f":"Names!F73","v":"Leeton "},{"$f":"'Pop calcs'!F77","v":0},{"$f":"'Pop calcs'!I77","v":0},null,0,3.6999999999999998E-2]
[null,{"$f":"Names!I74","v":146},{"$f":"Names!F74","v":"Lismore "},{"$f":"'Pop calcs'!F78","v":2.7938078226619201E-3},{"$f":"'Pop calcs'!I78","v":4.916082164328657E-3},null,0,3.6999999999999998E-2]
[null,{"$f":"Names!I75","v":2044},{"$f":"Names!F75","v":"Lithgow "},{"$f":"'Pop calcs'!F79","v":1.7659633794961938E-3},{"$f":"'Pop calcs'!I79","v":1.7525411847178409E-3},null,0,3.6999999999999998E-2]
[null,{"$f":"Names!I76","v":147},{"$f":"Names!F76","v":"Liverpool "},{"$f":"'Pop calcs'!F80","v":1.577823131604883E-2},{"$f":"'Pop calcs'!I80","v":1.1684716984637106E-2},null,4.0000000000000001E-3,4.1000000000000002E-2]
[null,{"$f":"Names!I77","v":2040},{"$f":"Names!F77","v":"Liverpool Plains "},{"$f":"'Pop calcs'!F81","v":0},{"$f":"'Pop calcs'!I81","v":1.2971851083149564E-4},null,0,3.6999999999999998E-2]
[null,{"$f":"Names!I78","v":148},{"$f":"Names!F78","v":"Lockhart "},{"$f":"'Pop calcs'!F82","v":0},{"$f":"'Pop calcs'!I82","v":4.3273013375295048E-3},null,0,3.6999999999999998E-2]
[null,{"$f":"Names!I79","v":150},{"$f":"Names!F79","v":"Maitland "},{"$f":"'Pop calcs'!F83","v":3.4968475736042892E-2},{"$f":"'Pop calcs'!I83","v":1.2980549352990233E-2},null,2.1999999999999999E-2,5.8999999999999997E-2]
[null,{"$f":"Names!I80","v":2084},{"$f":"Names!F80","v":"Mid-Coast"},{"$f":"'Pop calcs'!F84","v":8.4951327761713102E-3},{"$f":"'Pop calcs'!I84","v":6.2318978206163051E-3},null,2E-3,3.9E-2]
[null,{"$f":"Names!I81","v":2042},{"$f":"Names!F81","v":"Mid-Western Regional"},{"$f":"'Pop calcs'!F85","v":7.7265738952181362E-3},{"$f":"'Pop calcs'!I85","v":4.4938583935288439E-3},null,3.0000000000000001E-3,0.04]
[null,{"$f":"Names!I82","v":155},{"$f":"Names!F82","v":"Moree Plains "},{"$f":"'Pop calcs'!F86","v":0},{"$f":"'Pop calcs'!I86","v":8.2915302018987604E-4},null,0,3.6999999999999998E-2]
[null,{"$f":"Names!I83","v":156},{"$f":"Names!F83","v":"Mosman "},{"$f":"'Pop calcs'!F87","v":0},{"$f":"'Pop calcs'!I87","v":7.5843761850587785E-4},null,0,3.6999999999999998E-2]
[null,{"$f":"Names!I84","v":2085},{"$f":"Names!F84","v":"Murray River"},{"$f":"'Pop calcs'!F88","v":1.9545823195458167E-2},{"$f":"'Pop calcs'!I88","v":1.5571247510411008E-2},null,4.0000000000000001E-3,4.1000000000000002E-2]
[null,{"$f":"Names!I85","v":2086},{"$f":"Names!F85","v":"Murrumbidgee"},{"$f":"'Pop calcs'!F89","v":0},{"$f":"'Pop calcs'!I89","v":6.7598017124831005E-3},null,0,3.6999999999999998E-2]
[null,{"$f":"Names!I86","v":162},{"$f":"Names!F86","v":"Muswellbrook "},{"$f":"'Pop calcs'!F90","v":0},{"$f":"'Pop calcs'!I90","v":1.9469207910646582E-3},null,0,3.6999999999999998E-2]
[null,{"$f":"Names!I87","v":163},{"$f":"Names!F87","v":"Nambucca "},{"$f":"'Pop calcs'!F91","v":2.4670224549390163E-3},{"$f":"'Pop calcs'!I91","v":8.8340767952418443E-3},null,0,3.6999999999999998E-2]
[null,{"$f":"Names!I88","v":164},{"$f":"Names!F88","v":"Narrabri "},{"$f":"'Pop calcs'!F92","v":0},{"$f":"'Pop calcs'!I92","v":1.1812476928755998E-3},null,0,3.6999999999999998E-2]
[null,{"$f":"Names!I89","v":165},{"$f":"Names!F89","v":"Narrandera "},{"$f":"'Pop calcs'!F93","v":0},{"$f":"'Pop calcs'!I93","v":0},null,0,3.6999999999999998E-2]
[null,{"$f":"Names!I90","v":166},{"$f":"Names!F90","v":"Narromine "},{"$f":"'Pop calcs'!F94","v":0},{"$f":"'Pop calcs'!I94","v":1.3295662290177829E-3},null,0,3.6999999999999998E-2]
[null,{"$f":"Names!I91","v":167},{"$f":"Names!F91","v":"Newcastle "},{"$f":"'Pop calcs'!F95","v":9.0701592954194332E-3},{"$f":"'Pop calcs'!I95","v":8.7182689567784841E-3},null,0,3.6999999999999998E-2]
[null,{"$f":"Names!I92","v":168},{"$f":"Names!F92","v":"North Sydney"},{"$f":"'Pop calcs'!F96","v":0},{"$f":"'Pop calcs'!I96","v":7.2442770211532887E-3},null,0,3.6999999999999998E-2]
[null,{"$f":"Names!I93","v":2087},{"$f":"Names!F93","v":"Northern Beaches"},{"$f":"'Pop calcs'!F97","v":0},{"$f":"'Pop calcs'!I97","v":2.7545504943176568E-3},null,0,3.6999999999999998E-2]
[null,{"$f":"Names!I94","v":2045},{"$f":"Names!F94","v":"Oberon"},{"$f":"'Pop calcs'!F98","v":9.2250922509218292E-4},{"$f":"'Pop calcs'!I98","v":4.2580370449222908E-3},null,0,3.6999999999999998E-2]
[null,{"$f":"Names!I95","v":172},{"$f":"Names!F95","v":"Orange "},{"$f":"'Pop calcs'!F99","v":7.1994918005788833E-3},{"$f":"'Pop calcs'!I99","v":9.3937769753730718E-3},null,0,3.6999999999999998E-2]
[null,{"$f":"Names!I96","v":173},{"$f":"Names!F96","v":"Parkes "},{"$f":"'Pop calcs'!F100","v":0},{"$f":"'Pop calcs'!I100","v":0},null,0,3.6999999999999998E-2]
[null,{"$f":"Names!I97","v":2089},{"$f":"Names!F97","v":"Parramatta "},{"$f":"'Pop calcs'!F101","v":0},{"$f":"'Pop calcs'!I101","v":7.2816785235591298E-3},null,0,3.6999999999999998E-2]
[null,{"$f":"Names!I98","v":176},{"$f":"Names!F98","v":"Penrith "},{"$f":"'Pop calcs'!F102","v":1.3451152295342661E-2},{"$f":"'Pop calcs'!I102","v":3.5641325242169536E-2},null,0,3.6999999999999998E-2]
[null,{"$f":"Names!I99","v":124},{"$f":"Names!F99","v":"Port Macquarie-Hastings"},{"$f":"'Pop calcs'!F103","v":1.8613308515588622E-2},{"$f":"'Pop calcs'!I103","v":8.6626561776955106E-3},null,0.01,4.7E-2]
[null,{"$f":"Names!I100","v":178},{"$f":"Names!F100","v":"Port Stephens"},{"$f":"'Pop calcs'!F104","v":1.578332818854089E-2},{"$f":"'Pop calcs'!I104","v":8.5432153555974697E-3},null,7.0000000000000001E-3,4.3999999999999997E-2]
[null,{"$f":"Names!I101","v":2095},{"$f":"Names!F101","v":"Queanbeyan-Palerang Regional"},{"$f":"'Pop calcs'!F105","v":2.0197962528521352E-2},{"$f":"'Pop calcs'!I105","v":1.1151280615102602E-2},null,8.9999999999999993E-3,4.5999999999999999E-2]
[null,{"$f":"Names!I102","v":181},{"$f":"Names!F102","v":"Randwick "},{"$f":"'Pop calcs'!F106","v":0},{"$f":"'Pop calcs'!I106","v":5.3512430265937284E-3},null,0,3.6999999999999998E-2]
[null,{"$f":"Names!I103","v":1981},{"$f":"Names!F103","v":"Richmond Valley"},{"$f":"'Pop calcs'!F107","v":3.448129070708017E-3},{"$f":"'Pop calcs'!I107","v":4.2239404352806412E-3},null,0,{"$f":"ROUND($D$4+G110,3)","v":3.6999999999999998E-2}]
[null,{"$f":"Names!I104","v":184},{"$f":"Names!F104","v":"Ryde "},{"$f":"'Pop calcs'!F108","v":0},{"$f":"'Pop calcs'!I108","v":1.0861924908157716E-2},null,0,3.6999999999999998E-2]
[null,{"$f":"Names!I105","v":188},{"$f":"Names!F105","v":"Shellharbour "},{"$f":"'Pop calcs'!F109","v":2.330318257956443E-2},{"$f":"'Pop calcs'!I109","v":2.3840929225317452E-2},null,0,3.6999999999999998E-2]
[null,{"$f":"Names!I106","v":189},{"$f":"Names!F106","v":"Shoalhaven "},{"$f":"'Pop calcs'!F110","v":1.5802533629358795E-2},{"$f":"'Pop calcs'!I110","v":7.1278615158334065E-3},null,8.9999999999999993E-3,4.5999999999999999E-2]
[null,{"$f":"Names!I107","v":190},{"$f":"Names!F107","v":"Singleton"},{"$f":"'Pop calcs'!F111","v":8.2980452542880112E-3},{"$f":"'Pop calcs'!I111","v":6.3593004769475362E-3},null,2E-3,3.9E-2]
[null,{"$f":"Names!I108","v":2096},{"$f":"Names!F108","v":"Snowy Monaro Regional"},{"$f":"'Pop calcs'!F112","v":1.0001428775539445E-2},{"$f":"'Pop calcs'!I112","v":7.1453879768513051E-3},null,3.0000000000000001E-3,0.04]
[null,{"$f":"Names!I109","v":2097},{"$f":"Names!F109","v":"Snowy Valleys"},{"$f":"'Pop calcs'!F113","v":0},{"$f":"'Pop calcs'!I113","v":3.540606328833813E-3},null,0,3.6999999999999998E-2]
[null,{"$f":"Names!I110","v":193},{"$f":"Names!F110","v":"Strathfield "},{"$f":"'Pop calcs'!F114","v":0},{"$f":"'Pop calcs'!I114","v":1.8666666666666666E-3},null,0,3.6999999999999998E-2]
[null,{"$f":"Names!I111","v":194},{"$f":"Names!F111","v":"Sutherland "},{"$f":"'Pop calcs'!F115","v":8.2154876358848661E-3},{"$f":"'Pop calcs'!I115","v":1.1360440503855889E-2},null,0,3.6999999999999998E-2]
[null,{"$f":"Names!I112","v":2029},{"$f":"Names!F112","v":"Sydney "},{"$f":"'Pop calcs'!F116","v":0},{"$f":"'Pop calcs'!I116","v":0},null,0,3.6999999999999998E-2]
[null,{"$f":"Names!I113","v":2038},{"$f":"Names!F113","v":"Tamworth Regional"},{"$f":"'Pop calcs'!F117","v":3.8053210539779059E-3},{"$f":"'Pop calcs'!I117","v":8.1935130339482812E-3},null,0,3.6999999999999998E-2]
[null,{"$f":"Names!I114","v":198},{"$f":"Names!F114","v":"Temora "},{"$f":"'Pop calcs'!F118","v":0},{"$f":"'Pop calcs'!I118","v":4.8297512678097078E-3},null,0,3.6999999999999998E-2]
[null,{"$f":"Names!I115","v":199},{"$f":"Names!F115","v":"Tenterfield "},{"$f":"'Pop calcs'!F119","v":4.7906042342760191E-3},{"$f":"'Pop calcs'!I119","v":0},null,5.0000000000000001E-3,4.2000000000000003E-2]
[null,{"$f":"Names!I116","v":59},{"$f":"Names!F116","v":"Hills "},{"$f":"'Pop calcs'!F120","v":2.6009783596423919E-2},{"$f":"'Pop calcs'!I120","v":2.0816519990264275E-2},null,5.0000000000000001E-3,4.2000000000000003E-2]
[null,{"$f":"Names!I117","v":202},{"$f":"Names!F117","v":"Tweed "},{"$f":"'Pop calcs'!F121","v":1.1078361622116173E-2},{"$f":"'Pop calcs'!I121","v":8.4536647779199416E-3},null,3.0000000000000001E-3,0.04]
[null,{"$f":"Names!I118","v":2046},{"$f":"Names!F118","v":"Upper Hunter "},{"$f":"'Pop calcs'!F122","v":0},{"$f":"'Pop calcs'!I122","v":7.0144673388864538E-4},null,0,3.6999999999999998E-2]
[null,{"$f":"Names!I119","v":2035},{"$f":"Names!F119","v":"Upper Lachlan "},{"$f":"'Pop calcs'!F123","v":1.7524776408025078E-2},{"$f":"'Pop calcs'!I123","v":2.3338607594936708E-2},null,0,3.6999999999999998E-2]
[null,{"$f":"Names!I120","v":204},{"$f":"Names!F120","v":"Uralla "},{"$f":"'Pop calcs'!F124","v":0},{"$f":"'Pop calcs'!I124","v":0},null,0,3.6999999999999998E-2]
[null,{"$f":"Names!I121","v":206},{"$f":"Names!F121","v":"Wagga Wagga "},{"$f":"'Pop calcs'!F125","v":9.7772371322131235E-3},{"$f":"'Pop calcs'!I125","v":8.3129063199403174E-3},null,1E-3,3.7999999999999999E-2]
[null,{"$f":"Names!I122","v":208},{"$f":"Names!F122","v":"Walcha"},{"$f":"'Pop calcs'!F126","v":0},{"$f":"'Pop calcs'!I126","v":2.7793218454697053E-4},null,0,3.6999999999999998E-2]
[null,{"$f":"Names!I123","v":209},{"$f":"Names!F123","v":"Walgett "},{"$f":"'Pop calcs'!F127","v":0},{"$f":"'Pop calcs'!I127","v":8.6132644272179156E-4},null,0,3.6999999999999998E-2]
[null,{"$f":"Names!I124","v":210},{"$f":"Names!F124","v":"Warren "},{"$f":"'Pop calcs'!F128","v":0},{"$f":"'Pop calcs'!I128","v":5.9594755661501785E-4},null,0,3.6999999999999998E-2]
[null,{"$f":"Names!I125","v":2050},{"$f":"Names!F125","v":"Warrumbungle "},{"$f":"'Pop calcs'!F129","v":0},{"$f":"'Pop calcs'!I129","v":0},null,0,3.6999999999999998E-2]
[null,{"$f":"Names!I126","v":212},{"$f":"Names!F126","v":"Waverley"},{"$f":"'Pop calcs'!F130","v":0},{"$f":"'Pop calcs'!I130","v":3.8795022365436392E-3},null,0,3.6999999999999998E-2]
[null,{"$f":"Names!I127","v":213},{"$f":"Names!F127","v":"Weddin "},{"$f":"'Pop calcs'!F131","v":0},{"$f":"'Pop calcs'!I131","v":6.8917987594762232E-4},null,0,3.6999999999999998E-2]
[null,{"$f":"Names!I128","v":215},{"$f":"Names!F128","v":"Wentworth "},{"$f":"'Pop calcs'!F132","v":7.3342736248236395E-3},{"$f":"'Pop calcs'!I132","v":1.2449652142072502E-2},null,0,3.6999999999999998E-2]
[null,{"$f":"Names!I129","v":216},{"$f":"Names!F129","v":"Willoughby "},{"$f":"'Pop calcs'!F133","v":0},{"$f":"'Pop calcs'!I133","v":1.6964487672472292E-3},null,0,3.6999999999999998E-2]
[null,{"$f":"Names!I130","v":218},{"$f":"Names!F130","v":"Wingecarribee "},{"$f":"'Pop calcs'!F134","v":1.054807487974041E-2},{"$f":"'Pop calcs'!I134","v":7.0314133140761291E-3},null,4.0000000000000001E-3,4.1000000000000002E-2]
[null,{"$f":"Names!I131","v":219},{"$f":"Names!F131","v":"Wollondilly "},{"$f":"'Pop calcs'!F135","v":1.4258731158105276E-2},{"$f":"'Pop calcs'!I135","v":2.0155506907224278E-2},null,0,3.6999999999999998E-2]
[null,{"$f":"Names!I132","v":220},{"$f":"Names!F132","v":"Wollongong "},{"$f":"'Pop calcs'!F136","v":3.9446385673727047E-3},{"$f":"'Pop calcs'!I136","v":6.571597929918154E-3},null,0,3.6999999999999998E-2]
[null,{"$f":"Names!I133","v":221},{"$f":"Names!F133","v":"Woollahra "},{"$f":"'Pop calcs'!F137","v":0},{"$f":"'Pop calcs'!I137","v":2.1968471622045723E-3},null,0,3.6999999999999998E-2]
[null,{"$f":"Names!I134","v":2036},{"$f":"Names!F134","v":"Yass Valley"},{"$f":"'Pop calcs'!F138","v":1.6510795520147781E-2},{"$f":"'Pop calcs'!I138","v":1.1076650420912717E-2},null,5.0000000000000001E-3,4.2000000000000003E-2]

{"sheet":"Names","index":5,"n_rows":134,"n_cols":9,"rows_kept":134,"cut":false,"hidden":false,"merged":[]}
[]
[]
[null,"LGA and Council names"]
[]
[null,"LGA code","Local Government Area",null,"Council name","Council Name","Rate peg order name","OLG Group","OrgID"]
[]
[null,10050,"Albury (C)",null,"Albury City Council","Albury ","Albury City",4,2047]
[null,10180,"Armidale Regional (A)",null,"Armidale Regional Council","Armidale Regional","Armidale Regional",4,2079]
[null,10250,"Ballina (A)",null,"Ballina Shire Council","Ballina ","Ballina Shire",4,54]
[null,10300,"Balranald (A)",null,"Balranald Shire Council","Balranald ","Balranald Shire",9,55]
[null,10470,"Bathurst Regional (A)",null,"Bathurst Regional Council","Bathurst Regional","Bathurst Regional",4,2043]
[null,10500,"Bayside (A)",null,"Bayside Council","Bayside","Bayside",3,2099]
[null,10550,"Bega Valley (A)",null,"Bega Valley Shire Council","Bega Valley ","Bega Valley Shire",4,60]
[null,10600,"Bellingen (A)",null,"Bellingen Shire Council","Bellingen ","Bellingen Shire",11,61]
[null,10650,"Berrigan (A)",null,"Berrigan Shire Council","Berrigan ","Berrigan Shire",10,62]
[null,10750,"Blacktown (C)",null,"Blacktown City Council","Blacktown ","Blacktown City",3,64]
[null,10800,"Bland (A)",null,"Bland Shire Council","Bland ","Bland Shire",10,65]
[null,10850,"Blayney (A)",null,"Blayney Shire Council","Blayney ","Blayney Shire",10,66]
[null,10900,"Blue Mountains (C)",null,"Blue Mountains City Council","Blue Mountains ","Blue Mountains City",7,67]
[null,10950,"Bogan (A)",null,"Bogan Shire Council","Bogan ","Bogan Shire",9,68]
[null,11150,"Bourke (A)",null,"Bourke Shire Council","Bourke ","Bourke Shire",9,72]
[null,11200,"Brewarrina (A)",null,"Brewarrina Shire Council","Brewarrina ","Brewarrina Shire",8,73]
[null,11250,"Broken Hill (C)",null,"Broken Hill City Council","Broken Hill ","Broken Hill City",4,74]
[null,11300,"Burwood (A)",null,"Burwood Council","Burwood","Burwood",2,75]
[null,11350,"Byron (A)",null,"Byron Shire Council","Byron ","Byron Shire",4,76]
[null,11400,"Cabonne (A)",null,"Cabonne Council","Cabonne","Cabonne",11,77]
[null,11450,"Camden (A)",null,"Camden Council","Camden","Camden",7,78]
[null,11500,"Campbelltown (C) (NSW)",null,"Campbelltown City Council","Campbelltown ","Campbelltown City",7,79]
[null,11520,"Canada Bay (A)",null,"City of Canada Bay Council","Canada Bay ","City of Canada Bay ",3,1989]
[null,11570,"Canterbury-Bankstown (A)",null,"Canterbury-Bankstown Council","Canterbury-Bankstown","Canterbury-Bankstown",3,2080]
[null,11600,"Carrathool (A)",null,"Carrathool Shire Council","Carrathool ","Carrathool Shire",9,81]
[null,11650,"Central Coast (C) (NSW)",null,"Central Coast Council","Central Coast","Central Coast",7,2088]
[null,11700,"Central Darling (A)",null,"Central Darling Shire Council","Central Darling ","Central Darling Shire",9,83]
[null,11720,"Cessnock (C)",null,"Cessnock City Council","Cessnock ","Cessnock City",4,84]
[null,11730,"Clarence Valley (A)",null,"Clarence Valley Council","Clarence Valley","Clarence Valley",4,2037]
[null,11750,"Cobar (A)",null,"Cobar Shire Council","Cobar ","Cobar Shire",10,85]
[null,11800,"Coffs Harbour (C)",null,"Coffs Harbour City Council","Coffs Harbour ","Coffs Harbour City",5,86]
[null,12000,"Coolamon (A)",null,"Coolamon Shire Council","Coolamon ","Coolamon Shire",9,90]
[null,12150,"Coonamble (A)",null,"Coonamble Shire Council","Coonamble ","Coonamble Shire",9,93]
[null,12160,"Cootamundra-Gundagai Regional (A)",null,"Cootamundra-Gundagai Council","Cootamundra-Gundagai Regional","Cootamundra-Gundagai Regional",11,2094]
[null,12350,"Cowra (A)",null,"Corowa Shire Council","Cowra ","Cowra Shire",11,97]
[null,12380,"Cumberland (A)",null,"Cumberland Council","Cumberland","Cumberland City",3,2090]
[null,12390,"Dubbo Regional (A)",null,"Dubbo Regional Council","Dubbo Regional","Dubbo Regional",4,2098]
[null,12700,"Dungog (A)",null,"Dungog Shire Council","Dungog ","Dungog Shire",10,104]
[null,12730,"Edward River (A)",null,"Edward River Council","Edward River","Edward River",10,2091]
[null,12750,"Eurobodalla (A)",null,"Eurobodalla Shire Council","Eurobodalla ","Eurobodalla Shire",4,105]
[null,12850,"Fairfield (C)",null,"Fairfield City Council","Fairfield ","Fairfield City",3,107]
[null,12870,"Federation (A)",null,"Federation Council","Federation","Federation",11,2092]
[null,12900,"Forbes (A)",null,"Forbes Shire Council","Forbes ","Forbes Shire",10,108]
[null,12930,"Georges River (A)",null,"Georges River Council","Georges River","Georges River",3,2093]
[null,12950,"Gilgandra (A)",null,"Gilgandra Shire Council","Gilgandra ","Gilgandra Shire",9,109]
[null,13010,"Glen Innes Severn (A)",null,"Glen Innes Severn Shire Council","Glen Innes Severn","Glen Innes Severn",10,2053]
[null,13310,"Goulburn Mulwaree (A)",null,"Goulburn Mulwaree Council","Goulburn Mulwaree","Goulburn Mulwaree",4,2032]
[null,13340,"Greater Hume Shire (A)",null,"Greater Hume Shire Council","Greater Hume ","Greater Hume Shire",11,2049]
[null,13450,"Griffith (C)",null,"Griffith City Council","Griffith ","Griffith City",4,118]
[null,13550,"Gunnedah (A)",null,"Gunnedah Shire Council","Gunnedah ","Gunnedah Shire",11,120]
[null,13660,"Gwydir (A)",null,"Gwydir Shire Council","Gwydir ","Gwydir Shire",10,2039]
[null,13800,"Hawkesbury (C)",null,"Hawkesbury City Council","Hawkesbury ","Hawkesbury City",6,125]
[null,13850,"Hay (A)",null,"Hay Shire Council","Hay ","Hay Shire",9,126]
[null,13910,"Hilltops (A)",null,"Hilltops Council","Hilltops","Hilltops",11,2081]
[null,14000,"Hornsby (A)",null,"Hornsby, The Council of the Shire of","Hornsby ","Hornsby Shire",7,129]
[null,14100,"Hunters Hill (A)",null,"Hunters Hill, The Council of the Municipality of","Hunters Hill ","Hunters Hill ",2,131]
[null,14170,"Inner West (A)",null,"Inner West Council","Inner West","Inner West",3,2083]
[null,14220,"Inverell (A)",null,"Inverell Shire Council","Inverell ","Inverell Shire",11,133]
[null,14300,"Junee (A)",null,"Junee Shire Council","Junee ","Junee Shire",10,135]
[null,14350,"Kempsey (A)",null,"Kempsey Shire Council","Kempsey ","Kempsey Shire",4,136]
[null,14400,"Kiama (A)",null,"Kiama, The Council of the Municipality of","Kiama ","Kiama Municipal",4,137]
[null,14500,"Ku-ring-gai (A)",null,"Ku-ring-gai Municipal Council","Ku-ring-gai","Ku-ring-gai",3,139]
[null,14550,"Kyogle (A)",null,"Kyogle Council","Kyogle","Kyogle",10,140]
[null,14600,"Lachlan (A)",null,"Lachlan Shire Council","Lachlan ","Lachlan Shire",10,141]
[null,14650,"Lake Macquarie (C)",null,"Lake Macquarie City Council","Lake Macquarie ","Lake Macquarie City",5,142]
[null,14700,"Lane Cove (A)",null,"Lane Cove Council","Lane Cove ","Lane Cove ",2,143]
[null,14750,"Leeton (A)",null,"Leeton Shire Council","Leeton ","Leeton Shire",11,144]
[null,14850,"Lismore (C)",null,"Lismore City Council","Lismore ","Lismore City",4,146]
[null,14870,"Lithgow (C)",null,"Lithgow Council, City of","Lithgow ","Lithgow City",4,2044]
[null,14900,"Liverpool (C)",null,"Liverpool City Council","Liverpool ","Liverpool City",3,147]
[null,14920,"Liverpool Plains (A)",null,"Liverpool Plains Shire Council","Liverpool Plains ","Liverpool Plains Shire",10,2040]
[null,14950,"Lockhart (A)",null,"Lockhart Shire Council","Lockhart ","Lockhart Shire",9,148]
[null,15050,"Maitland (C)",null,"Maitland City Council","Maitland ","Maitland City",5,150]
[null,15240,"Mid-Coast (A)",null,"MidCoast Council","Mid-Coast","Mid-Coast",5,2084]
[null,15270,"Mid-Western Regional (A)",null,"Mid-Western Regional Council","Mid-Western Regional","Mid-Western Regional",4,2042]
[null,15300,"Moree Plains (A)",null,"Moree Plains Shire Council","Moree Plains ","Moree Plains Shire",11,155]
[null,15350,"Mosman (A)",null,"Mosman Municipal Council","Mosman ","Mosman ",2,156]
[null,15520,"Murray River (A)",null,"Murray River Council","Murray River","Murray River",11,2085]
[null,15560,"Murrumbidgee (A)",null,"Murrumbidgee Shire Council","Murrumbidgee","Murrumbidgee ",9,2086]
[null,15650,"Muswellbrook (A)",null,"Muswellbrook Shire Council","Muswellbrook ","Muswellbrook Shire",11,162]
[null,15700,"Nambucca Valley (A)",null,"Nambucca Shire Council","Nambucca ","Nambucca Valley",11,163]
[null,15750,"Narrabri (A)",null,"Narrabri Shire Council","Narrabri ","Narrabri Shire",11,164]
[null,15800,"Narrandera (A)",null,"Narrandera Shire Council","Narrandera ","Narrandera Shire",10,165]
[null,15850,"Narromine (A)",null,"Narromine Shire Council","Narromine ","Narromine Shire",10,166]
[null,15900,"Newcastle (C)",null,"Newcastle City Council","Newcastle ","Newcastle City",5,167]
[null,15950,"North Sydney (A)",null,"North Sydney Council","North Sydney","North Sydney",3,168]
[null,15990,"Northern Beaches (A)",null,"Northern Beaches Council","Northern Beaches","Northern Beaches",3,2087]
[null,16100,"Oberon (A)",null,"Oberon Council","Oberon","Oberon",10,2045]
[null,16150,"Orange (C)",null,"Orange City Council","Orange ","Orange City",4,172]
[null,16200,"Parkes (A)",null,"Parkes Shire Council","Parkes ","Parkes Shire",11,173]
[null,16260,"Parramatta (C)",null,"City of Parramatta Council","Parramatta ","City of Parramatta",3,2089]
[null,16350,"Penrith (C)",null,"Penrith City Council","Penrith ","Penrith City",7,176]
[null,16380,"Port Macquarie-Hastings (A)",null,"Port Macquarie-Hastings Council","Port Macquarie-Hastings","Port Macquarie-Hastings",5,124]
[null,16400,"Port Stephens (A)",null,"Port Stephens Council","Port Stephens","Port Stephens",5,178]
[null,16490,"Queanbeyan-Palerang Regional (A)",null,"Queanbeyan-Palerang Regional Council","Queanbeyan-Palerang Regional","Queanbeyan-Palerang Regional",4,2095]
[null,16550,"Randwick (C)",null,"Randwick City Council","Randwick ","Randwick City",3,181]
[null,16610,"Richmond Valley (A)",null,"Richmond Valley Council","Richmond Valley","Richmond Valley",4,1981]
[null,16700,"Ryde (C)",null,"City of Ryde Council","Ryde ","City of Ryde ",3,184]
[null,16900,"Shellharbour (C)",null,"Shellharbour City Council","Shellharbour ","Shellharbour City",5,188]
[null,16950,"Shoalhaven (C)",null,"Shoalhaven City Council","Shoalhaven ","Shoalhaven City",5,189]
[null,17000,"Singleton (A)",null,"Singleton Shire Council","Singleton","Singleton",4,190]
[null,17040,"Snowy Monaro Regional (A)",null,"Snowy Monaro Regional Council","Snowy Monaro Regional","Snowy Monaro Regional",4,2096]
[null,17080,"Snowy Valleys (A)",null,"Snowy Valleys Council","Snowy Valleys","Snowy Valleys",11,2097]
[null,17100,"Strathfield (A)",null,"Strathfield Municipal Council","Strathfield ","Strathfield ",2,193]
[null,17150,"Sutherland Shire (A)",null,"Sutherland Shire Council","Sutherland ","Sutherland Shire",3,194]
[null,17200,"Sydney (C)",null,"City of Sydney Council","Sydney ","City of Sydney ",1,2029]
[null,17310,"Tamworth Regional (A)",null,"Tamworth Regional Council","Tamworth Regional","Tamworth Regional",4,2038]
[null,17350,"Temora (A)",null,"Temora Shire Council","Temora ","Temora Shire",10,198]
[null,17400,"Tenterfield (A)",null,"Tenterfield Shire Council","Tenterfield ","Tenterfield Shire",10,199]
[null,17420,"The Hills Shire (A)",null,"Hills Shire Council, The","Hills ","The Hills Shire",7,59]
[null,17550,"Tweed (A)",null,"Tweed Shire Council","Tweed ","Tweed Shire",5,202]
[null,17620,"Upper Hunter Shire (A)",null,"Upper Hunter Shire Council","Upper Hunter ","Upper Hunter Shire",11,2046]
[null,17640,"Upper Lachlan Shire (A)",null,"Upper Lachlan Shire Council","Upper Lachlan ","Upper Lachlan Shire",10,2035]
[null,17650,"Uralla (A)",null,"Uralla Shire Council","Uralla ","Uralla Shire",10,204]
[null,17750,"Wagga Wagga (C)",null,"Wagga Wagga City Council","Wagga Wagga ","Wagga Wagga City",4,206]
[null,17850,"Walcha (A)",null,"Walcha Council","Walcha","Walcha",9,208]
[null,17900,"Walgett (A)",null,"Walgett Shire Council","Walgett ","Walgett Shire",10,209]
[null,17950,"Warren (A)",null,"Warren Shire Council","Warren ","Warren Shire",9,210]
[null,18020,"Warrumbungle Shire (A)",null,"Warrumbungle Shire Council","Warrumbungle ","Warrumbungle Shire",10,2050]
[null,18050,"Waverley (A)",null,"Waverley Council","Waverley","Waverley",3,212]
[null,18100,"Weddin (A)",null,"Weddin Shire Council","Weddin ","Weddin Shire",9,213]
[null,18200,"Wentworth (A)",null,"Wentworth Shire Council","Wentworth ","Wentworth Shire",10,215]
[null,18250,"Willoughby (C)",null,"Willoughby City Council","Willoughby ","Willoughby City",3,216]
[null,18350,"Wingecarribee (A)",null,"Wingecarribee Shire Council","Wingecarribee ","Wingecarribee Shire",4,218]
[null,18400,"Wollondilly (A)",null,"Wollondilly Shire Council","Wollondilly ","Wollondilly Shire",6,219]
[null,18450,"Wollongong (C)",null,"Wollongong City Council","Wollongong ","Wollongong City",5,220]
[null,18500,"Woollahra (A)",null,"Woollahra Municipal Council","Woollahra ","Woollahra Municipal",2,221]
[null,18710,"Yass Valley (A)",null,"Yass Valley Council","Yass Valley","Yass Valley",11,2036]

{"sheet":"ABS pop T1","index":6,"n_rows":148,"n_cols":8,"rows_kept":148,"cut":false,"hidden":false,"merged":[]}
[]
[null,"Source:",null,"https://www.abs.gov.au/statistics/people/population/regional-population/latest-release#data-download"]
[]
[null,null,"Regional population, 2020-21"]
[null,null,"Released at 11.30am (Canberra time) 30 March 2022"]
[null,null,"Table 1. Estimated resident population, Local Government Areas, New South Wales"]
[]
[null,null,null,null,"ERP at 30 June"]
[null,null,null,null,2020,2021,null,{"$f":"'Supp val'!$C$6","v":"Org. Name"}]
[null,null,"LGA code","Local Government Area","no.","no."]
[]
[null,null,10050,"Albury (C)",55056,55754,null,{"$f":"INDEX(Names!$F$7:$F$134,MATCH(D12,Names!$C$7:$C$134,0))","v":"Albury "}]
[null,null,10180,"Armidale Regional (A)",29703,29484,null,{"$f":"INDEX(Names!$F$7:$F$134,MATCH(D13,Names!$C$7:$C$134,0))","v":"Armidale Regional"}]
[null,null,10250,"Ballina (A)",45221,45773,null,{"$f":"INDEX(Names!$F$7:$F$134,MATCH(D14,Names!$C$7:$C$134,0))","v":"Ballina "}]
[null,null,10300,"Balranald (A)",2305,2276,null,{"$f":"INDEX(Names!$F$7:$F$134,MATCH(D15,Names!$C$7:$C$134,0))","v":"Balranald "}]
[null,null,10470,"Bathurst Regional (A)",43995,44540,null,{"$f":"INDEX(Names!$F$7:$F$134,MATCH(D16,Names!$C$7:$C$134,0))","v":"Bathurst Regional"}]
[null,null,10500,"Bayside (A)",181445,182369,null,{"$f":"INDEX(Names!$F$7:$F$134,MATCH(D17,Names!$C$7:$C$134,0))","v":"Bayside"}]
[null,null,10550,"Bega Valley (A)",34730,35046,null,{"$f":"INDEX(Names!$F$7:$F$134,MATCH(D18,Names!$C$7:$C$134,0))","v":"Bega Valley "}]
[null,null,10600,"Bellingen (A)",13142,13248,null,{"$f":"INDEX(Names!$F$7:$F$134,MATCH(D19,Names!$C$7:$C$134,0))","v":"Bellingen "}]
[null,null,10650,"Berrigan (A)",8785,8810,null,{"$f":"INDEX(Names!$F$7:$F$134,MATCH(D20,Names!$C$7:$C$134,0))","v":"Berrigan "}]
[null,null,10750,"Blacktown (C)",382780,387104,null,{"$f":"INDEX(Names!$F$7:$F$134,MATCH(D21,Names!$C$7:$C$134,0))","v":"Blacktown "}]
[null,null,10800,"Bland (A)",5937,5923,null,{"$f":"INDEX(Names!$F$7:$F$134,MATCH(D22,Names!$C$7:$C$134,0))","v":"Bland "}]
[null,null,10850,"Blayney (A)",7382,7408,null,{"$f":"INDEX(Names!$F$7:$F$134,MATCH(D23,Names!$C$7:$C$134,0))","v":"Blayney "}]
[null,null,10900,"Blue Mountains (C)",79195,78740,null,{"$f":"INDEX(Names!$F$7:$F$134,MATCH(D24,Names!$C$7:$C$134,0))","v":"Blue Mountains "}]
[null,null,10950,"Bogan (A)",2529,2481,null,{"$f":"INDEX(Names!$F$7:$F$134,MATCH(D25,Names!$C$7:$C$134,0))","v":"Bogan "}]
[null,null,11150,"Bourke (A)",2625,2596,null,{"$f":"INDEX(Names!$F$7:$F$134,MATCH(D26,Names!$C$7:$C$134,0))","v":"Bourke "}]
[null,null,11200,"Brewarrina (A)",1553,1520,null,{"$f":"INDEX(Names!$F$7:$F$134,MATCH(D27,Names!$C$7:$C$134,0))","v":"Brewarrina "}]
[null,null,11250,"Broken Hill (C)",17271,17230,null,{"$f":"INDEX(Names!$F$7:$F$134,MATCH(D28,Names!$C$7:$C$134,0))","v":"Broken Hill "}]
[null,null,11300,"Burwood (A)",40861,40686,null,{"$f":"INDEX(Names!$F$7:$F$134,MATCH(D29,Names!$C$7:$C$134,0))","v":"Burwood"}]
[null,null,11350,"Byron (A)",35772,36217,null,{"$f":"INDEX(Names!$F$7:$F$134,MATCH(D30,Names!$C$7:$C$134,0))","v":"Byron "}]
[null,null,11400,"Cabonne (A)",13678,13759,null,{"$f":"INDEX(Names!$F$7:$F$134,MATCH(D31,Names!$C$7:$C$134,0))","v":"Cabonne"}]
[null,null,11450,"Camden (A)",107797,114516,null,{"$f":"INDEX(Names!$F$7:$F$134,MATCH(D32,Names!$C$7:$C$134,0))","v":"Camden"}]
[null,null,11500,"Campbelltown (C) (NSW)",174055,175687,null,{"$f":"INDEX(Names!$F$7:$F$134,MATCH(D33,Names!$C$7:$C$134,0))","v":"Campbelltown "}]
[null,null,11520,"Canada Bay (A)",96539,95919,null,{"$f":"INDEX(Names!$F$7:$F$134,MATCH(D34,Names!$C$7:$C$134,0))","v":"Canada Bay "}]
[null,null,11570,"Canterbury-Bankstown (A)",380363,378425,null,{"$f":"INDEX(Names!$F$7:$F$134,MATCH(D35,Names!$C$7:$C$134,0))","v":"Canterbury-Bankstown"}]
[null,null,11600,"Carrathool (A)",2796,2789,null,{"$f":"INDEX(Names!$F$7:$F$134,MATCH(D36,Names!$C$7:$C$134,0))","v":"Carrathool "}]
[null,null,11650,"Central Coast (C) (NSW)",345818,347158,null,{"$f":"INDEX(Names!$F$7:$F$134,MATCH(D37,Names!$C$7:$C$134,0))","v":"Central Coast"}]
[null,null,11700,"Central Darling (A)",1829,1834,null,{"$f":"INDEX(Names!$F$7:$F$134,MATCH(D38,Names!$C$7:$C$134,0))","v":"Central Darling "}]
[null,null,11720,"Cessnock (C)",61256,63020,null,{"$f":"INDEX(Names!$F$7:$F$134,MATCH(D39,Names!$C$7:$C$134,0))","v":"Cessnock "}]
[null,null,11730,"Clarence Valley (A)",51735,52993,null,{"$f":"INDEX(Names!$F$7:$F$134,MATCH(D40,Names!$C$7:$C$134,0))","v":"Clarence Valley"}]
[null,null,11750,"Cobar (A)",4417,4365,null,{"$f":"INDEX(Names!$F$7:$F$134,MATCH(D41,Names!$C$7:$C$134,0))","v":"Cobar "}]
[null,null,11800,"Coffs Harbour (C)",77651,78093,null,{"$f":"INDEX(Names!$F$7:$F$134,MATCH(D42,Names!$C$7:$C$134,0))","v":"Coffs Harbour "}]
[null,null,12000,"Coolamon (A)",4291,4304,null,{"$f":"INDEX(Names!$F$7:$F$134,MATCH(D43,Names!$C$7:$C$134,0))","v":"Coolamon "}]
[null,null,12150,"Coonamble (A)",3907,3854,null,{"$f":"INDEX(Names!$F$7:$F$134,MATCH(D44,Names!$C$7:$C$134,0))","v":"Coonamble "}]
[null,null,12160,"Cootamundra-Gundagai Regional (A)",11226,11169,null,{"$f":"INDEX(Names!$F$7:$F$134,MATCH(D45,Names!$C$7:$C$134,0))","v":"Cootamundra-Gundagai Regional"}]
[null,null,12350,"Cowra (A)",12732,12785,null,{"$f":"INDEX(Names!$F$7:$F$134,MATCH(D46,Names!$C$7:$C$134,0))","v":"Cowra "}]
[null,null,12380,"Cumberland (A)",242630,239834,null,{"$f":"INDEX(Names!$F$7:$F$134,MATCH(D47,Names!$C$7:$C$134,0))","v":"Cumberland"}]
[null,null,12390,"Dubbo Regional (A)",54043,54195,null,{"$f":"INDEX(Names!$F$7:$F$134,MATCH(D48,Names!$C$7:$C$134,0))","v":"Dubbo Regional"}]
[null,null,12700,"Dungog (A)",9664,9784,null,{"$f":"INDEX(Names!$F$7:$F$134,MATCH(D49,Names!$C$7:$C$134,0))","v":"Dungog "}]
[null,null,12730,"Edward River (A)",9084,9158,null,{"$f":"INDEX(Names!$F$7:$F$134,MATCH(D50,Names!$C$7:$C$134,0))","v":"Edward River"}]
[null,null,12750,"Eurobodalla (A)",38957,39362,null,{"$f":"INDEX(Names!$F$7:$F$134,MATCH(D51,Names!$C$7:$C$134,0))","v":"Eurobodalla "}]
[null,null,12850,"Fairfield (C)",210809,207922,null,{"$f":"INDEX(Names!$F$7:$F$134,MATCH(D52,Names!$C$7:$C$134,0))","v":"Fairfield "}]
[null,null,12870,"Federation (A)",12600,12735,null,{"$f":"INDEX(Names!$F$7:$F$134,MATCH(D53,Names!$C$7:$C$134,0))","v":"Federation"}]
[null,null,12900,"Forbes (A)",9921,9934,null,{"$f":"INDEX(Names!$F$7:$F$134,MATCH(D54,Names!$C$7:$C$134,0))","v":"Forbes "}]
[null,null,12930,"Georges River (A)",160253,159266,null,{"$f":"INDEX(Names!$F$7:$F$134,MATCH(D55,Names!$C$7:$C$134,0))","v":"Georges River"}]
[null,null,12950,"Gilgandra (A)",4229,4205,null,{"$f":"INDEX(Names!$F$7:$F$134,MATCH(D56,Names!$C$7:$C$134,0))","v":"Gilgandra "}]
[null,null,13010,"Glen Innes Severn (A)",8874,8816,null,{"$f":"INDEX(Names!$F$7:$F$134,MATCH(D57,Names!$C$7:$C$134,0))","v":"Glen Innes Severn"}]
[null,null,13310,"Goulburn Mulwaree (A)",31554,31796,null,{"$f":"INDEX(Names!$F$7:$F$134,MATCH(D58,Names!$C$7:$C$134,0))","v":"Goulburn Mulwaree"}]
[null,null,13340,"Greater Hume Shire (A)",10842,11020,null,{"$f":"INDEX(Names!$F$7:$F$134,MATCH(D59,Names!$C$7:$C$134,0))","v":"Greater Hume "}]
[null,null,13450,"Griffith (C)",27154,27173,null,{"$f":"INDEX(Names!$F$7:$F$134,MATCH(D60,Names!$C$7:$C$134,0))","v":"Griffith "}]
[null,null,13550,"Gunnedah (A)",12689,12713,null,{"$f":"INDEX(Names!$F$7:$F$134,MATCH(D61,Names!$C$7:$C$134,0))","v":"Gunnedah "}]
[null,null,13660,"Gwydir (A)",5299,5323,null,{"$f":"INDEX(Names!$F$7:$F$134,MATCH(D62,Names!$C$7:$C$134,0))","v":"Gwydir "}]
[null,null,13800,"Hawkesbury (C)",67745,68009,null,{"$f":"INDEX(Names!$F$7:$F$134,MATCH(D63,Names!$C$7:$C$134,0))","v":"Hawkesbury "}]
[null,null,13850,"Hay (A)",2944,2945,null,{"$f":"INDEX(Names!$F$7:$F$134,MATCH(D64,Names!$C$7:$C$134,0))","v":"Hay "}]
[null,null,13910,"Hilltops (A)",18618,18553,null,{"$f":"INDEX(Names!$F$7:$F$134,MATCH(D65,Names!$C$7:$C$134,0))","v":"Hilltops"}]
[null,null,14000,"Hornsby (A)",152412,150698,null,{"$f":"INDEX(Names!$F$7:$F$134,MATCH(D66,Names!$C$7:$C$134,0))","v":"Hornsby "}]
[null,null,14100,"Hunters Hill (A)",14963,14861,null,{"$f":"INDEX(Names!$F$7:$F$134,MATCH(D67,Names!$C$7:$C$134,0))","v":"Hunters Hill "}]
[null,null,14170,"Inner West (A)",201857,199759,null,{"$f":"INDEX(Names!$F$7:$F$134,MATCH(D68,Names!$C$7:$C$134,0))","v":"Inner West"}]
[null,null,14220,"Inverell (A)",17781,17696,null,{"$f":"INDEX(Names!$F$7:$F$134,MATCH(D69,Names!$C$7:$C$134,0))","v":"Inverell "}]
[null,null,14300,"Junee (A)",6676,6738,null,{"$f":"INDEX(Names!$F$7:$F$134,MATCH(D70,Names!$C$7:$C$134,0))","v":"Junee "}]
[null,null,14350,"Kempsey (A)",29922,30092,null,{"$f":"INDEX(Names!$F$7:$F$134,MATCH(D71,Names!$C$7:$C$134,0))","v":"Kempsey "}]
[null,null,14400,"Kiama (A)",23685,24006,null,{"$f":"INDEX(Names!$F$7:$F$134,MATCH(D72,Names!$C$7:$C$134,0))","v":"Kiama "}]
[null,null,14500,"Ku-ring-gai (A)",127598,126554,null,{"$f":"INDEX(Names!$F$7:$F$134,MATCH(D73,Names!$C$7:$C$134,0))","v":"Ku-ring-gai"}]
[null,null,14550,"Kyogle (A)",8789,8841,null,{"$f":"INDEX(Names!$F$7:$F$134,MATCH(D74,Names!$C$7:$C$134,0))","v":"Kyogle"}]
[null,null,14600,"Lachlan (A)",6089,6025,null,{"$f":"INDEX(Names!$F$7:$F$134,MATCH(D75,Names!$C$7:$C$134,0))","v":"Lachlan "}]
[null,null,14650,"Lake Macquarie (C)",207783,210031,null,{"$f":"INDEX(Names!$F$7:$F$134,MATCH(D76,Names!$C$7:$C$134,0))","v":"Lake Macquarie "}]
[null,null,14700,"Lane Cove (A)",40527,40336,null,{"$f":"INDEX(Names!$F$7:$F$134,MATCH(D77,Names!$C$7:$C$134,0))","v":"Lane Cove "}]
[null,null,14750,"Leeton (A)",11344,11242,null,{"$f":"INDEX(Names!$F$7:$F$134,MATCH(D78,Names!$C$7:$C$134,0))","v":"Leeton "}]
[null,null,14850,"Lismore (C)",43668,43790,null,{"$f":"INDEX(Names!$F$7:$F$134,MATCH(D79,Names!$C$7:$C$134,0))","v":"Lismore "}]
[null,null,14870,"Lithgow (C)",21518,21556,null,{"$f":"INDEX(Names!$F$7:$F$134,MATCH(D80,Names!$C$7:$C$134,0))","v":"Lithgow "}]
[null,null,14900,"Liverpool (C)",231268,234917,null,{"$f":"INDEX(Names!$F$7:$F$134,MATCH(D81,Names!$C$7:$C$134,0))","v":"Liverpool "}]
[null,null,14920,"Liverpool Plains (A)",7853,7848,null,{"$f":"INDEX(Names!$F$7:$F$134,MATCH(D82,Names!$C$7:$C$134,0))","v":"Liverpool Plains "}]
[null,null,14950,"Lockhart (A)",3260,3221,null,{"$f":"INDEX(Names!$F$7:$F$134,MATCH(D83,Names!$C$7:$C$134,0))","v":"Lockhart "}]
[null,null,15050,"Maitland (C)",87393,90449,null,{"$f":"INDEX(Names!$F$7:$F$134,MATCH(D84,Names!$C$7:$C$134,0))","v":"Maitland "}]
[null,null,15240,"Mid-Coast (A)",94407,95209,null,{"$f":"INDEX(Names!$F$7:$F$134,MATCH(D85,Names!$C$7:$C$134,0))","v":"Mid-Coast"}]
[null,null,15270,"Mid-Western Regional (A)",25367,25563,null,{"$f":"INDEX(Names!$F$7:$F$134,MATCH(D86,Names!$C$7:$C$134,0))","v":"Mid-Western Regional"}]
[null,null,15300,"Moree Plains (A)",13077,12988,null,{"$f":"INDEX(Names!$F$7:$F$134,MATCH(D87,Names!$C$7:$C$134,0))","v":"Moree Plains "}]
[null,null,15350,"Mosman (A)",30783,30122,null,{"$f":"INDEX(Names!$F$7:$F$134,MATCH(D88,Names!$C$7:$C$134,0))","v":"Mosman "}]
[null,null,15520,"Murray River (A)",12330,12571,null,{"$f":"INDEX(Names!$F$7:$F$134,MATCH(D89,Names!$C$7:$C$134,0))","v":"Murray River"}]
[null,null,15560,"Murrumbidgee (A)",3916,3871,null,{"$f":"INDEX(Names!$F$7:$F$134,MATCH(D90,Names!$C$7:$C$134,0))","v":"Murrumbidgee"}]
[null,null,15650,"Muswellbrook (A)",16355,16212,null,{"$f":"INDEX(Names!$F$7:$F$134,MATCH(D91,Names!$C$7:$C$134,0))","v":"Muswellbrook "}]
[null,null,15700,"Nambucca Valley (A)",19862,19911,null,{"$f":"INDEX(Names!$F$7:$F$134,MATCH(D92,Names!$C$7:$C$134,0))","v":"Nambucca "}]
[null,null,15750,"Narrabri (A)",13049,12948,null,{"$f":"INDEX(Names!$F$7:$F$134,MATCH(D93,Names!$C$7:$C$134,0))","v":"Narrabri "}]
[null,null,15800,"Narrandera (A)",5858,5834,null,{"$f":"INDEX(Names!$F$7:$F$134,MATCH(D94,Names!$C$7:$C$134,0))","v":"Narrandera "}]
[null,null,15850,"Narromine (A)",6460,6392,null,{"$f":"INDEX(Names!$F$7:$F$134,MATCH(D95,Names!$C$7:$C$134,0))","v":"Narromine "}]
[null,null,15900,"Newcastle (C)",167362,168880,null,{"$f":"INDEX(Names!$F$7:$F$134,MATCH(D96,Names!$C$7:$C$134,0))","v":"Newcastle "}]
[null,null,15950,"North Sydney (A)",75079,73712,null,{"$f":"INDEX(Names!$F$7:$F$134,MATCH(D97,Names!$C$7:$C$134,0))","v":"North Sydney"}]
[null,null,15990,"Northern Beaches (A)",274023,272184,null,{"$f":"INDEX(Names!$F$7:$F$134,MATCH(D98,Names!$C$7:$C$134,0))","v":"Northern Beaches"}]
[null,null,16100,"Oberon (A)",5420,5425,null,{"$f":"INDEX(Names!$F$7:$F$134,MATCH(D99,Names!$C$7:$C$134,0))","v":"Oberon"}]
[null,null,16150,"Orange (C)",42503,42809,null,{"$f":"INDEX(Names!$F$7:$F$134,MATCH(D100,Names!$C$7:$C$134,0))","v":"Orange "}]
[null,null,16200,"Parkes (A)",14729,14623,null,{"$f":"INDEX(Names!$F$7:$F$134,MATCH(D101,Names!$C$7:$C$134,0))","v":"Parkes "}]
[null,null,16260,"Parramatta (C)",260246,258799,null,{"$f":"INDEX(Names!$F$7:$F$134,MATCH(D102,Names!$C$7:$C$134,0))","v":"Parramatta "}]
[null,null,16350,"Penrith (C)",216264,219173,null,{"$f":"INDEX(Names!$F$7:$F$134,MATCH(D103,Names!$C$7:$C$134,0))","v":"Penrith "}]
[null,null,16380,"Port Macquarie-Hastings (A)",85960,87560,null,{"$f":"INDEX(Names!$F$7:$F$134,MATCH(D104,Names!$C$7:$C$134,0))","v":"Port Macquarie-Hastings"}]
[null,null,16400,"Port Stephens (A)",74509,75685,null,{"$f":"INDEX(Names!$F$7:$F$134,MATCH(D105,Names!$C$7:$C$134,0))","v":"Port Stephens"}]
[null,null,16490,"Queanbeyan-Palerang Regional (A)",62234,63491,null,{"$f":"INDEX(Names!$F$7:$F$134,MATCH(D106,Names!$C$7:$C$134,0))","v":"Queanbeyan-Palerang Regional"}]
[null,null,16550,"Randwick (C)",156596,153498,null,{"$f":"INDEX(Names!$F$7:$F$134,MATCH(D107,Names!$C$7:$C$134,0))","v":"Randwick "}]
[null,null,16610,"Richmond Valley (A)",23491,23572,null,{"$f":"INDEX(Names!$F$7:$F$134,MATCH(D108,Names!$C$7:$C$134,0))","v":"Richmond Valley"}]
[null,null,16700,"Ryde (C)",133205,132822,null,{"$f":"INDEX(Names!$F$7:$F$134,MATCH(D109,Names!$C$7:$C$134,0))","v":"Ryde "}]
[null,null,16900,"Shellharbour (C)",74625,76364,null,{"$f":"INDEX(Names!$F$7:$F$134,MATCH(D110,Names!$C$7:$C$134,0))","v":"Shellharbour "}]
[null,null,16950,"Shoalhaven (C)",107198,108892,null,{"$f":"INDEX(Names!$F$7:$F$134,MATCH(D111,Names!$C$7:$C$134,0))","v":"Shoalhaven "}]
[null,null,17000,"Singleton (A)",23379,23573,null,{"$f":"INDEX(Names!$F$7:$F$134,MATCH(D112,Names!$C$7:$C$134,0))","v":"Singleton"}]
[null,null,17040,"Snowy Monaro Regional (A)",20997,21207,null,{"$f":"INDEX(Names!$F$7:$F$134,MATCH(D113,Names!$C$7:$C$134,0))","v":"Snowy Monaro Regional"}]
[null,null,17080,"Snowy Valleys (A)",14413,14349,null,{"$f":"INDEX(Names!$F$7:$F$134,MATCH(D114,Names!$C$7:$C$134,0))","v":"Snowy Valleys"}]
[null,null,17100,"Strathfield (A)",47756,47705,null,{"$f":"INDEX(Names!$F$7:$F$134,MATCH(D115,Names!$C$7:$C$134,0))","v":"Strathfield "}]
[null,null,17150,"Sutherland Shire (A)",232366,234275,null,{"$f":"INDEX(Names!$F$7:$F$134,MATCH(D116,Names!$C$7:$C$134,0))","v":"Sutherland "}]
[null,null,17200,"Sydney (C)",248668,242237,null,{"$f":"INDEX(Names!$F$7:$F$134,MATCH(D117,Names!$C$7:$C$134,0))","v":"Sydney "}]
[null,null,17310,"Tamworth Regional (A)",62544,62782,null,{"$f":"INDEX(Names!$F$7:$F$134,MATCH(D118,Names!$C$7:$C$134,0))","v":"Tamworth Regional"}]
[null,null,17350,"Temora (A)",6274,6249,null,{"$f":"INDEX(Names!$F$7:$F$134,MATCH(D119,Names!$C$7:$C$134,0))","v":"Temora "}]
[null,null,17400,"Tenterfield (A)",6471,6502,null,{"$f":"INDEX(Names!$F$7:$F$134,MATCH(D120,Names!$C$7:$C$134,0))","v":"Tenterfield "}]
[null,null,17420,"The Hills Shire (A)",183777,188557,null,{"$f":"INDEX(Names!$F$7:$F$134,MATCH(D121,Names!$C$7:$C$134,0))","v":"Hills "}]
[null,null,17550,"Tweed (A)",98390,99480,null,{"$f":"INDEX(Names!$F$7:$F$134,MATCH(D122,Names!$C$7:$C$134,0))","v":"Tweed "}]
[null,null,17620,"Upper Hunter Shire (A)",14167,14152,null,{"$f":"INDEX(Names!$F$7:$F$134,MATCH(D123,Names!$C$7:$C$134,0))","v":"Upper Hunter "}]
[null,null,17640,"Upper Lachlan Shire (A)",8274,8419,null,{"$f":"INDEX(Names!$F$7:$F$134,MATCH(D124,Names!$C$7:$C$134,0))","v":"Upper Lachlan "}]
[null,null,17650,"Uralla (A)",5945,5883,null,{"$f":"INDEX(Names!$F$7:$F$134,MATCH(D125,Names!$C$7:$C$134,0))","v":"Uralla "}]
[null,null,17750,"Wagga Wagga (C)",65765,66408,null,{"$f":"INDEX(Names!$F$7:$F$134,MATCH(D126,Names!$C$7:$C$134,0))","v":"Wagga Wagga "}]
[null,null,17850,"Walcha (A)",3105,3103,null,{"$f":"INDEX(Names!$F$7:$F$134,MATCH(D127,Names!$C$7:$C$134,0))","v":"Walcha"}]
[null,null,17900,"Walgett (A)",5828,5785,null,{"$f":"INDEX(Names!$F$7:$F$134,MATCH(D128,Names!$C$7:$C$134,0))","v":"Walgett "}]
[null,null,17950,"Warren (A)",2716,2708,null,{"$f":"INDEX(Names!$F$7:$F$134,MATCH(D129,Names!$C$7:$C$134,0))","v":"Warren "}]
[null,null,18020,"Warrumbungle Shire (A)",9210,9118,null,{"$f":"INDEX(Names!$F$7:$F$134,MATCH(D130,Names!$C$7:$C$134,0))","v":"Warrumbungle "}]
[null,null,18050,"Waverley (A)",74263,72743,null,{"$f":"INDEX(Names!$F$7:$F$134,MATCH(D131,Names!$C$7:$C$134,0))","v":"Waverley"}]
[null,null,18100,"Weddin (A)",3597,3577,null,{"$f":"INDEX(Names!$F$7:$F$134,MATCH(D132,Names!$C$7:$C$134,0))","v":"Weddin "}]
[null,null,18200,"Wentworth (A)",7090,7142,null,{"$f":"INDEX(Names!$F$7:$F$134,MATCH(D133,Names!$C$7:$C$134,0))","v":"Wentworth "}]
[null,null,18250,"Willoughby (C)",81183,79556,null,{"$f":"INDEX(Names!$F$7:$F$134,MATCH(D134,Names!$C$7:$C$134,0))","v":"Willoughby "}]
[null,null,18350,"Wingecarribee (A)",51763,52309,null,{"$f":"INDEX(Names!$F$7:$F$134,MATCH(D135,Names!$C$7:$C$134,0))","v":"Wingecarribee "}]
[null,null,18400,"Wollondilly (A)",54002,54772,null,{"$f":"INDEX(Names!$F$7:$F$134,MATCH(D136,Names!$C$7:$C$134,0))","v":"Wollondilly "}]
[null,null,18450,"Wollongong (C)",219792,220659,null,{"$f":"INDEX(Names!$F$7:$F$134,MATCH(D137,Names!$C$7:$C$134,0))","v":"Wollongong "}]
[null,null,18500,"Woollahra (A)",59426,58480,null,{"$f":"INDEX(Names!$F$7:$F$134,MATCH(D138,Names!$C$7:$C$134,0))","v":"Woollahra "}]
[null,null,18710,"Yass Valley (A)",17322,17608,null,{"$f":"INDEX(Names!$F$7:$F$134,MATCH(D139,Names!$C$7:$C$134,0))","v":"Yass Valley"}]
[]
[null,null,19399,"Unincorporated NSW"]
[]
[null,null,null,"TOTAL NEW SOUTH WALES",8087379,8167532]
[]
[]
[null,null,"Source: Regional population, 2019-20"]
[]
[null,null,"© Commonwealth of Australia 2021"]

{"sheet":"Supp val","index":7,"n_rows":134,"n_cols":5,"rows_kept":134,"cut":false,"hidden":false,"merged":[]}
[]
[null,"Sources","Annual LGA accounts (collated by OLG)"]
[]
[null,null,null,"Income before supplementary valuations in 2020-21","Supplemetary valuations in 2020-21"]
[null,null,null,"Schedule 9 - Last Year Notional General Income Yield - 2021-22","Schedule 9 - Plus or minus Adjustments - 2020-21"]
[null,"Org. Id","Org. Name","C454_Item11797","C454_Item11799"]
[null,2047,"Albury",44880000,740000]
[null,2079,"Armidale Regional",19267000,30000]
[null,54,"Ballina",25646000,264000]
[null,55,"Balranald",2602000,-12000]
[null,2043,"Bathurst Regional",28452000,318000]
[null,2099,"Bayside",94139000,695000]
[null,60,"Bega Valley",25186000,120000]
[null,61,"Bellingen",8532000,4000]
[null,62,"Berrigan",5451000,16000]
[null,64,"Blacktown",184145000,4369000]
[null,65,"Bland",6879000,0]
[null,66,"Blayney",9079000,31000]
[null,67,"Blue Mountains",71455000,16000]
[null,68,"Bogan",3069000,-4000]
[null,72,"Bourke",1956000,-1000]
[null,73,"Brewarrina",1114000,0]
[null,74,"Broken Hill",16269000,-14000]
[null,75,"Burwood",26034000,96000]
[null,76,"Byron",26783000,85000]
[null,77,"Cabonne",10707000,25000]
[null,78,"Camden",61011000,1907000]
[null,79,"Campbelltown",96599000,524000]
[null,1989,"Canada Bay",40852000,369000]
[null,2080,"Canterbury Bankstown",174311000,62000]
[null,81,"Carrathool",3555000,-12000]
[null,2088,"Central Coast",175459000,474000]
[null,83,"Central Darling",857000,5000]
[null,84,"Cessnock",41197000,1142000]
[null,2037,"Clarence Valley",36566000,259000]
[null,85,"Cobar",4169000,0]
[null,86,"Coffs Harbour",48781000,225000]
[null,90,"Coolamon",2514000,11000]
[null,93,"Coonamble",4982000,-7000]
[null,2094,"Cootamundra-Gundagai Regional",7654000,26000]
[null,97,"Cowra",7161000,19000]
[null,2090,"Cumberland",101371000,0]
[null,2098,"Dubbo Regional",38455000,436000]
[null,104,"Dungog",7598000,40000]
[null,2091,"Edward River",7421000,6000]
[null,105,"Eurobodalla",31723000,135000]
[null,107,"Fairfield",87516000,413000]
[null,2092,"Federation",8254000,36000]
[null,108,"Forbes",7811000,4000]
[null,2093,"Georges River",72750000,269000]
[null,109,"Gilgandra",5209000,16000]
[null,2053,"Glen Innes Severn",7208000,-18000]
[null,2032,"Goulburn Mulwaree",21381000,311000]
[null,2049,"Greater Hume",9036000,54000]
[null,118,"Griffith",17945000,66000]
[null,120,"Gunnedah",13618000,18000]
[null,2039,"Gwydir",8237000,8000]
[null,125,"Hawkesbury",42280000,155000]
[null,126,"Hay",2483000,12000]
[null,59,"Hills",78063000,1625000]
[null,2081,"Hilltops",13745000,0]
[null,129,"Hornsby",72419000,164000]
[null,131,"Hunters Hill",9754000,-6000]
[null,2083,"Inner West",124027000,-16000]
[null,133,"Inverell",14359000,34000]
[null,135,"Junee",4185000,34000]
[null,136,"Kempsey",21325000,221000]
[null,137,"Kiama",19023000,-19000]
[null,139,"Ku-ring-gai",68889000,305000]
[null,140,"Kyogle",7547000,14000]
[null,141,"Lachlan",7983000,-4000]
[null,142,"Lake Macquarie",143501000,1799000]
[null,143,"Lane Cove",26310000,31000]
[null,144,"Leeton",7627000,0]
[null,146,"Lismore",31936000,157000]
[null,2044,"Lithgow",14265000,25000]
[null,147,"Liverpool",107662000,1258000]
[null,2040,"Liverpool Plains",7709000,1000]
[null,148,"Lockhart",2542000,11000]
[null,150,"Maitland",74342000,965000]
[null,2084,"Mid-Coast",84244000,525000]
[null,2042,"Mid-Western Regional",30041000,135000]
[null,155,"Moree Plains",24121000,20000]
[null,156,"Mosman",21096000,16000]
[null,2085,"Murray River",11046000,172000]
[null,2086,"Murrumbidgee",4438000,30000]
[null,162,"Muswellbrook",19518000,38000]
[null,163,"Nambucca Valley",11433000,101000]
[null,164,"Narrabri",13545000,16000]
[null,165,"Narrandera",5104000,-1000]
[null,166,"Narromine",6017000,8000]
[null,167,"Newcastle",164941000,1438000]
[null,168,"North Sydney",51765000,375000]
[null,2087,"Northern Beaches",173168000,477000]
[null,2045,"Oberon",4697000,20000]
[null,172,"Orange",35449000,333000]
[null,173,"Parkes",14435000,-24000]
[null,2089,"Parramatta",155184000,1130000]
[null,176,"Penrith",132655000,4728000]
[null,124,"Port Macquarie-Hastings",54025000,468000]
[null,178,"Port Stephens",45065000,385000]
[null,2095,"Queanbeyan-Palerang Regional",39278000,438000]
[null,181,"Randwick",92315000,494000]
[null,1981,"Richmond Valley",13968000,59000]
[null,184,"Ryde",75401000,819000]
[null,188,"Shellharbour",50795000,1211000]
[null,189,"Shoalhaven",79547000,567000]
[null,190,"Singleton",22644000,144000]
[null,2096,"Snowy Monaro Regional",16934000,121000]
[null,2097,"Snowy Valleys",9038000,32000]
[null,193,"Strathfield",18750000,35000]
[null,194,"Sutherland",135118000,1535000]
[null,2029,"Sydney",315285000,-931000]
[null,2038,"Tamworth Regional",38323000,314000]
[null,198,"Temora",4141000,20000]
[null,199,"Tenterfield",4715000,0]
[null,202,"Tweed",65652000,555000]
[null,2046,"Upper Hunter",11405000,8000]
[null,2035,"Upper Lachlan",7584000,177000]
[null,204,"Uralla",4021000,0]
[null,206,"Wagga Wagga",46915000,390000]
[null,208,"Walcha",3598000,1000]
[null,209,"Walgett",5805000,5000]
[null,210,"Warren",5034000,3000]
[null,2050,"Warrumbungle",8353000,-4000]
[null,212,"Waverley",47171000,183000]
[null,213,"Weddin",2902000,2000]
[null,215,"Wentworth",5462000,68000]
[null,216,"Willoughby",53052000,90000]
[null,218,"Wingecarribee",52621000,370000]
[null,219,"Wollondilly",39741000,801000]
[null,220,"Wollongong",175452000,1153000]
[null,221,"Woollahra",41423000,91000]
[null,2036,"Yass Valley",11285000,125000]

{"sheet":"Pop calcs","index":8,"n_rows":138,"n_cols":10,"rows_kept":138,"cut":false,"hidden":false,"merged":[]}
[]
[null,"Population factor calculations"]
[null,null,null,{"$f":"'Rate Peg'!D5","v":2023}]
[null,null,null,{"$f":"\"Population factor for Rate Peg from 1 July \"&D3","v":"Population factor for Rate Peg from 1 July 2023"}]
[]
[]
[]
[]
[]
[null,{"$f":"'Supp val'!B6","v":"Org. Id"},{"$f":"'Supp val'!C6","v":"Org. Name"},{"$f":"\"ERP as at 30 June \"&'ABS pop T1'!E9","v":"ERP as at 30 June 2020"},{"$f":"\"ERP as at 30 June \"&'ABS pop T1'!F9","v":"ERP as at 30 June 2021"},"Change in population (unrounded)",{"$f":"'Supp val'!D5","v":"Schedule 9 - Last Year Notional General Income Yield - 2021-22"},{"$f":"'Supp val'!E5","v":"Schedule 9 - Plus or minus Adjustments - 2020-21"},"Supplementary valuations percentage (unrounded)","Population factor (unrounded)"]
[null,{"$f":"Names!I7","v":2047},{"$f":"Names!F7","v":"Albury "},{"$f":"INDEX('ABS pop T1'!E$12:E$139,MATCH($C11,'ABS pop T1'!$H$12:$H$139,0))","v":55056},{"$f":"INDEX('ABS pop T1'!F$12:F$139,MATCH($C11,'ABS pop T1'!$H$12:$H$139,0))","v":55754},{"$f":"MAX(0,E11/D11-1)","v":1.2678000581226367E-2},{"$f":"INDEX('Supp val'!D$7:D$134,MATCH($B11,'Supp val'!$B$7:$B$134,0))","v":44880000},{"$f":"INDEX('Supp val'!E$7:E$134,MATCH($B11,'Supp val'!$B$7:$B$134,0))","v":740000},{"$f":"MAX(0,H11/G11)","v":1.6488413547237075E-2},{"$f":"MAX(0,F11-I11)","v":0}]
[null,{"$f":"Names!I8","v":2079},{"$f":"Names!F8","v":"Armidale Regional"},{"$f":"INDEX('ABS pop T1'!E$12:E$139,MATCH($C12,'ABS pop T1'!$H$12:$H$139,0))","v":29703},{"$f":"INDEX('ABS pop T1'!F$12:F$139,MATCH($C12,'ABS pop T1'!$H$12:$H$139,0))","v":29484},{"$f":"MAX(0,E12/D12-1)","v":0},{"$f":"INDEX('Supp val'!D$7:D$134,MATCH($B12,'Supp val'!$B$7:$B$134,0))","v":19267000},{"$f":"INDEX('Supp val'!E$7:E$134,MATCH($B12,'Supp val'!$B$7:$B$134,0))","v":30000},{"$f":"MAX(0,H12/G12)","v":1.5570664867389837E-3},{"$f":"MAX(0,F12-I12)","v":0}]
[null,{"$f":"Names!I9","v":54},{"$f":"Names!F9","v":"Ballina "},{"$f":"INDEX('ABS pop T1'!E$12:E$139,MATCH($C13,'ABS pop T1'!$H$12:$H$139,0))","v":45221},{"$f":"INDEX('ABS pop T1'!F$12:F$139,MATCH($C13,'ABS pop T1'!$H$12:$H$139,0))","v":45773},1.2206718117688586E-2,{"$f":"INDEX('Supp val'!D$7:D$134,MATCH($B13,'Supp val'!$B$7:$B$134,0))","v":25646000},{"$f":"INDEX('Supp val'!E$7:E$134,MATCH($B13,'Supp val'!$B$7:$B$134,0))","v":264000},1.0294002963425095E-2,1.9127151542634915E-3]
[null,{"$f":"Names!I10","v":55},{"$f":"Names!F10","v":"Balranald "},{"$f":"INDEX('ABS pop T1'!E$12:E$139,MATCH($C14,'ABS pop T1'!$H$12:$H$139,0))","v":2305},{"$f":"INDEX('ABS pop T1'!F$12:F$139,MATCH($C14,'ABS pop T1'!$H$12:$H$139,0))","v":2276},0,{"$f":"INDEX('Supp val'!D$7:D$134,MATCH($B14,'Supp val'!$B$7:$B$134,0))","v":2602000},{"$f":"INDEX('Supp val'!E$7:E$134,MATCH($B14,'Supp val'!$B$7:$B$134,0))","v":-12000},{"$f":"MAX(0,H14/G14)","v":0},0]
[null,{"$f":"Names!I11","v":2043},{"$f":"Names!F11","v":"Bathurst Regional"},{"$f":"INDEX('ABS pop T1'!E$12:E$139,MATCH($C15,'ABS pop T1'!$H$12:$H$139,0))","v":43995},{"$f":"INDEX('ABS pop T1'!F$12:F$139,MATCH($C15,'ABS pop T1'!$H$12:$H$139,0))","v":44540},1.2387771337651898E-2,{"$f":"INDEX('Supp val'!D$7:D$134,MATCH($B15,'Supp val'!$B$7:$B$134,0))","v":28452000},{"$f":"INDEX('Supp val'!E$7:E$134,MATCH($B15,'Supp val'!$B$7:$B$134,0))","v":318000},1.1176718684099536E-2,1.2110526535523622E-3]
[null,{"$f":"Names!I12","v":2099},{"$f":"Names!F12","v":"Bayside"},{"$f":"INDEX('ABS pop T1'!E$12:E$139,MATCH($C16,'ABS pop T1'!$H$12:$H$139,0))","v":181445},{"$f":"INDEX('ABS pop T1'!F$12:F$139,MATCH($C16,'ABS pop T1'!$H$12:$H$139,0))","v":182369},5.0924522582600495E-3,{"$f":"INDEX('Supp val'!D$7:D$134,MATCH($B16,'Supp val'!$B$7:$B$134,0))","v":94139000},{"$f":"INDEX('Supp val'!E$7:E$134,MATCH($B16,'Supp val'!$B$7:$B$134,0))","v":695000},7.3827000499261733E-3,0]
[null,{"$f":"Names!I13","v":60},{"$f":"Names!F13","v":"Bega Valley "},{"$f":"INDEX('ABS pop T1'!E$12:E$139,MATCH($C17,'ABS pop T1'!$H$12:$H$139,0))","v":34730},{"$f":"INDEX('ABS pop T1'!F$12:F$139,MATCH($C17,'ABS pop T1'!$H$12:$H$139,0))","v":35046},9.0987618773394896E-3,{"$f":"INDEX('Supp val'!D$7:D$134,MATCH($B17,'Supp val'!$B$7:$B$134,0))","v":25186000},{"$f":"INDEX('Supp val'!E$7:E$134,MATCH($B17,'Supp val'!$B$7:$B$134,0))","v":120000},4.7645517350909236E-3,4.334210142248566E-3]
[null,{"$f":"Names!I14","v":61},{"$f":"Names!F14","v":"Bellingen "},{"$f":"INDEX('ABS pop T1'!E$12:E$139,MATCH($C18,'ABS pop T1'!$H$12:$H$139,0))","v":13142},{"$f":"INDEX('ABS pop T1'!F$12:F$139,MATCH($C18,'ABS pop T1'!$H$12:$H$139,0))","v":13248},8.0657434180491094E-3,{"$f":"INDEX('Supp val'!D$7:D$134,MATCH($B18,'Supp val'!$B$7:$B$134,0))","v":8532000},{"$f":"INDEX('Supp val'!E$7:E$134,MATCH($B18,'Supp val'!$B$7:$B$134,0))","v":4000},4.6882325363338024E-4,7.5969201644157294E-3]
[null,{"$f":"Names!I15","v":62},{"$f":"Names!F15","v":"Berrigan "},{"$f":"INDEX('ABS pop T1'!E$12:E$139,MATCH($C19,'ABS pop T1'!$H$12:$H$139,0))","v":8785},{"$f":"INDEX('ABS pop T1'!F$12:F$139,MATCH($C19,'ABS pop T1'!$H$12:$H$139,0))","v":8810},2.845759817871274E-3,{"$f":"INDEX('Supp val'!D$7:D$134,MATCH($B19,'Supp val'!$B$7:$B$134,0))","v":5451000},{"$f":"INDEX('Supp val'!E$7:E$134,MATCH($B19,'Supp val'!$B$7:$B$134,0))","v":16000},{"$f":"MAX(0,H19/G19)","v":2.9352412401394239E-3},0]
[null,{"$f":"Names!I16","v":64},{"$f":"Names!F16","v":"Blacktown "},{"$f":"INDEX('ABS pop T1'!E$12:E$139,MATCH($C20,'ABS pop T1'!$H$12:$H$139,0))","v":382780},{"$f":"INDEX('ABS pop T1'!F$12:F$139,MATCH($C20,'ABS pop T1'!$H$12:$H$139,0))","v":387104},1.1296305972098963E-2,{"$f":"INDEX('Supp val'!D$7:D$134,MATCH($B20,'Supp val'!$B$7:$B$134,0))","v":184145000},{"$f":"INDEX('Supp val'!E$7:E$134,MATCH($B20,'Supp val'!$B$7:$B$134,0))","v":4369000},2.3725868201688885E-2,0]
[null,{"$f":"Names!I17","v":65},{"$f":"Names!F17","v":"Bland "},{"$f":"INDEX('ABS pop T1'!E$12:E$139,MATCH($C21,'ABS pop T1'!$H$12:$H$139,0))","v":5937},{"$f":"INDEX('ABS pop T1'!F$12:F$139,MATCH($C21,'ABS pop T1'!$H$12:$H$139,0))","v":5923},0,{"$f":"INDEX('Supp val'!D$7:D$134,MATCH($B21,'Supp val'!$B$7:$B$134,0))","v":6879000},{"$f":"INDEX('Supp val'!E$7:E$134,MATCH($B21,'Supp val'!$B$7:$B$134,0))","v":0},0,0]
[null,{"$f":"Names!I18","v":66},{"$f":"Names!F18","v":"Blayney "},{"$f":"INDEX('ABS pop T1'!E$12:E$139,MATCH($C22,'ABS pop T1'!$H$12:$H$139,0))","v":7382},{"$f":"INDEX('ABS pop T1'!F$12:F$139,MATCH($C22,'ABS pop T1'!$H$12:$H$139,0))","v":7408},3.522080736927613E-3,{"$f":"INDEX('Supp val'!D$7:D$134,MATCH($B22,'Supp val'!$B$7:$B$134,0))","v":9079000},{"$f":"INDEX('Supp val'!E$7:E$134,MATCH($B22,'Supp val'!$B$7:$B$134,0))","v":31000},3.4144729595770459E-3,1.0760777735056718E-4]
[null,{"$f":"Names!I19","v":67},{"$f":"Names!F19","v":"Blue Mountains "},{"$f":"INDEX('ABS pop T1'!E$12:E$139,MATCH($C23,'ABS pop T1'!$H$12:$H$139,0))","v":79195},{"$f":"INDEX('ABS pop T1'!F$12:F$139,MATCH($C23,'ABS pop T1'!$H$12:$H$139,0))","v":78740},0,{"$f":"INDEX('Supp val'!D$7:D$134,MATCH($B23,'Supp val'!$B$7:$B$134,0))","v":71455000},{"$f":"INDEX('Supp val'!E$7:E$134,MATCH($B23,'Supp val'!$B$7:$B$134,0))","v":16000},2.2391715065425791E-4,0]
[null,{"$f":"Names!I20","v":68},{"$f":"Names!F20","v":"Bogan "},{"$f":"INDEX('ABS pop T1'!E$12:E$139,MATCH($C24,'ABS pop T1'!$H$12:$H$139,0))","v":2529},{"$f":"INDEX('ABS pop T1'!F$12:F$139,MATCH($C24,'ABS pop T1'!$H$12:$H$139,0))","v":2481},0,{"$f":"INDEX('Supp val'!D$7:D$134,MATCH($B24,'Supp val'!$B$7:$B$134,0))","v":3069000},{"$f":"INDEX('Supp val'!E$7:E$134,MATCH($B24,'Supp val'!$B$7:$B$134,0))","v":-4000},0,0]
[null,{"$f":"Names!I21","v":72},{"$f":"Names!F21","v":"Bourke "},{"$f":"INDEX('ABS pop T1'!E$12:E$139,MATCH($C25,'ABS pop T1'!$H$12:$H$139,0))","v":2625},{"$f":"INDEX('ABS pop T1'!F$12:F$139,MATCH($C25,'ABS pop T1'!$H$12:$H$139,0))","v":2596},0,{"$f":"INDEX('Supp val'!D$7:D$134,MATCH($B25,'Supp val'!$B$7:$B$134,0))","v":1956000},{"$f":"INDEX('Supp val'!E$7:E$134,MATCH($B25,'Supp val'!$B$7:$B$134,0))","v":-1000},0,0]
[null,{"$f":"Names!I22","v":73},{"$f":"Names!F22","v":"Brewarrina "},{"$f":"INDEX('ABS pop T1'!E$12:E$139,MATCH($C26,'ABS pop T1'!$H$12:$H$139,0))","v":1553},{"$f":"INDEX('ABS pop T1'!F$12:F$139,MATCH($C26,'ABS pop T1'!$H$12:$H$139,0))","v":1520},0,{"$f":"INDEX('Supp val'!D$7:D$134,MATCH($B26,'Supp val'!$B$7:$B$134,0))","v":1114000},{"$f":"INDEX('Supp val'!E$7:E$134,MATCH($B26,'Supp val'!$B$7:$B$134,0))","v":0},0,0]
[null,{"$f":"Names!I23","v":74},{"$f":"Names!F23","v":"Broken Hill "},{"$f":"INDEX('ABS pop T1'!E$12:E$139,MATCH($C27,'ABS pop T1'!$H$12:$H$139,0))","v":17271},{"$f":"INDEX('ABS pop T1'!F$12:F$139,MATCH($C27,'ABS pop T1'!$H$12:$H$139,0))","v":17230},0,{"$f":"INDEX('Supp val'!D$7:D$134,MATCH($B27,'Supp val'!$B$7:$B$134,0))","v":16269000},{"$f":"INDEX('Supp val'!E$7:E$134,MATCH($B27,'Supp val'!$B$7:$B$134,0))","v":-14000},0,0]
[null,{"$f":"Names!I24","v":75},{"$f":"Names!F24","v":"Burwood"},{"$f":"INDEX('ABS pop T1'!E$12:E$139,MATCH($C28,'ABS pop T1'!$H$12:$H$139,0))","v":40861},{"$f":"INDEX('ABS pop T1'!F$12:F$139,MATCH($C28,'ABS pop T1'!$H$12:$H$139,0))","v":40686},0,{"$f":"INDEX('Supp val'!D$7:D$134,MATCH($B28,'Supp val'!$B$7:$B$134,0))","v":26034000},{"$f":"INDEX('Supp val'!E$7:E$134,MATCH($B28,'Supp val'!$B$7:$B$134,0))","v":96000},3.6874855957593914E-3,0]
[null,{"$f":"Names!I25","v":76},{"$f":"Names!F25","v":"Byron "},{"$f":"INDEX('ABS pop T1'!E$12:E$139,MATCH($C29,'ABS pop T1'!$H$12:$H$139,0))","v":35772},{"$f":"INDEX('ABS pop T1'!F$12:F$139,MATCH($C29,'ABS pop T1'!$H$12:$H$139,0))","v":36217},1.2439897126244048E-2,{"$f":"INDEX('Supp val'!D$7:D$134,MATCH($B29,'Supp val'!$B$7:$B$134,0))","v":26783000},{"$f":"INDEX('Supp val'!E$7:E$134,MATCH($B29,'Supp val'!$B$7:$B$134,0))","v":85000},3.1736549303662772E-3,9.2662421958777715E-3]
[null,{"$f":"Names!I26","v":77},{"$f":"Names!F26","v":"Cabonne"},{"$f":"INDEX('ABS pop T1'!E$12:E$139,MATCH($C30,'ABS pop T1'!$H$12:$H$139,0))","v":13678},{"$f":"INDEX('ABS pop T1'!F$12:F$139,MATCH($C30,'ABS pop T1'!$H$12:$H$139,0))","v":13759},5.9219184091241495E-3,{"$f":"INDEX('Supp val'!D$7:D$134,MATCH($B30,'Supp val'!$B$7:$B$134,0))","v":10707000},{"$f":"INDEX('Supp val'!E$7:E$134,MATCH($B30,'Supp val'!$B$7:$B$134,0))","v":25000},2.3349210796675072E-3,3.5869973294566423E-3]
[null,{"$f":"Names!I27","v":78},{"$f":"Names!F27","v":"Camden"},{"$f":"INDEX('ABS pop T1'!E$12:E$139,MATCH($C31,'ABS pop T1'!$H$12:$H$139,0))","v":107797},{"$f":"INDEX('ABS pop T1'!F$12:F$139,MATCH($C31,'ABS pop T1'!$H$12:$H$139,0))","v":114516},6.2330120504281217E-2,{"$f":"INDEX('Supp val'!D$7:D$134,MATCH($B31,'Supp val'!$B$7:$B$134,0))","v":61011000},{"$f":"INDEX('Supp val'!E$7:E$134,MATCH($B31,'Supp val'!$B$7:$B$134,0))","v":1907000},3.1256658635328054E-2,3.1073461868953163E-2]
[null,{"$f":"Names!I28","v":79},{"$f":"Names!F28","v":"Campbelltown "},{"$f":"INDEX('ABS pop T1'!E$12:E$139,MATCH($C32,'ABS pop T1'!$H$12:$H$139,0))","v":174055},{"$f":"INDEX('ABS pop T1'!F$12:F$139,MATCH($C32,'ABS pop T1'!$H$12:$H$139,0))","v":175687},9.3763465571228277E-3,{"$f":"INDEX('Supp val'!D$7:D$134,MATCH($B32,'Supp val'!$B$7:$B$134,0))","v":96599000},{"$f":"INDEX('Supp val'!E$7:E$134,MATCH($B32,'Supp val'!$B$7:$B$134,0))","v":524000},5.4244867959295645E-3,3.9518597611932632E-3]
[null,{"$f":"Names!I29","v":1989},{"$f":"Names!F29","v":"Canada Bay "},{"$f":"INDEX('ABS pop T1'!E$12:E$139,MATCH($C33,'ABS pop T1'!$H$12:$H$139,0))","v":96539},{"$f":"INDEX('ABS pop T1'!F$12:F$139,MATCH($C33,'ABS pop T1'!$H$12:$H$139,0))","v":95919},0,{"$f":"INDEX('Supp val'!D$7:D$134,MATCH($B33,'Supp val'!$B$7:$B$134,0))","v":40852000},{"$f":"INDEX('Supp val'!E$7:E$134,MATCH($B33,'Supp val'!$B$7:$B$134,0))","v":369000},9.0326055027905618E-3,0]
[null,{"$f":"Names!I30","v":2080},{"$f":"Names!F30","v":"Canterbury-Bankstown"},{"$f":"INDEX('ABS pop T1'!E$12:E$139,MATCH($C34,'ABS pop T1'!$H$12:$H$139,0))","v":380363},{"$f":"INDEX('ABS pop T1'!F$12:F$139,MATCH($C34,'ABS pop T1'!$H$12:$H$139,0))","v":378425},0,{"$f":"INDEX('Supp val'!D$7:D$134,MATCH($B34,'Supp val'!$B$7:$B$134,0))","v":174311000},{"$f":"INDEX('Supp val'!E$7:E$134,MATCH($B34,'Supp val'!$B$7:$B$134,0))","v":62000},3.5568610127874892E-4,0]
[null,{"$f":"Names!I31","v":81},{"$f":"Names!F31","v":"Carrathool "},{"$f":"INDEX('ABS pop T1'!E$12:E$139,MATCH($C35,'ABS pop T1'!$H$12:$H$139,0))","v":2796},{"$f":"INDEX('ABS pop T1'!F$12:F$139,MATCH($C35,'ABS pop T1'!$H$12:$H$139,0))","v":2789},0,{"$f":"INDEX('Supp val'!D$7:D$134,MATCH($B35,'Supp val'!$B$7:$B$134,0))","v":3555000},{"$f":"INDEX('Supp val'!E$7:E$134,MATCH($B35,'Supp val'!$B$7:$B$134,0))","v":-12000},0,0]
[null,{"$f":"Names!I32","v":2088},{"$f":"Names!F32","v":"Central Coast"},{"$f":"INDEX('ABS pop T1'!E$12:E$139,MATCH($C36,'ABS pop T1'!$H$12:$H$139,0))","v":345818},{"$f":"INDEX('ABS pop T1'!F$12:F$139,MATCH($C36,'ABS pop T1'!$H$12:$H$139,0))","v":347158},3.8748705966722419E-3,{"$f":"INDEX('Supp val'!D$7:D$134,MATCH($B36,'Supp val'!$B$7:$B$134,0))","v":175459000},{"$f":"INDEX('Supp val'!E$7:E$134,MATCH($B36,'Supp val'!$B$7:$B$134,0))","v":474000},2.7014858171994596E-3,1.1733847794727823E-3]
[null,{"$f":"Names!I33","v":83},{"$f":"Names!F33","v":"Central Darling "},{"$f":"INDEX('ABS pop T1'!E$12:E$139,MATCH($C37,'ABS pop T1'!$H$12:$H$139,0))","v":1829},{"$f":"INDEX('ABS pop T1'!F$12:F$139,MATCH($C37,'ABS pop T1'!$H$12:$H$139,0))","v":1834},2.7337342810278553E-3,{"$f":"INDEX('Supp val'!D$7:D$134,MATCH($B37,'Supp val'!$B$7:$B$134,0))","v":857000},{"$f":"INDEX('Supp val'!E$7:E$134,MATCH($B37,'Supp val'!$B$7:$B$134,0))","v":5000},5.8343057176196032E-3,0]
[null,{"$f":"Names!I34","v":84},{"$f":"Names!F34","v":"Cessnock "},{"$f":"INDEX('ABS pop T1'!E$12:E$139,MATCH($C38,'ABS pop T1'!$H$12:$H$139,0))","v":61256},{"$f":"INDEX('ABS pop T1'!F$12:F$139,MATCH($C38,'ABS pop T1'!$H$12:$H$139,0))","v":63020},2.8797179051847976E-2,{"$f":"INDEX('Supp val'!D$7:D$134,MATCH($B38,'Supp val'!$B$7:$B$134,0))","v":41197000},{"$f":"INDEX('Supp val'!E$7:E$134,MATCH($B38,'Supp val'!$B$7:$B$134,0))","v":1142000},2.7720465082408913E-2,1.0767139694390637E-3]
[null,{"$f":"Names!I35","v":2037},{"$f":"Names!F35","v":"Clarence Valley"},{"$f":"INDEX('ABS pop T1'!E$12:E$139,MATCH($C39,'ABS pop T1'!$H$12:$H$139,0))","v":51735},{"$f":"INDEX('ABS pop T1'!F$12:F$139,MATCH($C39,'ABS pop T1'!$H$12:$H$139,0))","v":52993},2.4316226925678919E-2,{"$f":"INDEX('Supp val'!D$7:D$134,MATCH($B39,'Supp val'!$B$7:$B$134,0))","v":36566000},{"$f":"INDEX('Supp val'!E$7:E$134,MATCH($B39,'Supp val'!$B$7:$B$134,0))","v":259000},7.0830826450801292E-3,1.723314428059879E-2]
[null,{"$f":"Names!I36","v":85},{"$f":"Names!F36","v":"Cobar "},{"$f":"INDEX('ABS pop T1'!E$12:E$139,MATCH($C40,'ABS pop T1'!$H$12:$H$139,0))","v":4417},{"$f":"INDEX('ABS pop T1'!F$12:F$139,MATCH($C40,'ABS pop T1'!$H$12:$H$139,0))","v":4365},0,{"$f":"INDEX('Supp val'!D$7:D$134,MATCH($B40,'Supp val'!$B$7:$B$134,0))","v":4169000},{"$f":"INDEX('Supp val'!E$7:E$134,MATCH($B40,'Supp val'!$B$7:$B$134,0))","v":0},0,0]
[null,{"$f":"Names!I37","v":86},{"$f":"Names!F37","v":"Coffs Harbour "},{"$f":"INDEX('ABS pop T1'!E$12:E$139,MATCH($C41,'ABS pop T1'!$H$12:$H$139,0))","v":77651},{"$f":"INDEX('ABS pop T1'!F$12:F$139,MATCH($C41,'ABS pop T1'!$H$12:$H$139,0))","v":78093},5.6921353234342664E-3,{"$f":"INDEX('Supp val'!D$7:D$134,MATCH($B41,'Supp val'!$B$7:$B$134,0))","v":48781000},{"$f":"INDEX('Supp val'!E$7:E$134,MATCH($B41,'Supp val'!$B$7:$B$134,0))","v":225000},4.6124515692585232E-3,1.0796837541757432E-3]
[null,{"$f":"Names!I38","v":90},{"$f":"Names!F38","v":"Coolamon "},{"$f":"INDEX('ABS pop T1'!E$12:E$139,MATCH($C42,'ABS pop T1'!$H$12:$H$139,0))","v":4291},{"$f":"INDEX('ABS pop T1'!F$12:F$139,MATCH($C42,'ABS pop T1'!$H$12:$H$139,0))","v":4304},3.029596830575576E-3,{"$f":"INDEX('Supp val'!D$7:D$134,MATCH($B42,'Supp val'!$B$7:$B$134,0))","v":2514000},{"$f":"INDEX('Supp val'!E$7:E$134,MATCH($B42,'Supp val'!$B$7:$B$134,0))","v":11000},4.3754972155926808E-3,0]
[null,{"$f":"Names!I39","v":93},{"$f":"Names!F39","v":"Coonamble "},{"$f":"INDEX('ABS pop T1'!E$12:E$139,MATCH($C43,'ABS pop T1'!$H$12:$H$139,0))","v":3907},{"$f":"INDEX('ABS pop T1'!F$12:F$139,MATCH($C43,'ABS pop T1'!$H$12:$H$139,0))","v":3854},0,{"$f":"INDEX('Supp val'!D$7:D$134,MATCH($B43,'Supp val'!$B$7:$B$134,0))","v":4982000},{"$f":"INDEX('Supp val'!E$7:E$134,MATCH($B43,'Supp val'!$B$7:$B$134,0))","v":-7000},0,0]
[null,{"$f":"Names!I40","v":2094},{"$f":"Names!F40","v":"Cootamundra-Gundagai Regional"},{"$f":"INDEX('ABS pop T1'!E$12:E$139,MATCH($C44,'ABS pop T1'!$H$12:$H$139,0))","v":11226},{"$f":"INDEX('ABS pop T1'!F$12:F$139,MATCH($C44,'ABS pop T1'!$H$12:$H$139,0))","v":11169},0,{"$f":"INDEX('Supp val'!D$7:D$134,MATCH($B44,'Supp val'!$B$7:$B$134,0))","v":7654000},{"$f":"INDEX('Supp val'!E$7:E$134,MATCH($B44,'Supp val'!$B$7:$B$134,0))","v":26000},3.3969166448915601E-3,0]
[null,{"$f":"Names!I41","v":97},{"$f":"Names!F41","v":"Cowra "},{"$f":"INDEX('ABS pop T1'!E$12:E$139,MATCH($C45,'ABS pop T1'!$H$12:$H$139,0))","v":12732},{"$f":"INDEX('ABS pop T1'!F$12:F$139,MATCH($C45,'ABS pop T1'!$H$12:$H$139,0))","v":12785},4.1627395538799128E-3,{"$f":"INDEX('Supp val'!D$7:D$134,MATCH($B45,'Supp val'!$B$7:$B$134,0))","v":7161000},{"$f":"INDEX('Supp val'!E$7:E$134,MATCH($B45,'Supp val'!$B$7:$B$134,0))","v":19000},2.6532607177768468E-3,1.509478836103066E-3]
[null,{"$f":"Names!I42","v":2090},{"$f":"Names!F42","v":"Cumberland"},{"$f":"INDEX('ABS pop T1'!E$12:E$139,MATCH($C46,'ABS pop T1'!$H$12:$H$139,0))","v":242630},{"$f":"INDEX('ABS pop T1'!F$12:F$139,MATCH($C46,'ABS pop T1'!$H$12:$H$139,0))","v":239834},0,{"$f":"INDEX('Supp val'!D$7:D$134,MATCH($B46,'Supp val'!$B$7:$B$134,0))","v":101371000},{"$f":"INDEX('Supp val'!E$7:E$134,MATCH($B46,'Supp val'!$B$7:$B$134,0))","v":0},0,0]
[null,{"$f":"Names!I43","v":2098},{"$f":"Names!F43","v":"Dubbo Regional"},{"$f":"INDEX('ABS pop T1'!E$12:E$139,MATCH($C47,'ABS pop T1'!$H$12:$H$139,0))","v":54043},{"$f":"INDEX('ABS pop T1'!F$12:F$139,MATCH($C47,'ABS pop T1'!$H$12:$H$139,0))","v":54195},2.8125751716225889E-3,{"$f":"INDEX('Supp val'!D$7:D$134,MATCH($B47,'Supp val'!$B$7:$B$134,0))","v":38455000},{"$f":"INDEX('Supp val'!E$7:E$134,MATCH($B47,'Supp val'!$B$7:$B$134,0))","v":436000},1.1337927447666103E-2,0]
[null,{"$f":"Names!I44","v":104},{"$f":"Names!F44","v":"Dungog "},{"$f":"INDEX('ABS pop T1'!E$12:E$139,MATCH($C48,'ABS pop T1'!$H$12:$H$139,0))","v":9664},{"$f":"INDEX('ABS pop T1'!F$12:F$139,MATCH($C48,'ABS pop T1'!$H$12:$H$139,0))","v":9784},1.2417218543046449E-2,{"$f":"INDEX('Supp val'!D$7:D$134,MATCH($B48,'Supp val'!$B$7:$B$134,0))","v":7598000},{"$f":"INDEX('Supp val'!E$7:E$134,MATCH($B48,'Supp val'!$B$7:$B$134,0))","v":40000},5.2645433008686494E-3,7.1526752421777993E-3]
[null,{"$f":"Names!I45","v":2091},{"$f":"Names!F45","v":"Edward River"},{"$f":"INDEX('ABS pop T1'!E$12:E$139,MATCH($C49,'ABS pop T1'!$H$12:$H$139,0))","v":9084},{"$f":"INDEX('ABS pop T1'!F$12:F$139,MATCH($C49,'ABS pop T1'!$H$12:$H$139,0))","v":9158},8.1461911052400637E-3,{"$f":"INDEX('Supp val'!D$7:D$134,MATCH($B49,'Supp val'!$B$7:$B$134,0))","v":7421000},{"$f":"INDEX('Supp val'!E$7:E$134,MATCH($B49,'Supp val'!$B$7:$B$134,0))","v":6000},8.0851637245654229E-4,7.3376747327835211E-3]
[null,{"$f":"Names!I46","v":105},{"$f":"Names!F46","v":"Eurobodalla "},{"$f":"INDEX('ABS pop T1'!E$12:E$139,MATCH($C50,'ABS pop T1'!$H$12:$H$139,0))","v":38957},{"$f":"INDEX('ABS pop T1'!F$12:F$139,MATCH($C50,'ABS pop T1'!$H$12:$H$139,0))","v":39362},1.039607772672424E-2,{"$f":"INDEX('Supp val'!D$7:D$134,MATCH($B50,'Supp val'!$B$7:$B$134,0))","v":31723000},{"$f":"INDEX('Supp val'!E$7:E$134,MATCH($B50,'Supp val'!$B$7:$B$134,0))","v":135000},4.2555874286795067E-3,6.1404902980447332E-3]
[null,{"$f":"Names!I47","v":107},{"$f":"Names!F47","v":"Fairfield "},{"$f":"INDEX('ABS pop T1'!E$12:E$139,MATCH($C51,'ABS pop T1'!$H$12:$H$139,0))","v":210809},{"$f":"INDEX('ABS pop T1'!F$12:F$139,MATCH($C51,'ABS pop T1'!$H$12:$H$139,0))","v":207922},0,{"$f":"INDEX('Supp val'!D$7:D$134,MATCH($B51,'Supp val'!$B$7:$B$134,0))","v":87516000},{"$f":"INDEX('Supp val'!E$7:E$134,MATCH($B51,'Supp val'!$B$7:$B$134,0))","v":413000},4.7191370720782487E-3,0]
[null,{"$f":"Names!I48","v":2092},{"$f":"Names!F48","v":"Federation"},{"$f":"INDEX('ABS pop T1'!E$12:E$139,MATCH($C52,'ABS pop T1'!$H$12:$H$139,0))","v":12600},{"$f":"INDEX('ABS pop T1'!F$12:F$139,MATCH($C52,'ABS pop T1'!$H$12:$H$139,0))","v":12735},1.0714285714285676E-2,{"$f":"INDEX('Supp val'!D$7:D$134,MATCH($B52,'Supp val'!$B$7:$B$134,0))","v":8254000},{"$f":"INDEX('Supp val'!E$7:E$134,MATCH($B52,'Supp val'!$B$7:$B$134,0))","v":36000},4.3615216864550518E-3,6.3527640278306244E-3]
[null,{"$f":"Names!I49","v":108},{"$f":"Names!F49","v":"Forbes "},{"$f":"INDEX('ABS pop T1'!E$12:E$139,MATCH($C53,'ABS pop T1'!$H$12:$H$139,0))","v":9921},{"$f":"INDEX('ABS pop T1'!F$12:F$139,MATCH($C53,'ABS pop T1'!$H$12:$H$139,0))","v":9934},1.310351779054475E-3,{"$f":"INDEX('Supp val'!D$7:D$134,MATCH($B53,'Supp val'!$B$7:$B$134,0))","v":7811000},{"$f":"INDEX('Supp val'!E$7:E$134,MATCH($B53,'Supp val'!$B$7:$B$134,0))","v":4000},5.1209832287799257E-4,7.982534561764824E-4]
[null,{"$f":"Names!I50","v":2093},{"$f":"Names!F50","v":"Georges River"},{"$f":"INDEX('ABS pop T1'!E$12:E$139,MATCH($C54,'ABS pop T1'!$H$12:$H$139,0))","v":160253},{"$f":"INDEX('ABS pop T1'!F$12:F$139,MATCH($C54,'ABS pop T1'!$H$12:$H$139,0))","v":159266},0,{"$f":"INDEX('Supp val'!D$7:D$134,MATCH($B54,'Supp val'!$B$7:$B$134,0))","v":72750000},{"$f":"INDEX('Supp val'!E$7:E$134,MATCH($B54,'Supp val'!$B$7:$B$134,0))","v":269000},3.6975945017182132E-3,0]
[null,{"$f":"Names!I51","v":109},{"$f":"Names!F51","v":"Gilgandra "},{"$f":"INDEX('ABS pop T1'!E$12:E$139,MATCH($C55,'ABS pop T1'!$H$12:$H$139,0))","v":4229},{"$f":"INDEX('ABS pop T1'!F$12:F$139,MATCH($C55,'ABS pop T1'!$H$12:$H$139,0))","v":4205},0,{"$f":"INDEX('Supp val'!D$7:D$134,MATCH($B55,'Supp val'!$B$7:$B$134,0))","v":5209000},{"$f":"INDEX('Supp val'!E$7:E$134,MATCH($B55,'Supp val'!$B$7:$B$134,0))","v":16000},3.0716068343252063E-3,0]
[null,{"$f":"Names!I52","v":2053},{"$f":"Names!F52","v":"Glen Innes Severn"},{"$f":"INDEX('ABS pop T1'!E$12:E$139,MATCH($C56,'ABS pop T1'!$H$12:$H$139,0))","v":8874},{"$f":"INDEX('ABS pop T1'!F$12:F$139,MATCH($C56,'ABS pop T1'!$H$12:$H$139,0))","v":8816},0,{"$f":"INDEX('Supp val'!D$7:D$134,MATCH($B56,'Supp val'!$B$7:$B$134,0))","v":7208000},{"$f":"INDEX('Supp val'!E$7:E$134,MATCH($B56,'Supp val'!$B$7:$B$134,0))","v":-18000},0,0]
[null,{"$f":"Names!I53","v":2032},{"$f":"Names!F53","v":"Goulburn Mulwaree"},{"$f":"INDEX('ABS pop T1'!E$12:E$139,MATCH($C57,'ABS pop T1'!$H$12:$H$139,0))","v":31554},{"$f":"INDEX('ABS pop T1'!F$12:F$139,MATCH($C57,'ABS pop T1'!$H$12:$H$139,0))","v":31796},7.6693921531343356E-3,{"$f":"INDEX('Supp val'!D$7:D$134,MATCH($B57,'Supp val'!$B$7:$B$134,0))","v":21381000},{"$f":"INDEX('Supp val'!E$7:E$134,MATCH($B57,'Supp val'!$B$7:$B$134,0))","v":311000},1.4545624619989711E-2,0]
[null,{"$f":"Names!I54","v":2049},{"$f":"Names!F54","v":"Greater Hume "},{"$f":"INDEX('ABS pop T1'!E$12:E$139,MATCH($C58,'ABS pop T1'!$H$12:$H$139,0))","v":10842},{"$f":"INDEX('ABS pop T1'!F$12:F$139,MATCH($C58,'ABS pop T1'!$H$12:$H$139,0))","v":11020},1.6417635122671026E-2,{"$f":"INDEX('Supp val'!D$7:D$134,MATCH($B58,'Supp val'!$B$7:$B$134,0))","v":9036000},{"$f":"INDEX('Supp val'!E$7:E$134,MATCH($B58,'Supp val'!$B$7:$B$134,0))","v":54000},5.9760956175298804E-3,1.0441539505141146E-2]
[null,{"$f":"Names!I55","v":118},{"$f":"Names!F55","v":"Griffith "},{"$f":"INDEX('ABS pop T1'!E$12:E$139,MATCH($C59,'ABS pop T1'!$H$12:$H$139,0))","v":27154},{"$f":"INDEX('ABS pop T1'!F$12:F$139,MATCH($C59,'ABS pop T1'!$H$12:$H$139,0))","v":27173},6.9971274950275664E-4,{"$f":"INDEX('Supp val'!D$7:D$134,MATCH($B59,'Supp val'!$B$7:$B$134,0))","v":17945000},{"$f":"INDEX('Supp val'!E$7:E$134,MATCH($B59,'Supp val'!$B$7:$B$134,0))","v":66000},3.6779047088325439E-3,0]
[null,{"$f":"Names!I56","v":120},{"$f":"Names!F56","v":"Gunnedah "},{"$f":"INDEX('ABS pop T1'!E$12:E$139,MATCH($C60,'ABS pop T1'!$H$12:$H$139,0))","v":12689},{"$f":"INDEX('ABS pop T1'!F$12:F$139,MATCH($C60,'ABS pop T1'!$H$12:$H$139,0))","v":12713},1.8914020017337663E-3,{"$f":"INDEX('Supp val'!D$7:D$134,MATCH($B60,'Supp val'!$B$7:$B$134,0))","v":13618000},{"$f":"INDEX('Supp val'!E$7:E$134,MATCH($B60,'Supp val'!$B$7:$B$134,0))","v":18000},1.3217799970627112E-3,5.6962200467105509E-4]
[null,{"$f":"Names!I57","v":2039},{"$f":"Names!F57","v":"Gwydir "},{"$f":"INDEX('ABS pop T1'!E$12:E$139,MATCH($C61,'ABS pop T1'!$H$12:$H$139,0))","v":5299},{"$f":"INDEX('ABS pop T1'!F$12:F$139,MATCH($C61,'ABS pop T1'!$H$12:$H$139,0))","v":5323},4.529156444612159E-3,{"$f":"INDEX('Supp val'!D$7:D$134,MATCH($B61,'Supp val'!$B$7:$B$134,0))","v":8237000},{"$f":"INDEX('Supp val'!E$7:E$134,MATCH($B61,'Supp val'!$B$7:$B$134,0))","v":8000},9.7122738861235884E-4,3.5579290559998003E-3]
[null,{"$f":"Names!I58","v":125},{"$f":"Names!F58","v":"Hawkesbury "},{"$f":"INDEX('ABS pop T1'!E$12:E$139,MATCH($C62,'ABS pop T1'!$H$12:$H$139,0))","v":67745},{"$f":"INDEX('ABS pop T1'!F$12:F$139,MATCH($C62,'ABS pop T1'!$H$12:$H$139,0))","v":68009},3.8969665657981878E-3,{"$f":"INDEX('Supp val'!D$7:D$134,MATCH($B62,'Supp val'!$B$7:$B$134,0))","v":42280000},{"$f":"INDEX('Supp val'!E$7:E$134,MATCH($B62,'Supp val'!$B$7:$B$134,0))","v":155000},3.6660359508041626E-3,2.3093061499402517E-4]
[null,{"$f":"Names!I59","v":126},{"$f":"Names!F59","v":"Hay "},{"$f":"INDEX('ABS pop T1'!E$12:E$139,MATCH($C63,'ABS pop T1'!$H$12:$H$139,0))","v":2944},{"$f":"INDEX('ABS pop T1'!F$12:F$139,MATCH($C63,'ABS pop T1'!$H$12:$H$139,0))","v":2945},3.3967391304345895E-4,{"$f":"INDEX('Supp val'!D$7:D$134,MATCH($B63,'Supp val'!$B$7:$B$134,0))","v":2483000},{"$f":"INDEX('Supp val'!E$7:E$134,MATCH($B63,'Supp val'!$B$7:$B$134,0))","v":12000},4.8328634716069269E-3,0]
[null,{"$f":"Names!I60","v":2081},{"$f":"Names!F60","v":"Hilltops"},{"$f":"INDEX('ABS pop T1'!E$12:E$139,MATCH($C64,'ABS pop T1'!$H$12:$H$139,0))","v":18618},{"$f":"INDEX('ABS pop T1'!F$12:F$139,MATCH($C64,'ABS pop T1'!$H$12:$H$139,0))","v":18553},0,{"$f":"INDEX('Supp val'!D$7:D$134,MATCH($B64,'Supp val'!$B$7:$B$134,0))","v":13745000},{"$f":"INDEX('Supp val'!E$7:E$134,MATCH($B64,'Supp val'!$B$7:$B$134,0))","v":0},0,0]
[null,{"$f":"Names!I61","v":129},{"$f":"Names!F61","v":"Hornsby "},{"$f":"INDEX('ABS pop T1'!E$12:E$139,MATCH($C65,'ABS pop T1'!$H$12:$H$139,0))","v":152412},{"$f":"INDEX('ABS pop T1'!F$12:F$139,MATCH($C65,'ABS pop T1'!$H$12:$H$139,0))","v":150698},0,{"$f":"INDEX('Supp val'!D$7:D$134,MATCH($B65,'Supp val'!$B$7:$B$134,0))","v":72419000},{"$f":"INDEX('Supp val'!E$7:E$134,MATCH($B65,'Supp val'!$B$7:$B$134,0))","v":164000},2.2645990693050165E-3,0]
[null,{"$f":"Names!I62","v":131},{"$f":"Names!F62","v":"Hunters Hill "},{"$f":"INDEX('ABS pop T1'!E$12:E$139,MATCH($C66,'ABS pop T1'!$H$12:$H$139,0))","v":14963},{"$f":"INDEX('ABS pop T1'!F$12:F$139,MATCH($C66,'ABS pop T1'!$H$12:$H$139,0))","v":14861},0,{"$f":"INDEX('Supp val'!D$7:D$134,MATCH($B66,'Supp val'!$B$7:$B$134,0))","v":9754000},{"$f":"INDEX('Supp val'!E$7:E$134,MATCH($B66,'Supp val'!$B$7:$B$134,0))","v":-6000},0,0]
[null,{"$f":"Names!I63","v":2083},{"$f":"Names!F63","v":"Inner West"},{"$f":"INDEX('ABS pop T1'!E$12:E$139,MATCH($C67,'ABS pop T1'!$H$12:$H$139,0))","v":201857},{"$f":"INDEX('ABS pop T1'!F$12:F$139,MATCH($C67,'ABS pop T1'!$H$12:$H$139,0))","v":199759},0,{"$f":"INDEX('Supp val'!D$7:D$134,MATCH($B67,'Supp val'!$B$7:$B$134,0))","v":124027000},{"$f":"INDEX('Supp val'!E$7:E$134,MATCH($B67,'Supp val'!$B$7:$B$134,0))","v":-16000},0,0]
[null,{"$f":"Names!I64","v":133},{"$f":"Names!F64","v":"Inverell "},{"$f":"INDEX('ABS pop T1'!E$12:E$139,MATCH($C68,'ABS pop T1'!$H$12:$H$139,0))","v":17781},{"$f":"INDEX('ABS pop T1'!F$12:F$139,MATCH($C68,'ABS pop T1'!$H$12:$H$139,0))","v":17696},0,{"$f":"INDEX('Supp val'!D$7:D$134,MATCH($B68,'Supp val'!$B$7:$B$134,0))","v":14359000},{"$f":"INDEX('Supp val'!E$7:E$134,MATCH($B68,'Supp val'!$B$7:$B$134,0))","v":34000},2.3678529145483669E-3,0]
[null,{"$f":"Names!I65","v":135},{"$f":"Names!F65","v":"Junee "},{"$f":"INDEX('ABS pop T1'!E$12:E$139,MATCH($C69,'ABS pop T1'!$H$12:$H$139,0))","v":6676},{"$f":"INDEX('ABS pop T1'!F$12:F$139,MATCH($C69,'ABS pop T1'!$H$12:$H$139,0))","v":6738},9.2869982025165498E-3,{"$f":"INDEX('Supp val'!D$7:D$134,MATCH($B69,'Supp val'!$B$7:$B$134,0))","v":4185000},{"$f":"INDEX('Supp val'!E$7:E$134,MATCH($B69,'Supp val'!$B$7:$B$134,0))","v":34000},8.1242532855436075E-3,1.1627449169729423E-3]
[null,{"$f":"Names!I66","v":136},{"$f":"Names!F66","v":"Kempsey "},{"$f":"INDEX('ABS pop T1'!E$12:E$139,MATCH($C70,'ABS pop T1'!$H$12:$H$139,0))","v":29922},{"$f":"INDEX('ABS pop T1'!F$12:F$139,MATCH($C70,'ABS pop T1'!$H$12:$H$139,0))","v":30092},5.6814384065235757E-3,{"$f":"INDEX('Supp val'!D$7:D$134,MATCH($B70,'Supp val'!$B$7:$B$134,0))","v":21325000},{"$f":"INDEX('Supp val'!E$7:E$134,MATCH($B70,'Supp val'!$B$7:$B$134,0))","v":221000},1.0363423212192262E-2,0]
[null,{"$f":"Names!I67","v":137},{"$f":"Names!F67","v":"Kiama "},{"$f":"INDEX('ABS pop T1'!E$12:E$139,MATCH($C71,'ABS pop T1'!$H$12:$H$139,0))","v":23685},{"$f":"INDEX('ABS pop T1'!F$12:F$139,MATCH($C71,'ABS pop T1'!$H$12:$H$139,0))","v":24006},1.3552881570614295E-2,{"$f":"INDEX('Supp val'!D$7:D$134,MATCH($B71,'Supp val'!$B$7:$B$134,0))","v":19023000},{"$f":"INDEX('Supp val'!E$7:E$134,MATCH($B71,'Supp val'!$B$7:$B$134,0))","v":-19000},0,1.3552881570614295E-2]
[null,{"$f":"Names!I68","v":139},{"$f":"Names!F68","v":"Ku-ring-gai"},{"$f":"INDEX('ABS pop T1'!E$12:E$139,MATCH($C72,'ABS pop T1'!$H$12:$H$139,0))","v":127598},{"$f":"INDEX('ABS pop T1'!F$12:F$139,MATCH($C72,'ABS pop T1'!$H$12:$H$139,0))","v":126554},0,{"$f":"INDEX('Supp val'!D$7:D$134,MATCH($B72,'Supp val'!$B$7:$B$134,0))","v":68889000},{"$f":"INDEX('Supp val'!E$7:E$134,MATCH($B72,'Supp val'!$B$7:$B$134,0))","v":305000},4.4274122138512678E-3,0]
[null,{"$f":"Names!I69","v":140},{"$f":"Names!F69","v":"Kyogle"},{"$f":"INDEX('ABS pop T1'!E$12:E$139,MATCH($C73,'ABS pop T1'!$H$12:$H$139,0))","v":8789},{"$f":"INDEX('ABS pop T1'!F$12:F$139,MATCH($C73,'ABS pop T1'!$H$12:$H$139,0))","v":8841},5.9164865172374181E-3,{"$f":"INDEX('Supp val'!D$7:D$134,MATCH($B73,'Supp val'!$B$7:$B$134,0))","v":7547000},{"$f":"INDEX('Supp val'!E$7:E$134,MATCH($B73,'Supp val'!$B$7:$B$134,0))","v":14000},1.855041738439115E-3,4.0614447787983027E-3]
[null,{"$f":"Names!I70","v":141},{"$f":"Names!F70","v":"Lachlan "},{"$f":"INDEX('ABS pop T1'!E$12:E$139,MATCH($C74,'ABS pop T1'!$H$12:$H$139,0))","v":6089},{"$f":"INDEX('ABS pop T1'!F$12:F$139,MATCH($C74,'ABS pop T1'!$H$12:$H$139,0))","v":6025},0,{"$f":"INDEX('Supp val'!D$7:D$134,MATCH($B74,'Supp val'!$B$7:$B$134,0))","v":7983000},{"$f":"INDEX('Supp val'!E$7:E$134,MATCH($B74,'Supp val'!$B$7:$B$134,0))","v":-4000},0,0]
[null,{"$f":"Names!I71","v":142},{"$f":"Names!F71","v":"Lake Macquarie "},{"$f":"INDEX('ABS pop T1'!E$12:E$139,MATCH($C75,'ABS pop T1'!$H$12:$H$139,0))","v":207783},{"$f":"INDEX('ABS pop T1'!F$12:F$139,MATCH($C75,'ABS pop T1'!$H$12:$H$139,0))","v":210031},1.0818979416025387E-2,{"$f":"INDEX('Supp val'!D$7:D$134,MATCH($B75,'Supp val'!$B$7:$B$134,0))","v":143501000},{"$f":"INDEX('Supp val'!E$7:E$134,MATCH($B75,'Supp val'!$B$7:$B$134,0))","v":1799000},1.2536498003498233E-2,0]
[null,{"$f":"Names!I72","v":143},{"$f":"Names!F72","v":"Lane Cove "},{"$f":"INDEX('ABS pop T1'!E$12:E$139,MATCH($C76,'ABS pop T1'!$H$12:$H$139,0))","v":40527},{"$f":"INDEX('ABS pop T1'!F$12:F$139,MATCH($C76,'ABS pop T1'!$H$12:$H$139,0))","v":40336},{"$f":"MAX(0,E76/D76-1)","v":0},{"$f":"INDEX('Supp val'!D$7:D$134,MATCH($B76,'Supp val'!$B$7:$B$134,0))","v":26310000},{"$f":"INDEX('Supp val'!E$7:E$134,MATCH($B76,'Supp val'!$B$7:$B$134,0))","v":31000},{"$f":"MAX(0,H76/G76)","v":1.1782592170277461E-3},{"$f":"MAX(0,F76-I76)","v":0}]
[null,{"$f":"Names!I73","v":144},{"$f":"Names!F73","v":"Leeton "},{"$f":"INDEX('ABS pop T1'!E$12:E$139,MATCH($C77,'ABS pop T1'!$H$12:$H$139,0))","v":11344},{"$f":"INDEX('ABS pop T1'!F$12:F$139,MATCH($C77,'ABS pop T1'!$H$12:$H$139,0))","v":11242},0,{"$f":"INDEX('Supp val'!D$7:D$134,MATCH($B77,'Supp val'!$B$7:$B$134,0))","v":7627000},{"$f":"INDEX('Supp val'!E$7:E$134,MATCH($B77,'Supp val'!$B$7:$B$134,0))","v":0},0,0]
[null,{"$f":"Names!I74","v":146},{"$f":"Names!F74","v":"Lismore "},{"$f":"INDEX('ABS pop T1'!E$12:E$139,MATCH($C78,'ABS pop T1'!$H$12:$H$139,0))","v":43668},{"$f":"INDEX('ABS pop T1'!F$12:F$139,MATCH($C78,'ABS pop T1'!$H$12:$H$139,0))","v":43790},2.7938078226619201E-3,{"$f":"INDEX('Supp val'!D$7:D$134,MATCH($B78,'Supp val'!$B$7:$B$134,0))","v":31936000},{"$f":"INDEX('Supp val'!E$7:E$134,MATCH($B78,'Supp val'!$B$7:$B$134,0))","v":157000},4.916082164328657E-3,0]
[null,{"$f":"Names!I75","v":2044},{"$f":"Names!F75","v":"Lithgow "},{"$f":"INDEX('ABS pop T1'!E$12:E$139,MATCH($C79,'ABS pop T1'!$H$12:$H$139,0))","v":21518},{"$f":"INDEX('ABS pop T1'!F$12:F$139,MATCH($C79,'ABS pop T1'!$H$12:$H$139,0))","v":21556},1.7659633794961938E-3,{"$f":"INDEX('Supp val'!D$7:D$134,MATCH($B79,'Supp val'!$B$7:$B$134,0))","v":14265000},{"$f":"INDEX('Supp val'!E$7:E$134,MATCH($B79,'Supp val'!$B$7:$B$134,0))","v":25000},1.7525411847178409E-3,1.3422194778352865E-5]
[null,{"$f":"Names!I76","v":147},{"$f":"Names!F76","v":"Liverpool "},{"$f":"INDEX('ABS pop T1'!E$12:E$139,MATCH($C80,'ABS pop T1'!$H$12:$H$139,0))","v":231268},{"$f":"INDEX('ABS pop T1'!F$12:F$139,MATCH($C80,'ABS pop T1'!$H$12:$H$139,0))","v":234917},1.577823131604883E-2,{"$f":"INDEX('Supp val'!D$7:D$134,MATCH($B80,'Supp val'!$B$7:$B$134,0))","v":107662000},{"$f":"INDEX('Supp val'!E$7:E$134,MATCH($B80,'Supp val'!$B$7:$B$134,0))","v":1258000},1.1684716984637106E-2,4.0935143314117239E-3]
[null,{"$f":"Names!I77","v":2040},{"$f":"Names!F77","v":"Liverpool Plains "},{"$f":"INDEX('ABS pop T1'!E$12:E$139,MATCH($C81,'ABS pop T1'!$H$12:$H$139,0))","v":7853},{"$f":"INDEX('ABS pop T1'!F$12:F$139,MATCH($C81,'ABS pop T1'!$H$12:$H$139,0))","v":7848},0,{"$f":"INDEX('Supp val'!D$7:D$134,MATCH($B81,'Supp val'!$B$7:$B$134,0))","v":7709000},{"$f":"INDEX('Supp val'!E$7:E$134,MATCH($B81,'Supp val'!$B$7:$B$134,0))","v":1000},1.2971851083149564E-4,0]
[null,{"$f":"Names!I78","v":148},{"$f":"Names!F78","v":"Lockhart "},{"$f":"INDEX('ABS pop T1'!E$12:E$139,MATCH($C82,'ABS pop T1'!$H$12:$H$139,0))","v":3260},{"$f":"INDEX('ABS pop T1'!F$12:F$139,MATCH($C82,'ABS pop T1'!$H$12:$H$139,0))","v":3221},0,{"$f":"INDEX('Supp val'!D$7:D$134,MATCH($B82,'Supp val'!$B$7:$B$134,0))","v":2542000},{"$f":"INDEX('Supp val'!E$7:E$134,MATCH($B82,'Supp val'!$B$7:$B$134,0))","v":11000},4.3273013375295048E-3,0]
[null,{"$f":"Names!I79","v":150},{"$f":"Names!F79","v":"Maitland "},{"$f":"INDEX('ABS pop T1'!E$12:E$139,MATCH($C83,'ABS pop T1'!$H$12:$H$139,0))","v":87393},{"$f":"INDEX('ABS pop T1'!F$12:F$139,MATCH($C83,'ABS pop T1'!$H$12:$H$139,0))","v":90449},3.4968475736042892E-2,{"$f":"INDEX('Supp val'!D$7:D$134,MATCH($B83,'Supp val'!$B$7:$B$134,0))","v":74342000},{"$f":"INDEX('Supp val'!E$7:E$134,MATCH($B83,'Supp val'!$B$7:$B$134,0))","v":965000},1.2980549352990233E-2,2.1987926383052657E-2]
[null,{"$f":"Names!I80","v":2084},{"$f":"Names!F80","v":"Mid-Coast"},{"$f":"INDEX('ABS pop T1'!E$12:E$139,MATCH($C84,'ABS pop T1'!$H$12:$H$139,0))","v":94407},{"$f":"INDEX('ABS pop T1'!F$12:F$139,MATCH($C84,'ABS pop T1'!$H$12:$H$139,0))","v":95209},8.4951327761713102E-3,{"$f":"INDEX('Supp val'!D$7:D$134,MATCH($B84,'Supp val'!$B$7:$B$134,0))","v":84244000},{"$f":"INDEX('Supp val'!E$7:E$134,MATCH($B84,'Supp val'!$B$7:$B$134,0))","v":525000},6.2318978206163051E-3,2.2632349555550052E-3]
[null,{"$f":"Names!I81","v":2042},{"$f":"Names!F81","v":"Mid-Western Regional"},{"$f":"INDEX('ABS pop T1'!E$12:E$139,MATCH($C85,'ABS pop T1'!$H$12:$H$139,0))","v":25367},{"$f":"INDEX('ABS pop T1'!F$12:F$139,MATCH($C85,'ABS pop T1'!$H$12:$H$139,0))","v":25563},7.7265738952181362E-3,{"$f":"INDEX('Supp val'!D$7:D$134,MATCH($B85,'Supp val'!$B$7:$B$134,0))","v":30041000},{"$f":"INDEX('Supp val'!E$7:E$134,MATCH($B85,'Supp val'!$B$7:$B$134,0))","v":135000},4.4938583935288439E-3,3.2327155016892923E-3]
[null,{"$f":"Names!I82","v":155},{"$f":"Names!F82","v":"Moree Plains "},{"$f":"INDEX('ABS pop T1'!E$12:E$139,MATCH($C86,'ABS pop T1'!$H$12:$H$139,0))","v":13077},{"$f":"INDEX('ABS pop T1'!F$12:F$139,MATCH($C86,'ABS pop T1'!$H$12:$H$139,0))","v":12988},0,{"$f":"INDEX('Supp val'!D$7:D$134,MATCH($B86,'Supp val'!$B$7:$B$134,0))","v":24121000},{"$f":"INDEX('Supp val'!E$7:E$134,MATCH($B86,'Supp val'!$B$7:$B$134,0))","v":20000},8.2915302018987604E-4,0]
[null,{"$f":"Names!I83","v":156},{"$f":"Names!F83","v":"Mosman "},{"$f":"INDEX('ABS pop T1'!E$12:E$139,MATCH($C87,'ABS pop T1'!$H$12:$H$139,0))","v":30783},{"$f":"INDEX('ABS pop T1'!F$12:F$139,MATCH($C87,'ABS pop T1'!$H$12:$H$139,0))","v":30122},0,{"$f":"INDEX('Supp val'!D$7:D$134,MATCH($B87,'Supp val'!$B$7:$B$134,0))","v":21096000},{"$f":"INDEX('Supp val'!E$7:E$134,MATCH($B87,'Supp val'!$B$7:$B$134,0))","v":16000},7.5843761850587785E-4,0]
[null,{"$f":"Names!I84","v":2085},{"$f":"Names!F84","v":"Murray River"},{"$f":"INDEX('ABS pop T1'!E$12:E$139,MATCH($C88,'ABS pop T1'!$H$12:$H$139,0))","v":12330},{"$f":"INDEX('ABS pop T1'!F$12:F$139,MATCH($C88,'ABS pop T1'!$H$12:$H$139,0))","v":12571},1.9545823195458167E-2,{"$f":"INDEX('Supp val'!D$7:D$134,MATCH($B88,'Supp val'!$B$7:$B$134,0))","v":11046000},{"$f":"INDEX('Supp val'!E$7:E$134,MATCH($B88,'Supp val'!$B$7:$B$134,0))","v":172000},1.5571247510411008E-2,3.9745756850471589E-3]
[null,{"$f":"Names!I85","v":2086},{"$f":"Names!F85","v":"Murrumbidgee"},{"$f":"INDEX('ABS pop T1'!E$12:E$139,MATCH($C89,'ABS pop T1'!$H$12:$H$139,0))","v":3916},{"$f":"INDEX('ABS pop T1'!F$12:F$139,MATCH($C89,'ABS pop T1'!$H$12:$H$139,0))","v":3871},0,{"$f":"INDEX('Supp val'!D$7:D$134,MATCH($B89,'Supp val'!$B$7:$B$134,0))","v":4438000},{"$f":"INDEX('Supp val'!E$7:E$134,MATCH($B89,'Supp val'!$B$7:$B$134,0))","v":30000},6.7598017124831005E-3,0]
[null,{"$f":"Names!I86","v":162},{"$f":"Names!F86","v":"Muswellbrook "},{"$f":"INDEX('ABS pop T1'!E$12:E$139,MATCH($C90,'ABS pop T1'!$H$12:$H$139,0))","v":16355},{"$f":"INDEX('ABS pop T1'!F$12:F$139,MATCH($C90,'ABS pop T1'!$H$12:$H$139,0))","v":16212},0,{"$f":"INDEX('Supp val'!D$7:D$134,MATCH($B90,'Supp val'!$B$7:$B$134,0))","v":19518000},{"$f":"INDEX('Supp val'!E$7:E$134,MATCH($B90,'Supp val'!$B$7:$B$134,0))","v":38000},1.9469207910646582E-3,0]
[null,{"$f":"Names!I87","v":163},{"$f":"Names!F87","v":"Nambucca "},{"$f":"INDEX('ABS pop T1'!E$12:E$139,MATCH($C91,'ABS pop T1'!$H$12:$H$139,0))","v":19862},{"$f":"INDEX('ABS pop T1'!F$12:F$139,MATCH($C91,'ABS pop T1'!$H$12:$H$139,0))","v":19911},2.4670224549390163E-3,{"$f":"INDEX('Supp val'!D$7:D$134,MATCH($B91,'Supp val'!$B$7:$B$134,0))","v":11433000},{"$f":"INDEX('Supp val'!E$7:E$134,MATCH($B91,'Supp val'!$B$7:$B$134,0))","v":101000},8.8340767952418443E-3,0]
[null,{"$f":"Names!I88","v":164},{"$f":"Names!F88","v":"Narrabri "},{"$f":"INDEX('ABS pop T1'!E$12:E$139,MATCH($C92,'ABS pop T1'!$H$12:$H$139,0))","v":13049},{"$f":"INDEX('ABS pop T1'!F$12:F$139,MATCH($C92,'ABS pop T1'!$H$12:$H$139,0))","v":12948},0,{"$f":"INDEX('Supp val'!D$7:D$134,MATCH($B92,'Supp val'!$B$7:$B$134,0))","v":13545000},{"$f":"INDEX('Supp val'!E$7:E$134,MATCH($B92,'Supp val'!$B$7:$B$134,0))","v":16000},1.1812476928755998E-3,0]
[null,{"$f":"Names!I89","v":165},{"$f":"Names!F89","v":"Narrandera "},{"$f":"INDEX('ABS pop T1'!E$12:E$139,MATCH($C93,'ABS pop T1'!$H$12:$H$139,0))","v":5858},{"$f":"INDEX('ABS pop T1'!F$12:F$139,MATCH($C93,'ABS pop T1'!$H$12:$H$139,0))","v":5834},0,{"$f":"INDEX('Supp val'!D$7:D$134,MATCH($B93,'Supp val'!$B$7:$B$134,0))","v":5104000},{"$f":"INDEX('Supp val'!E$7:E$134,MATCH($B93,'Supp val'!$B$7:$B$134,0))","v":-1000},0,0]
[null,{"$f":"Names!I90","v":166},{"$f":"Names!F90","v":"Narromine "},{"$f":"INDEX('ABS pop T1'!E$12:E$139,MATCH($C94,'ABS pop T1'!$H$12:$H$139,0))","v":6460},{"$f":"INDEX('ABS pop T1'!F$12:F$139,MATCH($C94,'ABS pop T1'!$H$12:$H$139,0))","v":6392},0,{"$f":"INDEX('Supp val'!D$7:D$134,MATCH($B94,'Supp val'!$B$7:$B$134,0))","v":6017000},{"$f":"INDEX('Supp val'!E$7:E$134,MATCH($B94,'Supp val'!$B$7:$B$134,0))","v":8000},1.3295662290177829E-3,0]
[null,{"$f":"Names!I91","v":167},{"$f":"Names!F91","v":"Newcastle "},{"$f":"INDEX('ABS pop T1'!E$12:E$139,MATCH($C95,'ABS pop T1'!$H$12:$H$139,0))","v":167362},{"$f":"INDEX('ABS pop T1'!F$12:F$139,MATCH($C95,'ABS pop T1'!$H$12:$H$139,0))","v":168880},9.0701592954194332E-3,{"$f":"INDEX('Supp val'!D$7:D$134,MATCH($B95,'Supp val'!$B$7:$B$134,0))","v":164941000},{"$f":"INDEX('Supp val'!E$7:E$134,MATCH($B95,'Supp val'!$B$7:$B$134,0))","v":1438000},8.7182689567784841E-3,3.5189033864094915E-4]
[null,{"$f":"Names!I92","v":168},{"$f":"Names!F92","v":"North Sydney"},{"$f":"INDEX('ABS pop T1'!E$12:E$139,MATCH($C96,'ABS pop T1'!$H$12:$H$139,0))","v":75079},{"$f":"INDEX('ABS pop T1'!F$12:F$139,MATCH($C96,'ABS pop T1'!$H$12:$H$139,0))","v":73712},0,{"$f":"INDEX('Supp val'!D$7:D$134,MATCH($B96,'Supp val'!$B$7:$B$134,0))","v":51765000},{"$f":"INDEX('Supp val'!E$7:E$134,MATCH($B96,'Supp val'!$B$7:$B$134,0))","v":375000},7.2442770211532887E-3,0]
[null,{"$f":"Names!I93","v":2087},{"$f":"Names!F93","v":"Northern Beaches"},{"$f":"INDEX('ABS pop T1'!E$12:E$139,MATCH($C97,'ABS pop T1'!$H$12:$H$139,0))","v":274023},{"$f":"INDEX('ABS pop T1'!F$12:F$139,MATCH($C97,'ABS pop T1'!$H$12:$H$139,0))","v":272184},0,{"$f":"INDEX('Supp val'!D$7:D$134,MATCH($B97,'Supp val'!$B$7:$B$134,0))","v":173168000},{"$f":"INDEX('Supp val'!E$7:E$134,MATCH($B97,'Supp val'!$B$7:$B$134,0))","v":477000},2.7545504943176568E-3,0]
[null,{"$f":"Names!I94","v":2045},{"$f":"Names!F94","v":"Oberon"},{"$f":"INDEX('ABS pop T1'!E$12:E$139,MATCH($C98,'ABS pop T1'!$H$12:$H$139,0))","v":5420},{"$f":"INDEX('ABS pop T1'!F$12:F$139,MATCH($C98,'ABS pop T1'!$H$12:$H$139,0))","v":5425},9.2250922509218292E-4,{"$f":"INDEX('Supp val'!D$7:D$134,MATCH($B98,'Supp val'!$B$7:$B$134,0))","v":4697000},{"$f":"INDEX('Supp val'!E$7:E$134,MATCH($B98,'Supp val'!$B$7:$B$134,0))","v":20000},4.2580370449222908E-3,0]
[null,{"$f":"Names!I95","v":172},{"$f":"Names!F95","v":"Orange "},{"$f":"INDEX('ABS pop T1'!E$12:E$139,MATCH($C99,'ABS pop T1'!$H$12:$H$139,0))","v":42503},{"$f":"INDEX('ABS pop T1'!F$12:F$139,MATCH($C99,'ABS pop T1'!$H$12:$H$139,0))","v":42809},7.1994918005788833E-3,{"$f":"INDEX('Supp val'!D$7:D$134,MATCH($B99,'Supp val'!$B$7:$B$134,0))","v":35449000},{"$f":"INDEX('Supp val'!E$7:E$134,MATCH($B99,'Supp val'!$B$7:$B$134,0))","v":333000},9.3937769753730718E-3,0]
[null,{"$f":"Names!I96","v":173},{"$f":"Names!F96","v":"Parkes "},{"$f":"INDEX('ABS pop T1'!E$12:E$139,MATCH($C100,'ABS pop T1'!$H$12:$H$139,0))","v":14729},{"$f":"INDEX('ABS pop T1'!F$12:F$139,MATCH($C100,'ABS pop T1'!$H$12:$H$139,0))","v":14623},0,{"$f":"INDEX('Supp val'!D$7:D$134,MATCH($B100,'Supp val'!$B$7:$B$134,0))","v":14435000},{"$f":"INDEX('Supp val'!E$7:E$134,MATCH($B100,'Supp val'!$B$7:$B$134,0))","v":-24000},0,0]
[null,{"$f":"Names!I97","v":2089},{"$f":"Names!F97","v":"Parramatta "},{"$f":"INDEX('ABS pop T1'!E$12:E$139,MATCH($C101,'ABS pop T1'!$H$12:$H$139,0))","v":260246},{"$f":"INDEX('ABS pop T1'!F$12:F$139,MATCH($C101,'ABS pop T1'!$H$12:$H$139,0))","v":258799},0,{"$f":"INDEX('Supp val'!D$7:D$134,MATCH($B101,'Supp val'!$B$7:$B$134,0))","v":155184000},{"$f":"INDEX('Supp val'!E$7:E$134,MATCH($B101,'Supp val'!$B$7:$B$134,0))","v":1130000},7.2816785235591298E-3,0]
[null,{"$f":"Names!I98","v":176},{"$f":"Names!F98","v":"Penrith "},{"$f":"INDEX('ABS pop T1'!E$12:E$139,MATCH($C102,'ABS pop T1'!$H$12:$H$139,0))","v":216264},{"$f":"INDEX('ABS pop T1'!F$12:F$139,MATCH($C102,'ABS pop T1'!$H$12:$H$139,0))","v":219173},1.3451152295342661E-2,{"$f":"INDEX('Supp val'!D$7:D$134,MATCH($B102,'Supp val'!$B$7:$B$134,0))","v":132655000},{"$f":"INDEX('Supp val'!E$7:E$134,MATCH($B102,'Supp val'!$B$7:$B$134,0))","v":4728000},3.5641325242169536E-2,0]
[null,{"$f":"Names!I99","v":124},{"$f":"Names!F99","v":"Port Macquarie-Hastings"},{"$f":"INDEX('ABS pop T1'!E$12:E$139,MATCH($C103,'ABS pop T1'!$H$12:$H$139,0))","v":85960},{"$f":"INDEX('ABS pop T1'!F$12:F$139,MATCH($C103,'ABS pop T1'!$H$12:$H$139,0))","v":87560},1.8613308515588622E-2,{"$f":"INDEX('Supp val'!D$7:D$134,MATCH($B103,'Supp val'!$B$7:$B$134,0))","v":54025000},{"$f":"INDEX('Supp val'!E$7:E$134,MATCH($B103,'Supp val'!$B$7:$B$134,0))","v":468000},8.6626561776955106E-3,9.9506523378931119E-3]
[null,{"$f":"Names!I100","v":178},{"$f":"Names!F100","v":"Port Stephens"},{"$f":"INDEX('ABS pop T1'!E$12:E$139,MATCH($C104,'ABS pop T1'!$H$12:$H$139,0))","v":74509},{"$f":"INDEX('ABS pop T1'!F$12:F$139,MATCH($C104,'ABS pop T1'!$H$12:$H$139,0))","v":75685},1.578332818854089E-2,{"$f":"INDEX('Supp val'!D$7:D$134,MATCH($B104,'Supp val'!$B$7:$B$134,0))","v":45065000},{"$f":"INDEX('Supp val'!E$7:E$134,MATCH($B104,'Supp val'!$B$7:$B$134,0))","v":385000},8.5432153555974697E-3,7.2401128329434208E-3]
[null,{"$f":"Names!I101","v":2095},{"$f":"Names!F101","v":"Queanbeyan-Palerang Regional"},{"$f":"INDEX('ABS pop T1'!E$12:E$139,MATCH($C105,'ABS pop T1'!$H$12:$H$139,0))","v":62234},{"$f":"INDEX('ABS pop T1'!F$12:F$139,MATCH($C105,'ABS pop T1'!$H$12:$H$139,0))","v":63491},2.0197962528521352E-2,{"$f":"INDEX('Supp val'!D$7:D$134,MATCH($B105,'Supp val'!$B$7:$B$134,0))","v":39278000},{"$f":"INDEX('Supp val'!E$7:E$134,MATCH($B105,'Supp val'!$B$7:$B$134,0))","v":438000},1.1151280615102602E-2,9.0466819134187495E-3]
[null,{"$f":"Names!I102","v":181},{"$f":"Names!F102","v":"Randwick "},{"$f":"INDEX('ABS pop T1'!E$12:E$139,MATCH($C106,'ABS pop T1'!$H$12:$H$139,0))","v":156596},{"$f":"INDEX('ABS pop T1'!F$12:F$139,MATCH($C106,'ABS pop T1'!$H$12:$H$139,0))","v":153498},0,{"$f":"INDEX('Supp val'!D$7:D$134,MATCH($B106,'Supp val'!$B$7:$B$134,0))","v":92315000},{"$f":"INDEX('Supp val'!E$7:E$134,MATCH($B106,'Supp val'!$B$7:$B$134,0))","v":494000},5.3512430265937284E-3,0]
[null,{"$f":"Names!I103","v":1981},{"$f":"Names!F103","v":"Richmond Valley"},{"$f":"INDEX('ABS pop T1'!E$12:E$139,MATCH($C107,'ABS pop T1'!$H$12:$H$139,0))","v":23491},{"$f":"INDEX('ABS pop T1'!F$12:F$139,MATCH($C107,'ABS pop T1'!$H$12:$H$139,0))","v":23572},3.448129070708017E-3,{"$f":"INDEX('Supp val'!D$7:D$134,MATCH($B107,'Supp val'!$B$7:$B$134,0))","v":13968000},{"$f":"INDEX('Supp val'!E$7:E$134,MATCH($B107,'Supp val'!$B$7:$B$134,0))","v":59000},4.2239404352806412E-3,0]
[null,{"$f":"Names!I104","v":184},{"$f":"Names!F104","v":"Ryde "},{"$f":"INDEX('ABS pop T1'!E$12:E$139,MATCH($C108,'ABS pop T1'!$H$12:$H$139,0))","v":133205},{"$f":"INDEX('ABS pop T1'!F$12:F$139,MATCH($C108,'ABS pop T1'!$H$12:$H$139,0))","v":132822},0,{"$f":"INDEX('Supp val'!D$7:D$134,MATCH($B108,'Supp val'!$B$7:$B$134,0))","v":75401000},{"$f":"INDEX('Supp val'!E$7:E$134,MATCH($B108,'Supp val'!$B$7:$B$134,0))","v":819000},1.0861924908157716E-2,0]
[null,{"$f":"Names!I105","v":188},{"$f":"Names!F105","v":"Shellharbour "},{"$f":"INDEX('ABS pop T1'!E$12:E$139,MATCH($C109,'ABS pop T1'!$H$12:$H$139,0))","v":74625},{"$f":"INDEX('ABS pop T1'!F$12:F$139,MATCH($C109,'ABS pop T1'!$H$12:$H$139,0))","v":76364},2.330318257956443E-2,{"$f":"INDEX('Supp val'!D$7:D$134,MATCH($B109,'Supp val'!$B$7:$B$134,0))","v":50795000},{"$f":"INDEX('Supp val'!E$7:E$134,MATCH($B109,'Supp val'!$B$7:$B$134,0))","v":1211000},2.3840929225317452E-2,0]
[null,{"$f":"Names!I106","v":189},{"$f":"Names!F106","v":"Shoalhaven "},{"$f":"INDEX('ABS pop T1'!E$12:E$139,MATCH($C110,'ABS pop T1'!$H$12:$H$139,0))","v":107198},{"$f":"INDEX('ABS pop T1'!F$12:F$139,MATCH($C110,'ABS pop T1'!$H$12:$H$139,0))","v":108892},1.5802533629358795E-2,{"$f":"INDEX('Supp val'!D$7:D$134,MATCH($B110,'Supp val'!$B$7:$B$134,0))","v":79547000},{"$f":"INDEX('Supp val'!E$7:E$134,MATCH($B110,'Supp val'!$B$7:$B$134,0))","v":567000},7.1278615158334065E-3,8.6746721135253883E-3]
[null,{"$f":"Names!I107","v":190},{"$f":"Names!F107","v":"Singleton"},{"$f":"INDEX('ABS pop T1'!E$12:E$139,MATCH($C111,'ABS pop T1'!$H$12:$H$139,0))","v":23379},{"$f":"INDEX('ABS pop T1'!F$12:F$139,MATCH($C111,'ABS pop T1'!$H$12:$H$139,0))","v":23573},8.2980452542880112E-3,{"$f":"INDEX('Supp val'!D$7:D$134,MATCH($B111,'Supp val'!$B$7:$B$134,0))","v":22644000},{"$f":"INDEX('Supp val'!E$7:E$134,MATCH($B111,'Supp val'!$B$7:$B$134,0))","v":144000},6.3593004769475362E-3,1.938744777340475E-3]
[null,{"$f":"Names!I108","v":2096},{"$f":"Names!F108","v":"Snowy Monaro Regional"},{"$f":"INDEX('ABS pop T1'!E$12:E$139,MATCH($C112,'ABS pop T1'!$H$12:$H$139,0))","v":20997},{"$f":"INDEX('ABS pop T1'!F$12:F$139,MATCH($C112,'ABS pop T1'!$H$12:$H$139,0))","v":21207},1.0001428775539445E-2,{"$f":"INDEX('Supp val'!D$7:D$134,MATCH($B112,'Supp val'!$B$7:$B$134,0))","v":16934000},{"$f":"INDEX('Supp val'!E$7:E$134,MATCH($B112,'Supp val'!$B$7:$B$134,0))","v":121000},7.1453879768513051E-3,2.8560407986881397E-3]
[null,{"$f":"Names!I109","v":2097},{"$f":"Names!F109","v":"Snowy Valleys"},{"$f":"INDEX('ABS pop T1'!E$12:E$139,MATCH($C113,'ABS pop T1'!$H$12:$H$139,0))","v":14413},{"$f":"INDEX('ABS pop T1'!F$12:F$139,MATCH($C113,'ABS pop T1'!$H$12:$H$139,0))","v":14349},0,{"$f":"INDEX('Supp val'!D$7:D$134,MATCH($B113,'Supp val'!$B$7:$B$134,0))","v":9038000},{"$f":"INDEX('Supp val'!E$7:E$134,MATCH($B113,'Supp val'!$B$7:$B$134,0))","v":32000},3.540606328833813E-3,0]
[null,{"$f":"Names!I110","v":193},{"$f":"Names!F110","v":"Strathfield "},{"$f":"INDEX('ABS pop T1'!E$12:E$139,MATCH($C114,'ABS pop T1'!$H$12:$H$139,0))","v":47756},{"$f":"INDEX('ABS pop T1'!F$12:F$139,MATCH($C114,'ABS pop T1'!$H$12:$H$139,0))","v":47705},0,{"$f":"INDEX('Supp val'!D$7:D$134,MATCH($B114,'Supp val'!$B$7:$B$134,0))","v":18750000},{"$f":"INDEX('Supp val'!E$7:E$134,MATCH($B114,'Supp val'!$B$7:$B$134,0))","v":35000},1.8666666666666666E-3,0]
[null,{"$f":"Names!I111","v":194},{"$f":"Names!F111","v":"Sutherland "},{"$f":"INDEX('ABS pop T1'!E$12:E$139,MATCH($C115,'ABS pop T1'!$H$12:$H$139,0))","v":232366},{"$f":"INDEX('ABS pop T1'!F$12:F$139,MATCH($C115,'ABS pop T1'!$H$12:$H$139,0))","v":234275},8.2154876358848661E-3,{"$f":"INDEX('Supp val'!D$7:D$134,MATCH($B115,'Supp val'!$B$7:$B$134,0))","v":135118000},{"$f":"INDEX('Supp val'!E$7:E$134,MATCH($B115,'Supp val'!$B$7:$B$134,0))","v":1535000},1.1360440503855889E-2,0]
[null,{"$f":"Names!I112","v":2029},{"$f":"Names!F112","v":"Sydney "},{"$f":"INDEX('ABS pop T1'!E$12:E$139,MATCH($C116,'ABS pop T1'!$H$12:$H$139,0))","v":248668},{"$f":"INDEX('ABS pop T1'!F$12:F$139,MATCH($C116,'ABS pop T1'!$H$12:$H$139,0))","v":242237},0,{"$f":"INDEX('Supp val'!D$7:D$134,MATCH($B116,'Supp val'!$B$7:$B$134,0))","v":315285000},{"$f":"INDEX('Supp val'!E$7:E$134,MATCH($B116,'Supp val'!$B$7:$B$134,0))","v":-931000},0,0]
[null,{"$f":"Names!I113","v":2038},{"$f":"Names!F113","v":"Tamworth Regional"},{"$f":"INDEX('ABS pop T1'!E$12:E$139,MATCH($C117,'ABS pop T1'!$H$12:$H$139,0))","v":62544},{"$f":"INDEX('ABS pop T1'!F$12:F$139,MATCH($C117,'ABS pop T1'!$H$12:$H$139,0))","v":62782},3.8053210539779059E-3,{"$f":"INDEX('Supp val'!D$7:D$134,MATCH($B117,'Supp val'!$B$7:$B$134,0))","v":38323000},{"$f":"INDEX('Supp val'!E$7:E$134,MATCH($B117,'Supp val'!$B$7:$B$134,0))","v":314000},8.1935130339482812E-3,0]
[null,{"$f":"Names!I114","v":198},{"$f":"Names!F114","v":"Temora "},{"$f":"INDEX('ABS pop T1'!E$12:E$139,MATCH($C118,'ABS pop T1'!$H$12:$H$139,0))","v":6274},{"$f":"INDEX('ABS pop T1'!F$12:F$139,MATCH($C118,'ABS pop T1'!$H$12:$H$139,0))","v":6249},0,{"$f":"INDEX('Supp val'!D$7:D$134,MATCH($B118,'Supp val'!$B$7:$B$134,0))","v":4141000},{"$f":"INDEX('Supp val'!E$7:E$134,MATCH($B118,'Supp val'!$B$7:$B$134,0))","v":20000},4.8297512678097078E-3,0]
[null,{"$f":"Names!I115","v":199},{"$f":"Names!F115","v":"Tenterfield "},{"$f":"INDEX('ABS pop T1'!E$12:E$139,MATCH($C119,'ABS pop T1'!$H$12:$H$139,0))","v":6471},{"$f":"INDEX('ABS pop T1'!F$12:F$139,MATCH($C119,'ABS pop T1'!$H$12:$H$139,0))","v":6502},4.7906042342760191E-3,{"$f":"INDEX('Supp val'!D$7:D$134,MATCH($B119,'Supp val'!$B$7:$B$134,0))","v":4715000},{"$f":"INDEX('Supp val'!E$7:E$134,MATCH($B119,'Supp val'!$B$7:$B$134,0))","v":0},0,4.7906042342760191E-3]
[null,{"$f":"Names!I116","v":59},{"$f":"Names!F116","v":"Hills "},{"$f":"INDEX('ABS pop T1'!E$12:E$139,MATCH($C120,'ABS pop T1'!$H$12:$H$139,0))","v":183777},{"$f":"INDEX('ABS pop T1'!F$12:F$139,MATCH($C120,'ABS pop T1'!$H$12:$H$139,0))","v":188557},2.6009783596423919E-2,{"$f":"INDEX('Supp val'!D$7:D$134,MATCH($B120,'Supp val'!$B$7:$B$134,0))","v":78063000},{"$f":"INDEX('Supp val'!E$7:E$134,MATCH($B120,'Supp val'!$B$7:$B$134,0))","v":1625000},2.0816519990264275E-2,5.1932636061596434E-3]
[null,{"$f":"Names!I117","v":202},{"$f":"Names!F117","v":"Tweed "},{"$f":"INDEX('ABS pop T1'!E$12:E$139,MATCH($C121,'ABS pop T1'!$H$12:$H$139,0))","v":98390},{"$f":"INDEX('ABS pop T1'!F$12:F$139,MATCH($C121,'ABS pop T1'!$H$12:$H$139,0))","v":99480},1.1078361622116173E-2,{"$f":"INDEX('Supp val'!D$7:D$134,MATCH($B121,'Supp val'!$B$7:$B$134,0))","v":65652000},{"$f":"INDEX('Supp val'!E$7:E$134,MATCH($B121,'Supp val'!$B$7:$B$134,0))","v":555000},8.4536647779199416E-3,2.6246968441962313E-3]
[null,{"$f":"Names!I118","v":2046},{"$f":"Names!F118","v":"Upper Hunter "},{"$f":"INDEX('ABS pop T1'!E$12:E$139,MATCH($C122,'ABS pop T1'!$H$12:$H$139,0))","v":14167},{"$f":"INDEX('ABS pop T1'!F$12:F$139,MATCH($C122,'ABS pop T1'!$H$12:$H$139,0))","v":14152},0,{"$f":"INDEX('Supp val'!D$7:D$134,MATCH($B122,'Supp val'!$B$7:$B$134,0))","v":11405000},{"$f":"INDEX('Supp val'!E$7:E$134,MATCH($B122,'Supp val'!$B$7:$B$134,0))","v":8000},7.0144673388864538E-4,0]
[null,{"$f":"Names!I119","v":2035},{"$f":"Names!F119","v":"Upper Lachlan "},{"$f":"INDEX('ABS pop T1'!E$12:E$139,MATCH($C123,'ABS pop T1'!$H$12:$H$139,0))","v":8274},{"$f":"INDEX('ABS pop T1'!F$12:F$139,MATCH($C123,'ABS pop T1'!$H$12:$H$139,0))","v":8419},1.7524776408025078E-2,{"$f":"INDEX('Supp val'!D$7:D$134,MATCH($B123,'Supp val'!$B$7:$B$134,0))","v":7584000},{"$f":"INDEX('Supp val'!E$7:E$134,MATCH($B123,'Supp val'!$B$7:$B$134,0))","v":177000},2.3338607594936708E-2,0]
[null,{"$f":"Names!I120","v":204},{"$f":"Names!F120","v":"Uralla "},{"$f":"INDEX('ABS pop T1'!E$12:E$139,MATCH($C124,'ABS pop T1'!$H$12:$H$139,0))","v":5945},{"$f":"INDEX('ABS pop T1'!F$12:F$139,MATCH($C124,'ABS pop T1'!$H$12:$H$139,0))","v":5883},0,{"$f":"INDEX('Supp val'!D$7:D$134,MATCH($B124,'Supp val'!$B$7:$B$134,0))","v":4021000},{"$f":"INDEX('Supp val'!E$7:E$134,MATCH($B124,'Supp val'!$B$7:$B$134,0))","v":0},0,0]
[null,{"$f":"Names!I121","v":206},{"$f":"Names!F121","v":"Wagga Wagga "},{"$f":"INDEX('ABS pop T1'!E$12:E$139,MATCH($C125,'ABS pop T1'!$H$12:$H$139,0))","v":65765},{"$f":"INDEX('ABS pop T1'!F$12:F$139,MATCH($C125,'ABS pop T1'!$H$12:$H$139,0))","v":66408},9.7772371322131235E-3,{"$f":"INDEX('Supp val'!D$7:D$134,MATCH($B125,'Supp val'!$B$7:$B$134,0))","v":46915000},{"$f":"INDEX('Supp val'!E$7:E$134,MATCH($B125,'Supp val'!$B$7:$B$134,0))","v":390000},8.3129063199403174E-3,1.4643308122728061E-3]
[null,{"$f":"Names!I122","v":208},{"$f":"Names!F122","v":"Walcha"},{"$f":"INDEX('ABS pop T1'!E$12:E$139,MATCH($C126,'ABS pop T1'!$H$12:$H$139,0))","v":3105},{"$f":"INDEX('ABS pop T1'!F$12:F$139,MATCH($C126,'ABS pop T1'!$H$12:$H$139,0))","v":3103},0,{"$f":"INDEX('Supp val'!D$7:D$134,MATCH($B126,'Supp val'!$B$7:$B$134,0))","v":3598000},{"$f":"INDEX('Supp val'!E$7:E$134,MATCH($B126,'Supp val'!$B$7:$B$134,0))","v":1000},2.7793218454697053E-4,0]
[null,{"$f":"Names!I123","v":209},{"$f":"Names!F123","v":"Walgett "},{"$f":"INDEX('ABS pop T1'!E$12:E$139,MATCH($C127,'ABS pop T1'!$H$12:$H$139,0))","v":5828},{"$f":"INDEX('ABS pop T1'!F$12:F$139,MATCH($C127,'ABS pop T1'!$H$12:$H$139,0))","v":5785},0,{"$f":"INDEX('Supp val'!D$7:D$134,MATCH($B127,'Supp val'!$B$7:$B$134,0))","v":5805000},{"$f":"INDEX('Supp val'!E$7:E$134,MATCH($B127,'Supp val'!$B$7:$B$134,0))","v":5000},8.6132644272179156E-4,0]
[null,{"$f":"Names!I124","v":210},{"$f":"Names!F124","v":"Warren "},{"$f":"INDEX('ABS pop T1'!E$12:E$139,MATCH($C128,'ABS pop T1'!$H$12:$H$139,0))","v":2716},{"$f":"INDEX('ABS pop T1'!F$12:F$139,MATCH($C128,'ABS pop T1'!$H$12:$H$139,0))","v":2708},0,{"$f":"INDEX('Supp val'!D$7:D$134,MATCH($B128,'Supp val'!$B$7:$B$134,0))","v":5034000},{"$f":"INDEX('Supp val'!E$7:E$134,MATCH($B128,'Supp val'!$B$7:$B$134,0))","v":3000},5.9594755661501785E-4,0]
[null,{"$f":"Names!I125","v":2050},{"$f":"Names!F125","v":"Warrumbungle "},{"$f":"INDEX('ABS pop T1'!E$12:E$139,MATCH($C129,'ABS pop T1'!$H$12:$H$139,0))","v":9210},{"$f":"INDEX('ABS pop T1'!F$12:F$139,MATCH($C129,'ABS pop T1'!$H$12:$H$139,0))","v":9118},0,{"$f":"INDEX('Supp val'!D$7:D$134,MATCH($B129,'Supp val'!$B$7:$B$134,0))","v":8353000},{"$f":"INDEX('Supp val'!E$7:E$134,MATCH($B129,'Supp val'!$B$7:$B$134,0))","v":-4000},0,0]
[null,{"$f":"Names!I126","v":212},{"$f":"Names!F126","v":"Waverley"},{"$f":"INDEX('ABS pop T1'!E$12:E$139,MATCH($C130,'ABS pop T1'!$H$12:$H$139,0))","v":74263},{"$f":"INDEX('ABS pop T1'!F$12:F$139,MATCH($C130,'ABS pop T1'!$H$12:$H$139,0))","v":72743},0,{"$f":"INDEX('Supp val'!D$7:D$134,MATCH($B130,'Supp val'!$B$7:$B$134,0))","v":47171000},{"$f":"INDEX('Supp val'!E$7:E$134,MATCH($B130,'Supp val'!$B$7:$B$134,0))","v":183000},3.8795022365436392E-3,0]
[null,{"$f":"Names!I127","v":213},{"$f":"Names!F127","v":"Weddin "},{"$f":"INDEX('ABS pop T1'!E$12:E$139,MATCH($C131,'ABS pop T1'!$H$12:$H$139,0))","v":3597},{"$f":"INDEX('ABS pop T1'!F$12:F$139,MATCH($C131,'ABS pop T1'!$H$12:$H$139,0))","v":3577},0,{"$f":"INDEX('Supp val'!D$7:D$134,MATCH($B131,'Supp val'!$B$7:$B$134,0))","v":2902000},{"$f":"INDEX('Supp val'!E$7:E$134,MATCH($B131,'Supp val'!$B$7:$B$134,0))","v":2000},6.8917987594762232E-4,0]
[null,{"$f":"Names!I128","v":215},{"$f":"Names!F128","v":"Wentworth "},{"$f":"INDEX('ABS pop T1'!E$12:E$139,MATCH($C132,'ABS pop T1'!$H$12:$H$139,0))","v":7090},{"$f":"INDEX('ABS pop T1'!F$12:F$139,MATCH($C132,'ABS pop T1'!$H$12:$H$139,0))","v":7142},7.3342736248236395E-3,{"$f":"INDEX('Supp val'!D$7:D$134,MATCH($B132,'Supp val'!$B$7:$B$134,0))","v":5462000},{"$f":"INDEX('Supp val'!E$7:E$134,MATCH($B132,'Supp val'!$B$7:$B$134,0))","v":68000},1.2449652142072502E-2,0]
[null,{"$f":"Names!I129","v":216},{"$f":"Names!F129","v":"Willoughby "},{"$f":"INDEX('ABS pop T1'!E$12:E$139,MATCH($C133,'ABS pop T1'!$H$12:$H$139,0))","v":81183},{"$f":"INDEX('ABS pop T1'!F$12:F$139,MATCH($C133,'ABS pop T1'!$H$12:$H$139,0))","v":79556},0,{"$f":"INDEX('Supp val'!D$7:D$134,MATCH($B133,'Supp val'!$B$7:$B$134,0))","v":53052000},{"$f":"INDEX('Supp val'!E$7:E$134,MATCH($B133,'Supp val'!$B$7:$B$134,0))","v":90000},1.6964487672472292E-3,0]
[null,{"$f":"Names!I130","v":218},{"$f":"Names!F130","v":"Wingecarribee "},{"$f":"INDEX('ABS pop T1'!E$12:E$139,MATCH($C134,'ABS pop T1'!$H$12:$H$139,0))","v":51763},{"$f":"INDEX('ABS pop T1'!F$12:F$139,MATCH($C134,'ABS pop T1'!$H$12:$H$139,0))","v":52309},1.054807487974041E-2,{"$f":"INDEX('Supp val'!D$7:D$134,MATCH($B134,'Supp val'!$B$7:$B$134,0))","v":52621000},{"$f":"INDEX('Supp val'!E$7:E$134,MATCH($B134,'Supp val'!$B$7:$B$134,0))","v":370000},7.0314133140761291E-3,3.516661565664281E-3]
[null,{"$f":"Names!I131","v":219},{"$f":"Names!F131","v":"Wollondilly "},{"$f":"INDEX('ABS pop T1'!E$12:E$139,MATCH($C135,'ABS pop T1'!$H$12:$H$139,0))","v":54002},{"$f":"INDEX('ABS pop T1'!F$12:F$139,MATCH($C135,'ABS pop T1'!$H$12:$H$139,0))","v":54772},1.4258731158105276E-2,{"$f":"INDEX('Supp val'!D$7:D$134,MATCH($B135,'Supp val'!$B$7:$B$134,0))","v":39741000},{"$f":"INDEX('Supp val'!E$7:E$134,MATCH($B135,'Supp val'!$B$7:$B$134,0))","v":801000},2.0155506907224278E-2,0]
[null,{"$f":"Names!I132","v":220},{"$f":"Names!F132","v":"Wollongong "},{"$f":"INDEX('ABS pop T1'!E$12:E$139,MATCH($C136,'ABS pop T1'!$H$12:$H$139,0))","v":219792},{"$f":"INDEX('ABS pop T1'!F$12:F$139,MATCH($C136,'ABS pop T1'!$H$12:$H$139,0))","v":220659},3.9446385673727047E-3,{"$f":"INDEX('Supp val'!D$7:D$134,MATCH($B136,'Supp val'!$B$7:$B$134,0))","v":175452000},{"$f":"INDEX('Supp val'!E$7:E$134,MATCH($B136,'Supp val'!$B$7:$B$134,0))","v":1153000},6.571597929918154E-3,0]
[null,{"$f":"Names!I133","v":221},{"$f":"Names!F133","v":"Woollahra "},{"$f":"INDEX('ABS pop T1'!E$12:E$139,MATCH($C137,'ABS pop T1'!$H$12:$H$139,0))","v":59426},{"$f":"INDEX('ABS pop T1'!F$12:F$139,MATCH($C137,'ABS pop T1'!$H$12:$H$139,0))","v":58480},0,{"$f":"INDEX('Supp val'!D$7:D$134,MATCH($B137,'Supp val'!$B$7:$B$134,0))","v":41423000},{"$f":"INDEX('Supp val'!E$7:E$134,MATCH($B137,'Supp val'!$B$7:$B$134,0))","v":91000},2.1968471622045723E-3,0]
[null,{"$f":"Names!I134","v":2036},{"$f":"Names!F134","v":"Yass Valley"},{"$f":"INDEX('ABS pop T1'!E$12:E$139,MATCH($C138,'ABS pop T1'!$H$12:$H$139,0))","v":17322},{"$f":"INDEX('ABS pop T1'!F$12:F$139,MATCH($C138,'ABS pop T1'!$H$12:$H$139,0))","v":17608},1.6510795520147781E-2,{"$f":"INDEX('Supp val'!D$7:D$134,MATCH($B138,'Supp val'!$B$7:$B$134,0))","v":11285000},{"$f":"INDEX('Supp val'!E$7:E$134,MATCH($B138,'Supp val'!$B$7:$B$134,0))","v":125000},1.1076650420912717E-2,5.4341450992350642E-3]