{"text_format":"1","workbook":"xlsx","n_sheets":11,"sheets":["Cover","Inputs>>","2021 Determination Revenue","2021 Determination Charges","Updated Volumes","Outputs","Report Tables"," Calculations>>","MDB calcs","FRWS calcs","WaterNSW Sheets >>"],"not_rendered":{"charts":0,"images":0,"macros":1,"external_links":2,"defined_names":191,"comments":1,"pivot_tables":0},"unopened":[],"bounds":{"document_bytes":16777216,"sheet_cells":100000,"rows_first":2000,"rows_last":500,"rows_between":2000,"halvings":0,"cell_chars":16384,"cell_head_chars":4096},"cells_cut":0,"cells_raw":0,"read":"whole","date_system":"1900"}

{"sheet":"Cover","index":0,"n_rows":55,"n_cols":4,"rows_kept":55,"cut":false,"hidden":false,"merged":[]}
[]
[]
[null,{"$f":"\"WaterNSW - Rural water pricing annual update \"&Outputs!$C$23","v":"WaterNSW - Rural water pricing annual update 2024-25"}]
[]
[]
[null,"MODELLER:",null,"Bee Thompson"]
[null,"email",null,"Bee_Thompson@ipart.nsw.gov.au"]
[]
[]
[]
[null,"WHAT IS THE PURPOSE OF MODEL?"]
[null,{"$f":"\"This model calculates \"&Outputs!$C$23&\" water entitlement and usage charges for the Murray Darling Basin (MDB) and the Fish River Water Supply Scheme (FRWS) based on updated demand forecasts.\"","v":"This model calculates 2024-25 water entitlement and usage charges for the Murray Darling Basin (MDB) and the Fish River Water Supply Scheme (FRWS) based on updated demand forecasts."}]
[]
[null,{"$f":"\"For the \"&'2021 Determination Revenue'!$C$13&\" Determination, the forecast usage for each year of the determination period was calculated as the 20 year historical average to \"&'2021 Determination Revenue'!$C$15&\".\"","v":"For the 2021 Determination, the forecast usage for each year of the determination period was calculated as the 20 year historical average to 2019-20."}]
[null,{"$f":"\"This model updates the 20-year historical average for \"&Outputs!$C$23&\" by using the 20 year average to \"&Outputs!$C$24&\". It then uses these updated forecasts to calculate new \"&Outputs!$C$23&\" charges.\"","v":"This model updates the 20-year historical average for 2024-25 by using the 20 year average to 2022-23. It then uses these updated forecasts to calculate new 2024-25 charges."}]
[]
[null,"HOW DOES THE MODEL WORK? "]
[null,"In essence, the model calculates the entitlement and usage charges that would recover the allowed revenue for each of these charges, using the updated demand forecasts. "]
[null,"The re-calculated charges include"]
[null,null,"-","WaterNSW entitlement and usage charges "]
{"$rows_left_out":36}
{"sheet":"Inputs>>","index":1,"n_rows":5,"n_cols":3,"rows_kept":5,"cut":false,"hidden":false,"merged":[]}
[]
[]
[]
[]
[null,null,"Page intentionally left blank"]

{"sheet":"2021 Determination Revenue","index":2,"n_rows":143,"n_cols":10,"rows_kept":143,"cut":false,"hidden":false,"merged":[]}
[]
[null,"1.  ALLOWED REVENUE, SECURITY FACTORS AND VOLUMES FOR INDICATIVE CUSTOMER BILLS"]
[null,{"$f":"\"This worksheet records the required revenue that was calculated as part of our \"&$C$13&\" review of prices, as well as other inputs consistent with that review.\"","v":"This worksheet records the required revenue that was calculated as part of our 2021 review of prices, as well as other inputs consistent with that review."}]
[]
[null,"List of tables",null,null,null,null,"Row number"]
[null,{"$f":"B18","v":"TABLE 2.1 - INFLATION AS PER 2021 DETERMINATION"},null,null,null,null,{"$f":"ROW(B18)","v":18}]
[null,{"$f":"B35","v":"TABLE 2.2 - REVENUE REQUIREMENT EXCLUDING MDBA/BRC REVENUE "},null,null,null,null,{"$f":"ROW(B35)","v":35}]
[null,{"$f":"B71","v":"TABLE 2.3 - MDBA/BRC REVENUE REQUIREMENT"},null,null,null,null,{"$f":"ROW(B71)","v":71}]
[null,{"$f":"B101","v":"TABLE 2.4 - SECURITY FACTORS"},null,null,null,null,{"$f":"ROW(B101)","v":101}]
[null,{"$f":"B120","v":"TABLE 2.5 - CUSTOMER USAGE VOLUMES FOR CALCULATION OF BILLS"},null,null,null,null,{"$f":"ROW(B120)","v":120}]
[]
[]
[null,"Determination year",2021]
[null,"For prices from (FY)",{"$f":"F20","v":"2020-21"}]
[null,"Prices set using 20 year average volumes to",{"$f":"C13-2&\"-\"&RIGHT(C13-1,2)","v":"2019-20"}]
[]
[]
[null,"TABLE 2.1 - INFLATION AS PER 2021 DETERMINATION"]
[null,"Financial year ending 30 June",{"$f":"C$36","v":"Units"},null,{"$f":"F19-1","v":2020},{"$f":"C13","v":2021},{"$f":"F19+1","v":2022},{"$f":"G19+1","v":2023},2024,2025]
[null,"Financial year",null,null,{"$f":"E19-1&\"-\"&RIGHT(E19,2)","v":"2019-20"},{"$f":"F19-1&\"-\"&RIGHT(F19,2)","v":"2020-21"},{"$f":"G19-1&\"-\"&RIGHT(G19,2)","v":"2021-22"},{"$f":"H19-1&\"-\"&RIGHT(H19,2)","v":"2022-23"},{"$f":"I19-1&\"-\"&RIGHT(I19,2)","v":"2023-24"},{"$f":"J19-1&\"-\"&RIGHT(J19,2)","v":"2024-25"}]
{"$rows_left_out":124}
{"sheet":"2021 Determination Charges","index":3,"n_rows":94,"n_cols":15,"rows_kept":94,"cut":false,"hidden":false,"merged":[]}
[]
[null,{"$f":"\"2.  \"&'2021 Determination Revenue'!$F$19&\" DETERMINATION CHARGES, \"&$G$14","v":"2.  2021 DETERMINATION CHARGES, $2020-21"}]
[null,{"$f":"\"This worksheet records the charges under the \"&'2021 Determination Revenue'!$C$13&\" Determination.\"","v":"This worksheet records the charges under the 2021 Determination."}]
[]
[null,"List of tables",null,null,null,"Row number"]
[null,{"$f":"B12","v":"TABLE 3.1 - WaterNSW CHARGES"},null,null,null,{"$f":"ROW(B12)","v":12}]
[null,{"$f":"B52","v":"TABLE 3.2 - MDBA AND BRC USAGE AND ENTITLEMENT CHARGES"},null,null,null,{"$f":"ROW(B52)","v":52}]
[null,{"$f":"B75","v":"TABLE 3.3 - FISH RIVER WATER SUPPLY SCHEME CHARGES"},null,null,null,{"$f":"ROW(B75)","v":75}]
[]
[]
[]
[null,"TABLE 3.1 - WaterNSW CHARGES"]
[null,{"$f":"'2021 Determination Revenue'!B$20","v":"Financial year"},{"$f":"'2021 Determination Revenue'!C$36","v":"Units"},null,null,null,{"$f":"'2021 Determination Revenue'!G$20","v":"2021-22"},{"$f":"'2021 Determination Revenue'!H$20","v":"2022-23"},{"$f":"'2021 Determination Revenue'!I$20","v":"2023-24"},{"$f":"'2021 Determination Revenue'!J$20","v":"2024-25"},null,{"$f":"G13","v":"2021-22"},{"$f":"H13","v":"2022-23"},"2023-24","2024-25"]
[null,null,null,null,null,null,{"$f":"'2021 Determination Revenue'!$G$37","v":"$2020-21"},{"$f":"G14","v":"$2020-21"},{"$f":"H14","v":"$2020-21"},"$2020-21",null,{"$f":"\"$\"&L13","v":"$2021-22"},"$2022-23","$2023-24","$2024-25"]
[]
[null,"Usage Charge "]
[null,{"$f":"'2021 Determination Revenue'!$B$41","v":"Border"},{"$f":"Outputs!$C$33","v":"$/ML"},null,null,null,6.9519630133429891,6.9519630133429891,6.9519630133429891,6.9519630133429891,null,{"$f":"ROUND(G17*'2021 Determination Revenue'!$G$30,2)","v":7.03},{"$f":"ROUND(ROUND(H17*'2021 Determination Revenue'!$G$30,2)*'2021 Determination Revenue'!H$29,2)","v":7.39},{"$f":"ROUND(ROUND(I17*'2021 Determination Revenue'!$G$30,2)*'2021 Determination Revenue'!I$29,2)","v":7.91},{"$f":"ROUND(ROUND(J17*'2021 Determination Revenue'!$G$30,2)*'2021 Determination Revenue'!J$29,2)","v":8.1999999999999993}]
[null,{"$f":"'2021 Determination Revenue'!$B$42","v":"Gwydir"},{"$f":"Outputs!$C$33","v":"$/ML"},null,null,null,17.000321673640542,17.000321673640542,17.000321673640542,17.000321673640542,null,{"$f":"ROUND(G18*'2021 Determination Revenue'!$G$30,2)","v":17.190000000000001},{"$f":"ROUND(ROUND(H18*'2021 Determination Revenue'!$G$30,2)*'2021 Determination Revenue'!H$29,2)","v":18.07},{"$f":"ROUND(ROUND(I18*'2021 Determination Revenue'!$G$30,2)*'2021 Determination Revenue'!I$29,2)","v":19.34},{"$f":"ROUND(ROUND(J18*'2021 Determination Revenue'!$G$30,2)*'2021 Determination Revenue'!J$29,2)","v":20.04}]
[null,{"$f":"'2021 Determination Revenue'!$B$43","v":"Namoi"},{"$f":"Outputs!$C$33","v":"$/ML"},null,null,null,30.541139003181428,30.541139003181428,30.541139003181428,30.541139003181428,null,{"$f":"ROUND(G19*'2021 Determination Revenue'!$G$30,2)","v":30.88},{"$f":"ROUND(ROUND(H19*'2021 Determination Revenue'!$G$30,2)*'2021 Determination Revenue'!H$29,2)","v":32.450000000000003},{"$f":"ROUND(ROUND(I19*'2021 Determination Revenue'!$G$30,2)*'2021 Determination Revenue'!I$29,2)","v":34.74},{"$f":"ROUND(ROUND(J19*'2021 Determination Revenue'!$G$30,2)*'2021 Determination Revenue'!J$29,2)","v":36.01}]
[null,{"$f":"'2021 Determination Revenue'!$B$44","v":"Peel"},{"$f":"Outputs!$C$33","v":"$/ML"},null,null,null,24.243385466098346,24.243385466098346,24.243385466098346,24.243385466098346,null,{"$f":"ROUND(G20*'2021 Determination Revenue'!$G$30,2)","v":24.51},{"$f":"ROUND(ROUND(H20*'2021 Determination Revenue'!$G$30,2)*'2021 Determination Revenue'!H$29,2)","v":25.76},{"$f":"ROUND(ROUND(I20*'2021 Determination Revenue'!$G$30,2)*'2021 Determination Revenue'!I$29,2)","v":27.57},{"$f":"ROUND(ROUND(J20*'2021 Determination Revenue'!$G$30,2)*'2021 Determination Revenue'!J$29,2)","v":28.58}]
{"$rows_left_out":75}
{"sheet":"Updated Volumes","index":4,"n_rows":127,"n_cols":33,"rows_kept":127,"cut":false,"hidden":false,"merged":[[20,32,26,37]]}
[]
[null,"3.  UPDATED VOLUMES PROVIDED BY WaterNSW"]
[null,"This worksheet records the updated usage and entitlement volumes that are used to calculate updated prices for the Annual Review.  WaterNSW provides the updated volumes."]
[null,{"$f":"\"  - Variable usage charges are calculated using rolling 20-year historical average volumes with a two year lag, eg, \"&AD$16&\" usage charges are calculated using \"&$I$16&\" to \"&$AB$16&\" volumes.\"","v":"  - Variable usage charges are calculated using rolling 20-year historical average volumes with a two year lag, eg, 2024-25 usage charges are calculated using 2003-04 to 2022-23 volumes."}]
[null,{"$f":"\"  - Entitlement charges are calculated using single year volumes with the same two year lag, eg. \"&$AD$16&\" entitlement charges are calculated using \"&$AB$16&\" entitlement volumes.\"","v":"  - Entitlement charges are calculated using single year volumes with the same two year lag, eg. 2024-25 entitlement charges are calculated using 2022-23 entitlement volumes."}]
[]
[null,"List of tables",null,null,null,null,null,null,null,null,null,null,null,null,null,null,null,null,null,null,null,null,null,null,null,null,null,null,null,null,"Row number"]
[null,{"$f":"B14","v":"TABLE 1.1 - USAGE VOLUMES"},null,null,null,null,null,null,null,null,null,null,null,null,null,null,null,null,null,null,null,null,null,null,null,null,null,null,null,null,{"$f":"ROW(B14)","v":14}]
[null,{"$f":"B38","v":"TABLE 1.2 - ENTITLEMENT VOLUMES"},null,null,null,null,null,null,null,null,null,null,null,null,null,null,null,null,null,null,null,null,null,null,null,null,null,null,null,null,{"$f":"ROW(B38)","v":38}]
[null,{"$f":"B76","v":"TABLE 1.3 - ACTUAL WATER ALLOCATIONS"},null,null,null,null,null,null,null,null,null,null,null,null,null,null,null,null,null,null,null,null,null,null,null,null,null,null,null,null,{"$f":"ROW(B76)","v":76}]
[null,{"$f":"B116","v":"TABLE 1.4 - FISH RIVER WATER SUPPLY SCHEME (FRWS) MINOR CUSTOMER NUMBERS AND MAQ ENTITLEMENT VOLUMES"},null,null,null,null,null,null,null,null,null,null,null,null,null,null,null,null,null,null,null,null,null,null,null,null,null,null,null,null,{"$f":"ROW(B116)","v":116}]
[]
[]
[null,"TABLE 1.1 - USAGE VOLUMES",null,null,null,null,null,null,null,null,null,null,null,null,null,null,null,null,null,null,null,null,null,null,null,null,null,null,null,null,null,null,"Comments from WaterNSW"]
[null,"Financial year ending 30 June","Units",null,null,{"$f":"G15-1","v":2001},2002,2003,2004,2005,2006,2007,2008,2009,2010,2011,2012,2013,2014,2015,2016,2017,2018,2019,2020,{"$f":"AA15-1","v":2021},2022,2023,2024,2025]
[null,"Financial year",null,null,null,{"$f":"F15-1&\"-\"&RIGHT(F15,2)","v":"2000-01"},"2001-02","2002-03","2003-04","2004-05","2005-06","2006-07","2007-08","2008-09","2009-10","2010-11","2011-12","2012-13","2013-14","2014-15","2015-16","2016-17","2017-18","2018-19","2019-20","2020-21",{"$f":"AA15-1&\"-\"&RIGHT(AA15,2)","v":"2021-22"},{"$f":"AB15-1&\"-\"&RIGHT(AB15,2)","v":"2022-23"},"2023-24","2024-25"]
[null,null,null,null,null,"Actual",{"$f":"$F$17","v":"Actual"},{"$f":"$F$17","v":"Actual"},"Actual","Actual","Actual","Actual","Actual","Actual","Actual","Actual","Actual","Actual","Actual","Actual","Actual","Actual","Actual","Actual","Actual","Actual","Actual","Actual","Estimate","Forecast"]
[]
[null,"Usage Volume"]
[null,"Border","ML",null,null,231793,182622,123803,100542.36,107564,134417,131934,112269,117688,110391.2,187024.6,160312,220696,197467.59999999998,41672.9,100403.8,232303.30000000002,139604.9,145591.30000000002,10963.5,109569.2,102210.09999999999,103535.5,130000,128308.01299999999,null,null,"2024-25 is equal to the 20-year rolling average of actual water sales (with a two year lag) from 2003-04 to 2022-23. "]
{"$rows_left_out":108}
{"sheet":"Outputs","index":5,"n_rows":379,"n_cols":19,"rows_kept":379,"cut":false,"hidden":false,"merged":[[28,16,28,18],[69,16,69,18],[109,16,109,18],[149,16,149,18],[28,12,28,14],[69,12,69,14],[109,12,109,14],[149,12,149,14]]}
[]
[null,"4.  OUTPUTS"]
[null,"This worksheet produces the model outputs, i.e. water usage and entitlement charges."]
[]
[null,"List of tables",null,null,null,null,null,null,null,null,"Row number"]
[null,{"$f":"B20","v":"CHARGES "}]
[null,{"$f":"B28","v":"TABLE 4.1 - TOTAL CHARGES FOR MDB CUSTOMERS"},null,null,null,null,null,null,null,null,{"$f":"ROW(B28)","v":28}]
[null,{"$f":"B69","v":"TABLE 4.2 - WaterNSW CHARGES"},null,null,null,null,null,null,null,null,{"$f":"ROW(B69)","v":69}]
[null,{"$f":"B109","v":"TABLE 4.3 - MDBA/BRC CHARGES"},null,null,null,null,null,null,null,null,{"$f":"ROW(B109)","v":109}]
[null,{"$f":"B149","v":"TABLE 4.4 - FISH RIVER WATER SUPPLY SCHEME CHARGES"},null,null,null,null,null,null,null,null,{"$f":"ROW(B149)","v":149}]
[null,{"$f":"B173","v":"CUSTOMER BILLS "}]
[null,{"$f":"B175","v":"TABLE 4.5 - INDICATIVE BILLS FOR HIGH SECURITY CUSTOMERS  - WaterNSW CHARGES"},null,null,null,null,null,null,null,null,{"$f":"ROW(B175)","v":175}]
[null,{"$f":"B214","v":"TABLE 4.6 - INDICATIVE BILLS FOR GENERAL SECURITY CUSTOMERS  - WaterNSW CHARGES"},null,null,null,null,null,null,null,null,{"$f":"ROW(B214)","v":214}]
[null,{"$f":"B253","v":"TABLE 4.7 - INDICATIVE BILLS FOR HIGH SECURITY AND GENERAL SECURITY CUSTOMERS - MDBA/BRC CHARGES"},null,null,null,null,null,null,null,null,{"$f":"ROW(B253)","v":253}]
[null,{"$f":"B290","v":"TABLE 4.8 - INDICATIVE BILLS FOR CUSTOMERS IN THE FRWS"},null,null,null,null,null,null,null,null,{"$f":"ROW(B290)","v":290}]
[null,{"$f":"B301","v":"REVENUE FORECASTS"}]
[null,{"$f":"B304","v":"TABLE 4.9 - Comparison of WaterNSW'S Forecast Revenue in 2024-25 under different scenarios ($'000, $2020-21)"},null,null,null,null,null,null,null,null,{"$f":"ROW(B304)","v":304}]
[]
[]
[null,"CHARGES "]
{"$rows_left_out":360}
{"sheet":"Report Tables","index":6,"n_rows":172,"n_cols":8,"rows_kept":172,"cut":false,"hidden":false,"merged":[[167,1,168,1],[55,2,55,4],[55,5,55,7],[71,2,71,4],[71,5,71,7],[113,6,113,7],[113,2,113,3],[113,4,113,5],[114,1,115,1],[128,2,128,3],[128,4,128,5],[128,6,128,7],[153,1,154,1],[129,1,130,1],[138,1,139,1]]}
[]
[]
[null,"5.  REPORT TABLES"]
[]
[]
[]
[null,"Data for headings and labels"]
[null,"Tables for (year)",{"$f":"Outputs!$C$23","v":"2024-25"}]
[null,"Previous year",{"$f":"INDEX('2021 Determination Revenue'!$G$20:$J$20,MATCH(C8,'2021 Determination Revenue'!$G$20:$J$20,0)-1)","v":"2023-24"}]
[null,"Review year",{"$f":"$C$8&\" Review\"","v":"2024-25 Review"}]
[null,"Year of assessment",{"$f":"\"($\"&C8&\")\"","v":"($2024-25)"}]
[null,"Current year",{"$f":"\"($\"&C9&\")\"","v":"($2023-24)"}]
[]
[]
[null,"INPUTS"]
[]
[null,"2021 Determination Entitlement and Usage volumes"]
[null,null,"High Security Entitlements","General Security Entitlements","Total Entitlements","Usage (used for pricing)","Plus Aboriginal Culture","Total Usage"]
[null,null,"ML pa",{"$f":"$C$19","v":"ML pa"},{"$f":"$C$19","v":"ML pa"},{"$f":"$C$19","v":"ML pa"}]
[null,"Border",3141,263218,{"$f":"SUM(C20:D20)","v":266359},139453.17299999995,0,{"$f":"SUM(F20:G20)","v":139453.17299999995}]
{"$rows_left_out":153}
{"sheet":" Calculations>>","index":7,"n_rows":5,"n_cols":4,"rows_kept":5,"cut":false,"hidden":false,"merged":[]}
[]
[]
[]
[]
[null,null,null,"Page intentionally left blank"]

{"sheet":"MDB calcs","index":8,"n_rows":209,"n_cols":10,"rows_kept":209,"cut":false,"hidden":false,"merged":[]}
[]
[null,"6.  MDB VALLEY CALCULATIONS"]
[null,"This worksheet calculates the usage volumes, entitlement numbers, entitlement premiums and revenue to be recovered from charges in the MDB valleys."]
[]
[null,"List of tables",null,null,null,null,null,"Row number"]
[null,{"$f":"B16","v":"TABLE 5.1 - USAGE AND ENTITLEMENT VOLUMES FOR CALCULATIONS"},null,null,null,null,null,{"$f":"ROW(B16)","v":16}]
[null,{"$f":"B55","v":"TABLE 5.2 - TWENTY YEAR AVERAGE ACTUAL ALLOCATIONS "},null,null,null,null,null,{"$f":"ROW(B55)","v":55}]
[null,{"$f":"B95","v":"TABLE 5.3 - RELIABILITY RATIO AND HIGH SECURITY ENTITLEMENT PREMIUM"},null,null,null,null,null,{"$f":"ROW(B95)","v":95}]
[null,{"$f":"B125","v":"TABLE 5.4 - TOTAL NUMBER OF 'GS ENTITLEMENT EQUIVALENTS'"},null,null,null,null,null,{"$f":"ROW(B125)","v":125}]
[null,{"$f":"B142","v":"TABLE 5.5 - REVENUE TO BE RECOVERED FROM CHARGES (EXCLUDING MDBA/BRC REVENUE)"},null,null,null,null,null,{"$f":"ROW(B142)","v":142}]
[null,{"$f":"B184","v":"TABLE 5.6 - REVENUE TO BE RECOVERED FROM CHARGES (ONLY MDBA/BRC REVENUE)"},null,null,null,null,null,{"$f":"ROW(B184)","v":184}]
[]
[]
[]
[]
[null,"TABLE 5.1 - USAGE AND ENTITLEMENT VOLUMES FOR CALCULATIONS"]
[null,{"$f":"'2021 Determination Revenue'!B$20","v":"Financial year"},{"$f":"'2021 Determination Revenue'!C$36","v":"Units"},null,null,null,{"$f":"'2021 Determination Revenue'!G$20","v":"2021-22"},{"$f":"'2021 Determination Revenue'!H$20","v":"2022-23"},{"$f":"'2021 Determination Revenue'!I$20","v":"2023-24"},{"$f":"'2021 Determination Revenue'!J$20","v":"2024-25"}]
[]
[]
[null,"Usage Volume (20-yr average)","Note: these 20-year averages are lagged by 2 years."]
{"$rows_left_out":190}
{"sheet":"FRWS calcs","index":9,"n_rows":63,"n_cols":10,"rows_kept":63,"cut":false,"hidden":false,"merged":[]}
[]
[null,"7.  FISH RIVER WATER SUPPLY SCHEME (FRWS) CALCULATIONS"]
[null,"This worksheet calculates the usage, MAQ and required revenue components needed to calculate the FRWS charges for each customer type and each water type."]
[]
[null,"List of tables",null,null,null,"Row number"]
[null,{"$f":"B10","v":"TABLE 6.1 - FISH RIVER USAGE AND MAQ VALUES"},null,null,null,{"$f":"ROW(B10)","v":10}]
[null,{"$f":"B39","v":"TABLE 6.2 - FISH RIVER REQUIRED REVENUE CALCULATIONS"},null,null,null,{"$f":"ROW(B39)","v":39}]
[]
[]
[null,"TABLE 6.1 - FISH RIVER USAGE AND MAQ VALUES"]
[null,{"$f":"'2021 Determination Revenue'!B$19","v":"Financial year ending 30 June"},{"$f":"'2021 Determination Revenue'!C$19","v":"Units"},null,null,null,{"$f":"'2021 Determination Revenue'!G$20","v":"2021-22"},{"$f":"'2021 Determination Revenue'!H$20","v":"2022-23"},{"$f":"'2021 Determination Revenue'!I$20","v":"2023-24"},{"$f":"'2021 Determination Revenue'!J$20","v":"2024-25"}]
[]
[null,"MAQ Level"]
[null,{"$f":"'Updated Volumes'!B$31","v":"Energy Australia "},{"$f":"'Updated Volumes'!$C$20","v":"ML"},null,null,null,{"$f":"'Updated Volumes'!AA125","v":8184},{"$f":"'Updated Volumes'!AB125","v":8184},{"$f":"'Updated Volumes'!AC125","v":8184},{"$f":"'Updated Volumes'!AD125","v":8184}]
[null,{"$f":"'Updated Volumes'!B$33","v":"Minor customers (raw) "},{"$f":"'Updated Volumes'!$C$20","v":"ML"},null,null,null,{"$f":"'Updated Volumes'!AA126","v":18},{"$f":"'Updated Volumes'!AB126","v":17.2},{"$f":"'Updated Volumes'!AC126","v":17.2},{"$f":"'Updated Volumes'!AD126","v":17.2}]
[null,{"$f":"'Updated Volumes'!B$34","v":"Minor customers (filtered) "},{"$f":"'Updated Volumes'!$C$20","v":"ML"},null,null,null,{"$f":"'Updated Volumes'!AA127","v":47.800000000000004},{"$f":"'Updated Volumes'!AB127","v":47.6},{"$f":"'Updated Volumes'!AC127","v":47.6},{"$f":"'Updated Volumes'!AD127","v":47.6}]
[]
[null,"Total usage"]
[null,"Note: these averages are lagged by 2 years."]
[null,{"$f":"'Updated Volumes'!B$31","v":"Energy Australia "},"ML",null,null,null,{"$f":"AVERAGE('Updated Volumes'!F31:Y31)/1000","v":1849.8123999999998},{"$f":"AVERAGE('Updated Volumes'!G31:Z31)/1000","v":1781.0928000000001},{"$f":"AVERAGE('Updated Volumes'!H31:AA31)/1000","v":1647.7227},{"$f":"AVERAGE('Updated Volumes'!I31:AB31)/1000","v":1547.6551000000002}]
{"$rows_left_out":44}
{"sheet":"WaterNSW Sheets >>","index":10,"n_rows":0,"n_cols":0,"rows_kept":0,"cut":false,"hidden":true,"merged":[]}