{"text_format":"1","workbook":"xlsx","n_sheets":7,"sheets":["Examples","USER GUIDE","INPUT","RESULTS","CALC","CONVERSION","DO NOT DELETE"],"not_rendered":{"charts":16,"images":2,"macros":1,"external_links":0,"defined_names":20,"comments":1,"pivot_tables":0},"unopened":[],"bounds":{"document_bytes":16777216,"sheet_cells":100000,"rows_first":2000,"rows_last":500,"rows_between":2000,"halvings":0,"cell_chars":16384,"cell_head_chars":4096},"cells_cut":0,"cells_raw":0,"read":"whole","date_system":"1900"}

{"sheet":"Examples","index":0,"n_rows":42,"n_cols":27,"rows_kept":42,"cut":false,"hidden":true,"merged":[]}
["IPART COLOUR CODES  FOR MODELS AND INFORMATION REQUESTS"]
[null,"NB  ALWAYS DESCRIBE THE COLOUR CODE USED IN YOUR MODEL "]
[null,"Note: If you use the formats for the inputs provided in this template, input cells will always be unprotected even when you protect the worksheet"]
[null,null,null,null,null,null,null,"use this column cell to \"paint\" input cells for numbers (NOT for percentages)"]
[null,null,null,null,null,null,null,null,"use this column cell to \"paint\" input cells for percentages (NOT numbers)"]
[null,"Models"]
[null,"Option 1 (best for models that will be used repeatedly)",null,null,null,null,{"$f":"G22","v":"numbers"},{"$f":"H22","v":"%"},"Option 2 (best for smaller models for once-off and/or own use)"]
[null,"Inputs",null,null,null,null,4442,0.08,"Inputs",67,0.03]
[null,"Links from other files (green)",null,null,null,null,null,null,{"$f":"B9","v":"Links from other files (green)"}]
[null,"Error check (check =0)",null,null,null,null,null,null,"Error check (check =0)"]
[null,"Error warnings, messages and unusual calculation assumptions",null,null,null,null,null,null,{"$f":"B11","v":"Error warnings, messages and unusual calculation assumptions"}]
[null,"Indicate change in formula across row with a double red line",null,null,null,null,null,null,"..change in formula across row with a double red line"]
[null,"Key outputs",null,null,null,null,null,null,{"$f":"B13","v":"Key outputs"}]
[null,"Note: can combine options, eg:"]
[null,"Example 1",null,"Inputs for model runs",null,"AND"]
[null,null,"Hard-coded protected inputs that can't be changed (eg credit ratio and ratings tables)"]
[]
[null,"Example 2",null,"Inputs can be links to other files in some runs"]
[null,null,null,"Attention can be drawn to different/unusual inputs "]
[null,null,null,null,null,null,null,"use this column cell to \"paint\" input cells for numbers (NOT for percentages)"]
[null,"Information Requests",null,null,null,null,null,null,"use this column cell to \"paint\" input cells for percentages (NOT numbers)"]
[null,null,null,null,null,null,"numbers","%"]
[null,"compulsory inputs (numbers and text)",null,null,null,null,234,0.24]
[null,"Forecast Inputs",null,null,null,null,667,0.05]
[null,"Error warnings and messages"]
[null,"Error check (check =0)"]
[]
[null,"QA notes - annotation or documenation by QA staff"]
[]
[]
{"$rows_left_out":13}
{"sheet":"USER GUIDE","index":1,"n_rows":95,"n_cols":5,"rows_kept":95,"cut":false,"hidden":false,"merged":[[85,1,85,6],[90,2,90,5],[47,1,47,6],[52,2,52,6],[53,1,53,6],[49,1,49,6],[50,2,50,6],[51,2,51,6],[75,2,75,6],[66,1,66,5],[77,2,77,5],[64,1,64,6],[79,1,79,6],[78,1,78,3],[84,1,84,3],[70,2,70,6],[61,4,61,6],[65,1,65,3],[54,1,54,2],[54,4,54,6],[58,1,59,2],[55,1,56,2],[55,4,55,6],[56,4,56,6],[57,4,57,6],[58,4,58,6],[59,4,59,6],[98,1,98,5],[19,1,19,2],[4,1,4,5],[5,1,5,5],[12,2,12,4],[11,2,11,5],[13,1,13,5],[15,1,15,3],[18,1,18,3],[8,1,8,5],[14,1,14,5],[10,2,10,5],[7,1,7,4],[29,4,29,6],[19,4,19,6],[20,4,20,6],[69,2,69,6],[74,2,74,6],[60,4,60,6],[94,1,94,5],[23,4,23,6],[24,4,24,6],[25,4,25,6],[26,4,26,6],[27,4,27,6],[28,4,28,6],[44,4,44,6],[34,4,34,6],[38,4,38,6],[30,4,30,6],[31,4,31,6],[35,4,35,6],[9,1,9,5],[17,1,17,5],[48,1,48,2],[46,1,46,6],[30,2,31,2],[33,4,33,6],[32,4,32,6],[39,4,39,6],[40,4,40,6],[42,4,42,6],[43,4,43,6],[45,1,45,3],[22,4,22,6],[21,4,21,6],[41,4,41,6]]}
[]
[null,"LANDHOLDER COMPENSATION MODEL"]
[]
[null,"1. PURPOSE OF THE MODEL"]
[null,"The purpose of the model is to estimate benchmark compensation and incentive payments for landholders hosting coal seam gas exploration and production in NSW.   "]
[]
[null,"2. STRUCTURE OF THE MODEL"]
[null,"The model contains four worksheets. "]
[null,"INPUT worksheet: This worksheet is where you enter information about your circumstances.    Section 3 below provides more information on this worksheet.  At any time, click the “RESET” button on the top right hand corner to clear all inputs."]
[null,"RESULTS worksheet: This worksheet shows compensation and incentive payments based on the information provided in the INPUT worksheet.  It consists of three parts:"]
[null,null,"▼  PART A shows compensation payments.  There are two options.  You can show a single upfront payment by selecting \"LUMP-SUM UPFRONT\" or a series of annual payments by selecting \"ANNUAL PAYMENT\"."]
[null,null,"▼  PART B shows incentive payments such as production bonuses that are provided in addition to compensation.  "]
[null,null,"▼  PART C graphically shows a schedule of compensation and incentive payments over your access agreement period."]
[null,"CALC worksheet: This worksheet provides detailed calculations of compensation and incentive payments. More information about this worksheet including how the model estimates compensation and incentive payments is provided in Section 4 of this guide."]
[null,"CONVERSION worksheet: The model calculates payments based on land area in hectares and land value per hectare.  If you have different units for your land area and land value, you can use this worksheet to convert into hectares. "]
[]
[null,"3. HOW TO USE THE INPUT WORKSHEET"]
[null,"The INPUT worksheet consists of two parts.  PART A requires inputs for compensation and PART B requires inputs for incentive payments.  "]
[null,"PART A: INPUTS FOR COMPENSATION PAYMENTS"]
[null,"Category",null,"Inputs","Description"]
[null,"(1) Land access agreement details",null,"How long is your access agreement?","Enter an estimate of the number of years for your land access agreement. "]
[null,"(2) Landholding details",null,"What is the total area of your land?","Enter the total area of your property in hectares. "]
[null,null,null,"What is the estimated value of your land per hectare?","Enter an estimate of the value of your land in dollars per hectare.  This is the value of your land without any gas development on it. "]
[null,null,null,"What is the rental value of land?","Enter an estimate of the rental value of your land as a percentage of land value.   For reference, NSW Department of Primary Industries indicates that rental value ranges from around 5% to 9% of the value of land for dryland agriculture, and around 10% of the value of land for irrigated lands.  See comment box for reference."]
[null,"(3) Estimated impact on land and landholder"]
[null,"     (a)  Directly impacted land",null,"In the first year"]
[null,null,": Directly impacted land is land occupied by (or set aside for) CSG infrastructure by gas company. ","   What is the total area of land used by gas company?","This is the area of land occupied by the gas company during construction of CSG infrastructure such as wells, access roads, pipelines etc.  "]
[null,null,null,"From the second year"]
[null,null,null,"   What is the total area of land used by gas company?","This is the area of land occupied by CSG infrastructure once construction is completed (assumed to be from year two onwards).  Generally, this area will be smaller than the area of land used during construction."]
[null,"     (b)  Residual land",null,"In the first year"]
{"$rows_left_out":66}
{"sheet":"INPUT","index":2,"n_rows":40,"n_cols":4,"rows_kept":40,"cut":false,"hidden":false,"merged":[]}
[]
[null,"INPUTS"]
[null,"PART A.  Inputs for Compensation Payment"]
[]
[null,"1. Land access agreement details"]
[null,"   How long is your access agreement for?",20,"years"]
[]
[null,"2. Landholding details"]
[null,"   What is the total area of your land in hectares? If you have land area in a different unit, use the \"CONVERSION\" worksheet to convert into hectares.",200,"hectares"]
[null,"   What is the estimated value of your land per hectare? If you have land value in a different unit, use the \"CONVERSION\" worksheet to convert into $/hectare.",15000,"per hectare"]
[null,"   What is the rental value of land as a percentage of land value?",0.08,"percent"]
[null,"3. Estimated impact on land and landholder"]
[null,"(a) Directly impacted land"]
[null,"   In the first year of land access agreement"]
[null,"      What is the total area of land used by gas company?",10,"hectare"]
[null,"   From the second year of land access agreement"]
[null,"      What is the total area of land used by gas company?",5.25,"hectare"]
[null,"(b) Residual land (your total land area excluding directly impacted land)"]
[null,"   In the first year of land access agreement"]
[null,"      What is an estimated reduction in the value of residual land due to severance?",0,"percent"]
[null,"      What is an estimated reduction in the value of residual land due to injurious affection?",0.2,"percent"]
[null,"   From the second year of land access agreement"]
[null,"      What is an estimated reduction in the value of residual land due to severance?",0,"percent"]
[null,"      What is an estimated reduction in the value of residual land due to injurious affection?",0.1,"percent"]
[null,"4.  Cost of landholder time and expert advice"]
[null,"   How many hours did you spend negotiating your access agreement?",150,"hours in total"]
[null,"   How many hours do you expect to spend each year on matters related to you access agreement?",50,"hours per annum"]
[null,"   Enter an estimate of the value of your time",50,"per hour"]
[null,"   How much did you spend on fees for professional advice (eg, legal, valuation, taxation and other fees) including GST?",40000,"per agreement"]
[null,"5. Other assumptions "]
{"$rows_left_out":11}
{"sheet":"RESULTS","index":3,"n_rows":106,"n_cols":10,"rows_kept":106,"cut":false,"hidden":false,"merged":[[4,1,4,3],[3,5,3,7],[3,9,3,15]]}
[]
[null,"RESULTS"]
[null,"PART A. Compensation Payment",null,null,null,"PART B. Incentive Payment",null,null,null,"PART C.  Payment Schedule"]
[null,"Payment Structure: ",null,null,null,"A schedule of your incentive payments is provided below.  ",null,null,null,"The graph below shows compensation payment schedule over your access agreement period."]
[null,"About Payment Structure: Please select an option to get an estimate of your compensation.  Select \"Lump-sum Upfront Payment\" to get a single upfront payment. Select \"Annual Payments\" for a series of annual payments."]
[{"$f":"MAX(COUNT(B7:B106),COUNT(F7:F106))","v":20},"Beginning of Year","Annual Payment",null,null,"Beginning of Year","Annual Payment"]
[1,{"$f":"CALC!B7:B106","v":1},{"$f":"IF(CALC!G7:G106>0,CALC!G7:G106,\"\")","v":105100},null,null,{"$f":"IF(CALC!J7:L106>0,CALC!J7:L106,\"\")","v":1},""]
[2,2,32974.25,null,null,2,""]
[3,3,33798.606249999997,null,null,3,""]
[4,4,34643.571406249997,null,null,4,""]
[5,5,35509.660691406243,null,null,5,17897.727272727272]
[6,6,36397.40220869139,null,null,6,18345.170454545452]
[7,7,37307.337263908674,null,null,7,18803.799715909088]
[8,8,38240.020695506399,null,null,8,19273.894708806816]
[9,9,39196.021212894055,null,null,9,19755.742076526985]
[10,10,40175.921743216393,null,null,10,20249.635628440155]
[11,11,41180.319786796812,null,null,11,20755.876519151159]
[12,12,42209.827781466724,null,null,12,21274.773432129939]
[13,13,43265.073476003388,null,null,13,21806.642767933186]
[14,14,44346.700312903478,null,null,14,22351.80883713151]
[15,15,45455.367820726053,null,null,15,22910.604058059798]
[16,16,46591.752016244216,null,null,16,23483.369159511294]
[17,17,47756.545816650309,null,null,17,24070.453388499074]
[18,18,48950.459462066567,null,null,18,24672.214723211549]
[19,19,50174.220948618226,null,null,19,25289.020091291837]
[20,20,51428.576472333691,null,null,20,25921.245593574135]
[21,"","",null,null,"",""]
[22,"","",null,null,"",""]
[23,"","",null,null,"",""]
[24,"","",null,null,"",""]
{"$rows_left_out":77}
{"sheet":"CALC","index":4,"n_rows":106,"n_cols":12,"rows_kept":106,"cut":false,"hidden":false,"merged":[]}
[]
[null,"DETAILED CALCULATIONS"]
[null,null,null,null,null,null,null,"check = 0",{"$f":"(G8/(Interest_Rate-Inflation)*(1-((1+Inflation)/(1+Interest_Rate))^(Access_Period-1))+G7)-I5","v":3.0267983675003052E-9}]
[null,"PART A.  Annual Compensation Payment ($)",null,null,null,null,null,"PART B.  Lump-Sum Payment ($)",null,"PART C.  Incentive Payment ($)"]
[null,null,null,null,null,null,null,"Total (Nominal)",{"$f":"SUM(I7:I106)","v":660561.16319096275}]
[0,"Beginning of Year ","Rent for land","Payment for severance","Payment for injurious affection","Payment for landholder time and expert advice","Annual Total (Nominal)","Beginning of Year ","PV of Annual Total (Nominal)","Beginning of Year ","Annual Total (Nominal)",{"$f":"\"Incentive Payment in Year \"&(Production_Year+1) &\" dollar\"","v":"Incentive Payment in Year 5 dollar"}]
[1,{"$f":"IF(A7<=Access_Period,A7,\"\")","v":1},{"$f":"IF(A7<=Access_Period,Land_YR1*MV_Land*RV_Land,\"\")","v":12000},{"$f":"IF(A7<=Access_Period,(Total_Landholding-Land_YR1)*MV_Land*RV_Land*Severance_YR1,\"\")","v":0},{"$f":"IF(A7<=Access_Period,(Total_Landholding-Land_YR1)*MV_Land*RV_Land*IA_YR1,\"\")","v":45600},{"$f":"IF(A7<=Access_Period,Initial_Time_Spent*Value_of_Time+Advice_Cost,\"\")","v":47500},{"$f":"IF(SUM(C7:F7)>0,SUM(C7:F7),0)","v":105100},{"$f":"B7","v":1},{"$f":"G7","v":105100},{"$f":"B7","v":1},{"$f":"IF(AND(J7>=Production_Year+1,J7<=Access_Period),IF(J7>Production_Year+1,L7*(1+Inflation)^(J7-(Production_Year+1)),L7),0)","v":0},{"$f":"IF(AND(Production_Year<=CALC!$A6,$A7<=Access_Period),IF(Incentive_Option=1,INPUT!$C$38*INPUT!$C$39/100*(Land_YR2/INPUT!$C$40),IF(Incentive_Option=2,INPUT!$C$38*INPUT!$C$39/INPUT!$C$40,INPUT!$C$38)),0)","v":0}]
[2,2,{"$f":"IF(A8<=Access_Period,Land_YR2*MV_Land*RV_Land*(1+Inflation)^(A8-$A$7),\"\")","v":6457.4999999999991},{"$f":"IF(A8<=Access_Period,(Total_Landholding-Land_YR2)*MV_Land*RV_Land*Severance_YR2*(1+Inflation)^(A8-$A$7),\"\")","v":0},{"$f":"IF(A8<=Access_Period,(Total_Landholding-Land_YR2)*MV_Land*RV_Land*IA_YR2*(1+Inflation)^(A8-$A$7),\"\")","v":23954.249999999996},{"$f":"IF(A8<=Access_Period,Ongoing_Time_Spent*Value_of_Time*(1+Inflation)^(A8-$A$7),\"\")","v":2562.5},{"$f":"IF(SUM(C8:F8)>0,SUM(C8:F8),0)","v":32974.25},{"$f":"B8","v":2},{"$f":"G8*(1+Interest_Rate)^-(A8-$A$7)","v":31859.178743961354},{"$f":"B8","v":2},0,{"$f":"IF(AND(Production_Year<=CALC!$A7,$A8<=Access_Period),IF(Incentive_Option=1,INPUT!$C$38*INPUT!$C$39/100*(Land_YR2/INPUT!$C$40),IF(Incentive_Option=2,INPUT!$C$38*INPUT!$C$39/INPUT!$C$40,INPUT!$C$38)),0)","v":0}]
[3,3,6618.9374999999991,0,24553.106249999997,{"$f":"IF(A9<=Access_Period,Ongoing_Time_Spent*Value_of_Time*(1+Inflation)^(A9-$A$7),\"\")","v":2626.5625},33798.606249999997,3,31551.360591845783,3,0,{"$f":"IF(AND(Production_Year<=CALC!$A8,$A9<=Access_Period),IF(Incentive_Option=1,INPUT!$C$38*INPUT!$C$39/100*(Land_YR2/INPUT!$C$40),IF(Incentive_Option=2,INPUT!$C$38*INPUT!$C$39/INPUT!$C$40,INPUT!$C$38)),0)","v":0}]
[4,4,6784.4109374999989,0,25166.933906249997,2692.2265624999995,34643.571406249997,4,31246.516528156459,4,0,{"$f":"IF(AND(Production_Year<=CALC!$A9,$A10<=Access_Period),IF(Incentive_Option=1,INPUT!$C$38*INPUT!$C$39/100*(Land_YR2/INPUT!$C$40),IF(Incentive_Option=2,INPUT!$C$38*INPUT!$C$39/INPUT!$C$40,INPUT!$C$38)),0)","v":0}]
[5,5,6954.0212109374988,0,25796.107253906244,2759.5322265624995,35509.660691406243,5,30944.617817739483,5,17897.727272727272,{"$f":"IF(AND(Production_Year<=CALC!$A10,$A11<=Access_Period),IF(Incentive_Option=1,INPUT!$C$38*INPUT!$C$39/100*(Land_YR2/INPUT!$C$40),IF(Incentive_Option=2,INPUT!$C$38*INPUT!$C$39/INPUT!$C$40,INPUT!$C$38)),0)","v":17897.727272727272}]
[6,6,7127.8717412109354,0,26441.009935253896,2828.5205322265615,36397.40220869139,6,30645.636003075331,6,18345.170454545452,{"$f":"IF(AND(Production_Year<=CALC!$A11,$A12<=Access_Period),IF(Incentive_Option=1,INPUT!$C$38*INPUT!$C$39/100*(Land_YR2/INPUT!$C$40),IF(Incentive_Option=2,INPUT!$C$38*INPUT!$C$39/INPUT!$C$40,INPUT!$C$38)),0)","v":17897.727272727272}]
[7,7,7306.0685347412082,0,27102.035183635242,2899.2335455322254,37307.337263908674,7,30349.542901596342,7,18803.799715909088,{"$f":"IF(AND(Production_Year<=CALC!$A12,$A13<=Access_Period),IF(Incentive_Option=1,INPUT!$C$38*INPUT!$C$39/100*(Land_YR2/INPUT!$C$40),IF(Incentive_Option=2,INPUT!$C$38*INPUT!$C$39/INPUT!$C$40,INPUT!$C$38)),0)","v":17897.727272727272}]
[8,8,7488.7202481097383,0,27779.586063226125,2971.714384170531,38240.020695506399,8,30056.310603030201,8,19273.894708806816,{"$f":"IF(AND(Production_Year<=CALC!$A13,$A14<=Access_Period),IF(Incentive_Option=1,INPUT!$C$38*INPUT!$C$39/100*(Land_YR2/INPUT!$C$40),IF(Incentive_Option=2,INPUT!$C$38*INPUT!$C$39/INPUT!$C$40,INPUT!$C$38)),0)","v":17897.727272727272}]
[9,9,7675.9382543124811,0,28474.075714806775,3046.0072437747945,39196.021212894055,9,29765.911466769045,9,19755.742076526985,{"$f":"IF(AND(Production_Year<=CALC!$A14,$A15<=Access_Period),IF(Incentive_Option=1,INPUT!$C$38*INPUT!$C$39/100*(Land_YR2/INPUT!$C$40),IF(Incentive_Option=2,INPUT!$C$38*INPUT!$C$39/INPUT!$C$40,INPUT!$C$38)),0)","v":17897.727272727272}]
[10,10,7867.8367106702926,0,29185.927607676942,3122.1574248691636,40175.921743216393,10,29478.318119264022,10,20249.635628440155,{"$f":"IF(AND(Production_Year<=CALC!$A15,$A16<=Access_Period),IF(Incentive_Option=1,INPUT!$C$38*INPUT!$C$39/100*(Land_YR2/INPUT!$C$40),IF(Incentive_Option=2,INPUT!$C$38*INPUT!$C$39/INPUT!$C$40,INPUT!$C$38)),0)","v":17897.727272727272}]
[11,11,8064.5326284370494,0,29915.575797868863,3200.2113604908927,41180.319786796812,11,29193.503451445053,11,20755.876519151159,{"$f":"IF(AND(Production_Year<=CALC!$A16,$A17<=Access_Period),IF(Incentive_Option=1,INPUT!$C$38*INPUT!$C$39/100*(Land_YR2/INPUT!$C$40),IF(Incentive_Option=2,INPUT!$C$38*INPUT!$C$39/INPUT!$C$40,INPUT!$C$38)),0)","v":17897.727272727272}]
[12,12,8266.1459441479765,0,30663.465192815587,3280.2166445031648,42209.827781466724,12,28911.440616165386,12,21274.773432129939,{"$f":"IF(AND(Production_Year<=CALC!$A17,$A18<=Access_Period),IF(Incentive_Option=1,INPUT!$C$38*INPUT!$C$39/100*(Land_YR2/INPUT!$C$40),IF(Incentive_Option=2,INPUT!$C$38*INPUT!$C$39/INPUT!$C$40,INPUT!$C$38)),0)","v":17897.727272727272}]
[13,13,8472.7995927516749,0,31430.051822635975,3362.2220606157439,43265.073476003388,13,28632.103025671033,13,21806.642767933186,{"$f":"IF(AND(Production_Year<=CALC!$A18,$A19<=Access_Period),IF(Incentive_Option=1,INPUT!$C$38*INPUT!$C$39/100*(Land_YR2/INPUT!$C$40),IF(Incentive_Option=2,INPUT!$C$38*INPUT!$C$39/INPUT!$C$40,INPUT!$C$38)),0)","v":17897.727272727272}]
[14,14,8684.6195825704654,0,32215.803118201871,3446.2776121311372,44346.700312903478,14,28355.464349094513,14,22351.80883713151,{"$f":"IF(AND(Production_Year<=CALC!$A19,$A20<=Access_Period),IF(Incentive_Option=1,INPUT!$C$38*INPUT!$C$39/100*(Land_YR2/INPUT!$C$40),IF(Incentive_Option=2,INPUT!$C$38*INPUT!$C$39/INPUT!$C$40,INPUT!$C$38)),0)","v":17897.727272727272}]
[15,15,8901.7350721347266,0,33021.198196156911,3532.4345524344153,45455.367820726053,15,28081.498509972815,15,22910.604058059798,{"$f":"IF(AND(Production_Year<=CALC!$A20,$A21<=Access_Period),IF(Incentive_Option=1,INPUT!$C$38*INPUT!$C$39/100*(Land_YR2/INPUT!$C$40),IF(Incentive_Option=2,INPUT!$C$38*INPUT!$C$39/INPUT!$C$40,INPUT!$C$38)),0)","v":17897.727272727272}]
[16,16,9124.2784489380956,0,33846.728151060845,3620.7454162452764,46591.752016244216,16,27810.179683789513,16,23483.369159511294,{"$f":"IF(AND(Production_Year<=CALC!$A21,$A22<=Access_Period),IF(Incentive_Option=1,INPUT!$C$38*INPUT!$C$39/100*(Land_YR2/INPUT!$C$40),IF(Incentive_Option=2,INPUT!$C$38*INPUT!$C$39/INPUT!$C$40,INPUT!$C$38)),0)","v":17897.727272727272}]
[17,17,9352.385410161547,0,34692.896354837358,3711.264051651408,47756.545816650309,17,27541.482295540336,17,24070.453388499074,{"$f":"IF(AND(Production_Year<=CALC!$A22,$A23<=Access_Period),IF(Incentive_Option=1,INPUT!$C$38*INPUT!$C$39/100*(Land_YR2/INPUT!$C$40),IF(Incentive_Option=2,INPUT!$C$38*INPUT!$C$39/INPUT!$C$40,INPUT!$C$38)),0)","v":17897.727272727272}]
[18,18,9586.1950454155849,0,35560.21876370829,3804.0456529426924,48950.459462066567,18,27275.381017322557,18,24672.214723211549,{"$f":"IF(AND(Production_Year<=CALC!$A23,$A24<=Access_Period),IF(Incentive_Option=1,INPUT!$C$38*INPUT!$C$39/100*(Land_YR2/INPUT!$C$40),IF(Incentive_Option=2,INPUT!$C$38*INPUT!$C$39/INPUT!$C$40,INPUT!$C$38)),0)","v":17897.727272727272}]
[19,19,9825.8499215509746,0,36449.224232800996,3899.1467942662598,50174.220948618226,19,27011.85076594746,19,25289.020091291837,{"$f":"IF(AND(Production_Year<=CALC!$A24,$A25<=Access_Period),IF(Incentive_Option=1,INPUT!$C$38*INPUT!$C$39/100*(Land_YR2/INPUT!$C$40),IF(Incentive_Option=2,INPUT!$C$38*INPUT!$C$39/INPUT!$C$40,INPUT!$C$38)),0)","v":17897.727272727272}]
[20,20,10071.496169589749,0,37360.454838621023,3996.6254641229166,51428.576472333691,20,26750.866700575996,20,25921.245593574135,{"$f":"IF(AND(Production_Year<=CALC!$A25,$A26<=Access_Period),IF(Incentive_Option=1,INPUT!$C$38*INPUT!$C$39/100*(Land_YR2/INPUT!$C$40),IF(Incentive_Option=2,INPUT!$C$38*INPUT!$C$39/INPUT!$C$40,INPUT!$C$38)),0)","v":17897.727272727272}]
[21,"","","","","",0,"",0,"",0,{"$f":"IF(AND(Production_Year<=CALC!$A26,$A27<=Access_Period),IF(Incentive_Option=1,INPUT!$C$38*INPUT!$C$39/100*(Land_YR2/INPUT!$C$40),IF(Incentive_Option=2,INPUT!$C$38*INPUT!$C$39/INPUT!$C$40,INPUT!$C$38)),0)","v":0}]
[22,"","","","","",0,"",0,"",0,{"$f":"IF(AND(Production_Year<=CALC!$A27,$A28<=Access_Period),IF(Incentive_Option=1,INPUT!$C$38*INPUT!$C$39/100*(Land_YR2/INPUT!$C$40),IF(Incentive_Option=2,INPUT!$C$38*INPUT!$C$39/INPUT!$C$40,INPUT!$C$38)),0)","v":0}]
[23,"","","","","",0,"",0,"",0,{"$f":"IF(AND(Production_Year<=CALC!$A28,$A29<=Access_Period),IF(Incentive_Option=1,INPUT!$C$38*INPUT!$C$39/100*(Land_YR2/INPUT!$C$40),IF(Incentive_Option=2,INPUT!$C$38*INPUT!$C$39/INPUT!$C$40,INPUT!$C$38)),0)","v":0}]
[24,"","","","","",0,"",0,"",0,{"$f":"IF(AND(Production_Year<=CALC!$A29,$A30<=Access_Period),IF(Incentive_Option=1,INPUT!$C$38*INPUT!$C$39/100*(Land_YR2/INPUT!$C$40),IF(Incentive_Option=2,INPUT!$C$38*INPUT!$C$39/INPUT!$C$40,INPUT!$C$38)),0)","v":0}]
{"$rows_left_out":77}
{"sheet":"CONVERSION","index":5,"n_rows":9,"n_cols":7,"rows_kept":9,"cut":false,"hidden":false,"merged":[[2,1,2,5]]}
[]
[null,"CONVERSION CALCULATOR"]
[null,"This Compensation Model calculates compensation based on land area in hectares and land value ($) per hectare.  If you have different units for your land area and value, please use the following calculator to convert your figures to hectares."]
[null,"Select your land and valuation unit:",1]
[]
[]
[null,{"$f":" \"Enter land area in \" & CHOOSE(C4,'DO NOT DELETE'!F4,'DO NOT DELETE'!F5,'DO NOT DELETE'!F6,'DO NOT DELETE'!F7)","v":"Enter land area in Square metre"},null,{"$f":"CHOOSE(C4,'DO NOT DELETE'!F4,'DO NOT DELETE'!F5,'DO NOT DELETE'!F6,'DO NOT DELETE'!F7)","v":"Square metre"},null,{"$f":"IF(ISNUMBER(C7),CHOOSE(C4,'DO NOT DELETE'!G4,'DO NOT DELETE'!G5,'DO NOT DELETE'!G6,'DO NOT DELETE'!G7)*C7,\"\")","v":""},"Hectares"]
[]
[null,{"$f":" \"Enter land value in $ per \" & CHOOSE(C4,'DO NOT DELETE'!F4,'DO NOT DELETE'!F5,'DO NOT DELETE'!F6,'DO NOT DELETE'!F7)","v":"Enter land value in $ per Square metre"},null,{"$f":"\"per \" & CHOOSE(C4,'DO NOT DELETE'!F4,'DO NOT DELETE'!F5,'DO NOT DELETE'!F6,'DO NOT DELETE'!F7)","v":"per Square metre"},null,{"$f":"IF(ISNUMBER(C9),C9*(1/CHOOSE(C4,'DO NOT DELETE'!G4,'DO NOT DELETE'!G5,'DO NOT DELETE'!G6,'DO NOT DELETE'!G7)),\"\")","v":""},"per Hectare"]

{"sheet":"DO NOT DELETE","index":6,"n_rows":8,"n_cols":7,"rows_kept":8,"cut":false,"hidden":true,"merged":[[2,1,2,3]]}
[]
["Incentive Payment",null,null,null,null,"Conversion Chart"]
["Type","Payment based on",null,null,null,null,"Hectare"]
[null,"(1) Royalty payment","(2) Meeting target production","(3) Gas company provided an estimate of annual incentive payment",null,"Square metre",1E-4]
["Statutory annual royalty payment","   Gas company's statutory annual royalty payment","   Total number of producing wells in licence area that exceed the production target","   An estimate of annual incentive payments in the first year of production",null,"Square kilometre",100]
["Producing well meeting the target production","   % of royalty gas company contributes to incentive fund","   Amount of money per well a gas company contributes to the incentive fund in the first year of production when meeting a target level of gas production","  ",null,"Acre",0.40468564223999998]
["Estimated annual incentive payment","   Total licence area for production","   Total number of eligible landholders in licence area","  ",null,"Square Yard",8.3612735999999998E-5]
[null,null,null,"   "]