{"text_format":"1","workbook":"xlsx","n_sheets":7,"sheets":["Examples","USER GUIDE","INPUT","RESULTS","CALC","CONVERSION","DO NOT DELETE"],"not_rendered":{"charts":16,"images":13,"macros":1,"external_links":0,"defined_names":12,"comments":1,"pivot_tables":0},"unopened":[],"bounds":{"document_bytes":16777216,"sheet_cells":100000,"rows_first":2000,"rows_last":500,"rows_between":2000,"halvings":0,"cell_chars":16384,"cell_head_chars":4096},"cells_cut":0,"cells_raw":0,"read":"whole","date_system":"1900"}

{"sheet":"Examples","index":0,"n_rows":42,"n_cols":27,"rows_kept":42,"cut":false,"hidden":true,"merged":[]}
["IPART COLOUR CODES  FOR MODELS AND INFORMATION REQUESTS"]
[null,"NB  ALWAYS DESCRIBE THE COLOUR CODE USED IN YOUR MODEL "]
[null,"Note: If you use the formats for the inputs provided in this template, input cells will always be unprotected even when you protect the worksheet"]
[null,null,null,null,null,null,null,"use this column cell to \"paint\" input cells for numbers (NOT for percentages)"]
[null,null,null,null,null,null,null,null,"use this column cell to \"paint\" input cells for percentages (NOT numbers)"]
[null,"Models"]
[null,"Option 1 (best for models that will be used repeatedly)",null,null,null,null,{"$f":"G22","v":"numbers"},{"$f":"H22","v":"%"},"Option 2 (best for smaller models for once-off and/or own use)"]
[null,"Inputs",null,null,null,null,4442,0.08,"Inputs",67,0.03]
[null,"Links from other files (green)",null,null,null,null,null,null,{"$f":"B9","v":"Links from other files (green)"}]
[null,"Error check (check =0)",null,null,null,null,null,null,"Error check (check =0)"]
{"$rows_left_out":33}
{"sheet":"USER GUIDE","index":1,"n_rows":206,"n_cols":2,"rows_kept":206,"cut":false,"hidden":false,"merged":[[204,1,204,17],[205,1,205,17]]}
[]
[null,"LANDHOLDER COMPENSATION MODEL"]
[]
[]
[]
[]
[]
[]
[]
[]
{"$rows_left_out":197}
{"sheet":"INPUT","index":2,"n_rows":36,"n_cols":37,"rows_kept":36,"cut":false,"hidden":false,"merged":[[30,1,30,3],[3,1,3,2],[35,1,35,8]]}
[null,"INPUTS"]
[null,"PART A.  Inputs for Compensation Payments"]
[null,"PLEASE ENTER VALUES ONLY IN COLOURED CELLS",null,"Unit","Fixed input",null,null,"Access Agreement Year"]
[null,null,null,null,null,null,{"$f":"IF('DO NOT DELETE'!A11<=Access_Period,'DO NOT DELETE'!A11,IF(AND(Access_Period>0,'DO NOT DELETE'!A11=(Access_Period+1)),'DO NOT DELETE'!$AF$11,\"\"))","v":1},{"$f":"IF('DO NOT DELETE'!B11<=Access_Period,'DO NOT DELETE'!B11,IF(AND(Access_Period>0,'DO NOT DELETE'!B11=(Access_Period+1)),'DO NOT DELETE'!$AF$11,\"\"))","v":2},{"$f":"IF('DO NOT DELETE'!C11<=Access_Period,'DO NOT DELETE'!C11,IF(AND(Access_Period>0,'DO NOT DELETE'!C11=(Access_Period+1)),'DO NOT DELETE'!$AF$11,\"\"))","v":3},{"$f":"IF('DO NOT DELETE'!D11<=Access_Period,'DO NOT DELETE'!D11,IF(AND(Access_Period>0,'DO NOT DELETE'!D11=(Access_Period+1)),'DO NOT DELETE'!$AF$11,\"\"))","v":4},{"$f":"IF('DO NOT DELETE'!E11<=Access_Period,'DO NOT DELETE'!E11,IF(AND(Access_Period>0,'DO NOT DELETE'!E11=(Access_Period+1)),'DO NOT DELETE'!$AF$11,\"\"))","v":5},{"$f":"IF('DO NOT DELETE'!F11<=Access_Period,'DO NOT DELETE'!F11,IF(AND(Access_Period>0,'DO NOT DELETE'!F11=(Access_Period+1)),'DO NOT DELETE'!$AF$11,\"\"))","v":6},{"$f":"IF('DO NOT DELETE'!G11<=Access_Period,'DO NOT DELETE'!G11,IF(AND(Access_Period>0,'DO NOT DELETE'!G11=(Access_Period+1)),'DO NOT DELETE'!$AF$11,\"\"))","v":7},{"$f":"IF('DO NOT DELETE'!H11<=Access_Period,'DO NOT DELETE'!H11,IF(AND(Access_Period>0,'DO NOT DELETE'!H11=(Access_Period+1)),'DO NOT DELETE'!$AF$11,\"\"))","v":8},{"$f":"IF('DO NOT DELETE'!I11<=Access_Period,'DO NOT DELETE'!I11,IF(AND(Access_Period>0,'DO NOT DELETE'!I11=(Access_Period+1)),'DO NOT DELETE'!$AF$11,\"\"))","v":9},{"$f":"IF('DO NOT DELETE'!J11<=Access_Period,'DO NOT DELETE'!J11,IF(AND(Access_Period>0,'DO NOT DELETE'!J11=(Access_Period+1)),'DO NOT DELETE'!$AF$11,\"\"))","v":10},{"$f":"IF('DO NOT DELETE'!K11<=Access_Period,'DO NOT DELETE'!K11,IF(AND(Access_Period>0,'DO NOT DELETE'!K11=(Access_Period+1)),'DO NOT DELETE'!$AF$11,\"\"))","v":11},{"$f":"IF('DO NOT DELETE'!L11<=Access_Period,'DO NOT DELETE'!L11,IF(AND(Access_Period>0,'DO NOT DELETE'!L11=(Access_Period+1)),'DO NOT DELETE'!$AF$11,\"\"))","v":12},{"$f":"IF('DO NOT DELETE'!M11<=Access_Period,'DO NOT DELETE'!M11,IF(AND(Access_Period>0,'DO NOT DELETE'!M11=(Access_Period+1)),'DO NOT DELETE'!$AF$11,\"\"))","v":13},{"$f":"IF('DO NOT DELETE'!N11<=Access_Period,'DO NOT DELETE'!N11,IF(AND(Access_Period>0,'DO NOT DELETE'!N11=(Access_Period+1)),'DO NOT DELETE'!$AF$11,\"\"))","v":14},{"$f":"IF('DO NOT DELETE'!O11<=Access_Period,'DO NOT DELETE'!O11,IF(AND(Access_Period>0,'DO NOT DELETE'!O11=(Access_Period+1)),'DO NOT DELETE'!$AF$11,\"\"))","v":15},{"$f":"IF('DO NOT DELETE'!P11<=Access_Period,'DO NOT DELETE'!P11,IF(AND(Access_Period>0,'DO NOT DELETE'!P11=(Access_Period+1)),'DO NOT DELETE'!$AF$11,\"\"))","v":16},{"$f":"IF('DO NOT DELETE'!Q11<=Access_Period,'DO NOT DELETE'!Q11,IF(AND(Access_Period>0,'DO NOT DELETE'!Q11=(Access_Period+1)),'DO NOT DELETE'!$AF$11,\"\"))","v":17},{"$f":"IF('DO NOT DELETE'!R11<=Access_Period,'DO NOT DELETE'!R11,IF(AND(Access_Period>0,'DO NOT DELETE'!R11=(Access_Period+1)),'DO NOT DELETE'!$AF$11,\"\"))","v":18},{"$f":"IF('DO NOT DELETE'!S11<=Access_Period,'DO NOT DELETE'!S11,IF(AND(Access_Period>0,'DO NOT DELETE'!S11=(Access_Period+1)),'DO NOT DELETE'!$AF$11,\"\"))","v":19},{"$f":"IF('DO NOT DELETE'!T11<=Access_Period,'DO NOT DELETE'!T11,IF(AND(Access_Period>0,'DO NOT DELETE'!T11=(Access_Period+1)),'DO NOT DELETE'!$AF$11,\"\"))","v":20},{"$f":"IF('DO NOT DELETE'!U11<=Access_Period,'DO NOT DELETE'!U11,IF(AND(Access_Period>0,'DO NOT DELETE'!U11=(Access_Period+1)),'DO NOT DELETE'!$AF$11,\"\"))","v":"Rehabilitation"},{"$f":"IF('DO NOT DELETE'!V11<=Access_Period,'DO NOT DELETE'!V11,IF(AND(Access_Period>0,'DO NOT DELETE'!V11=(Access_Period+1)),'DO NOT DELETE'!$AF$11,\"\"))","v":""},{"$f":"IF('DO NOT DELETE'!W11<=Access_Period,'DO NOT DELETE'!W11,IF(AND(Access_Period>0,'DO NOT DELETE'!W11=(Access_Period+1)),'DO NOT DELETE'!$AF$11,\"\"))","v":""},{"$f":"IF('DO NOT DELETE'!X11<=Access_Period,'DO NOT DELETE'!X11,IF(AND(Access_Period>0,'DO NOT DELETE'!X11=(Access_Period+1)),'DO NOT DELETE'!$AF$11,\"\"))","v":""},{"$f":"IF('DO NOT DELETE'!Y11<=Access_Period,'DO NOT DELETE'!Y11,IF(AND(Access_Period>0,'DO NOT DELETE'!Y11=(Access_Period+1)),'DO NOT DELETE'!$AF$11,\"\"))","v":""},{"$f":"IF('DO NOT DELETE'!Z11<=Access_Period,'DO NOT DELETE'!Z11,IF(AND(Access_Period>0,'DO NOT DELETE'!Z11=(Access_Period+1)),'DO NOT DELETE'!$AF$11,\"\"))","v":""},{"$f":"IF('DO NOT DELETE'!AA11<=Access_Period,'DO NOT DELETE'!AA11,IF(AND(Access_Period>0,'DO NOT DELETE'!AA11=(Access_Period+1)),'DO NOT DELETE'!$AF$11,\"\"))","v":""},{"$f":"IF('DO NOT DELETE'!AB11<=Access_Period,'DO NOT DELETE'!AB11,IF(AND(Access_Period>0,'DO NOT DELETE'!AB11=(Access_Period+1)),'DO NOT DELETE'!$AF$11,\"\"))","v":""},{"$f":"IF('DO NOT DELETE'!AC11<=Access_Period,'DO NOT DELETE'!AC11,IF(AND(Access_Period>0,'DO NOT DELETE'!AC11=(Access_Period+1)),'DO NOT DELETE'!$AF$11,\"\"))","v":""},{"$f":"IF('DO NOT DELETE'!AD11<=Access_Period,'DO NOT DELETE'!AD11,IF(AND(Access_Period>0,'DO NOT DELETE'!AD11=(Access_Period+1)),'DO NOT DELETE'!$AF$11,\"\"))","v":""},{"$f":"IF('DO NOT DELETE'!AE11<=Access_Period,'DO NOT DELETE'!AE11,IF(AND(Access_Period>0,'DO NOT DELETE'!AE11=(Access_Period+1)),'DO NOT DELETE'!$AF$11,\"\"))","v":""}]
[null,"1. Land access agreement details"]
[null,null,"How long is your access agreement for? (Maximum is 30 years)","Year",20]
[null,"2. Landholding details"]
[null,null,"What is the total area of your land in hectares? If you have land area in a different unit, use the \"CONVERSION\" worksheet to convert into hectares.","Hectare",200]
[null,null,"What is the estimated value of your land per hectare in nominal terms (ie, including inflation)? If you have land value in a different unit, use the \"CONVERSION\" worksheet to convert into $/hectare.","Dollar per hectare",null,null,15000,null,null,null,18000]
[null,null,"What is the rental value of land as a percentage of land value?","Percent",null,null,0.08,null,null,null,0.09]
{"$rows_left_out":27}
{"sheet":"RESULTS","index":3,"n_rows":106,"n_cols":10,"rows_kept":106,"cut":false,"hidden":false,"merged":[[4,1,4,3],[2,5,2,7],[2,9,2,15],[2,1,2,2],[4,5,4,7],[3,5,3,7]]}
[null,"RESULTS"]
[null,"PART A. Compensation Payments",null,null,null,"PART B. Benefit Payments",null,null,null,"PART C.  Payment Schedule"]
[null,"Please select an option to get an estimate of your compensation.  Select \"Lump-sum Upfront Payment\" to get a single upfront payment. Select \"Annual Payments\" for a series of annual payments.  ",null,null,null,"A schedule of your benefit payments is provided below.  ",null,null,null,"The graph below shows compensation payment schedule over your access agreement period."]
[null,"Payment Structure: "]
[null,"Note: Where the costs of expert advice have been incurred by landholders, the first year compensation is higher due to the inclusion of the reimbursment of the costs of expert advice.",null,null,null,"Note: This model assumes the provision of benefit payments during the production stage of a CSG project.  Benefit payments are not mandatory and gas companies may choose to provide other in-kind benefits.  "]
[{"$f":"MAX(COUNT(B7:B106),COUNT(F7:F106))","v":20},"Beginning of Year","Annual Payment ($Nominal)",null,null,"Beginning of Year","Annual Payment ($Nominal)"]
[1,{"$f":"TRANSPOSE(CALC!D23:AH23)","v":1},{"$f":"TRANSPOSE(CALC!D28:AH28)","v":105100},null,null,{"$f":"TRANSPOSE(CALC!D36:AH36)","v":1},{"$f":"TRANSPOSE(CALC!D37:AH37)","v":""}]
[2,2,32974.25,null,null,2,""]
[3,3,33798.606249999997,null,null,3,""]
[4,4,34643.57140624999,null,null,4,""]
{"$rows_left_out":97}
{"sheet":"CALC","index":4,"n_rows":41,"n_cols":34,"rows_kept":41,"cut":false,"hidden":false,"merged":[]}
[]
[null,"DETAILED CALCULATIONS"]
[null,"Inputs"]
[null,"Beginning of Year","Rehabilitation"]
[null,"Land value",{"$f":"IF(LOOKUP($C$4,INPUT!$G$4:$AK$4,INPUT!$G$9:$AK$9)=\"\",\"\",LOOKUP($C$4,INPUT!$G$4:$AK$4,INPUT!$G$9:$AK$9))","v":""}]
[null,"Rental rate",{"$f":"IF(LOOKUP($C$4,INPUT!$G$4:$AK$4,INPUT!$G$10:$AK$10)=\"\",\"\",LOOKUP($C$4,INPUT!$G$4:$AK$4,INPUT!$G$10:$AK$10))","v":""}]
[null,"Total land area used by gas company",{"$f":"IF(LOOKUP($C$4,INPUT!$G$4:$AK$4,INPUT!$G$13:$AK$13)=\"\",\"\",LOOKUP($C$4,INPUT!$G$4:$AK$4,INPUT!$G$13:$AK$13))","v":""}]
[null,"Severance",{"$f":"IF(LOOKUP($C$4,INPUT!$G$4:$AK$4,INPUT!$G$15:$AK$15)=\"\",\"\",LOOKUP($C$4,INPUT!$G$4:$AK$4,INPUT!$G$15:$AK$15))","v":""}]
[null,"Injurious affections",{"$f":"IF(LOOKUP($C$4,INPUT!$G$4:$AK$4,INPUT!$G$16:$AK$16)=\"\",\"\",LOOKUP($C$4,INPUT!$G$4:$AK$4,INPUT!$G$16:$AK$16))","v":""}]
[]
{"$rows_left_out":32}
{"sheet":"CONVERSION","index":5,"n_rows":9,"n_cols":7,"rows_kept":9,"cut":false,"hidden":false,"merged":[[2,1,2,5]]}
[]
[null,"CONVERSION CALCULATOR"]
[null,"This Compensation Model calculates compensation based on land area in hectares and land value ($) per hectare.  If you have different units for your land area and value, please use the following calculator to convert your figures to hectares."]
[null,"Select your land and valuation unit:",1]
[]
[]
[null,{"$f":" \"Enter land area in \" & CHOOSE(C4,'DO NOT DELETE'!F4,'DO NOT DELETE'!F5,'DO NOT DELETE'!F6,'DO NOT DELETE'!F7)","v":"Enter land area in Square metre"},null,{"$f":"CHOOSE(C4,'DO NOT DELETE'!F4,'DO NOT DELETE'!F5,'DO NOT DELETE'!F6,'DO NOT DELETE'!F7)","v":"Square metre"},null,{"$f":"IF(ISNUMBER(C7),CHOOSE(C4,'DO NOT DELETE'!G4,'DO NOT DELETE'!G5,'DO NOT DELETE'!G6,'DO NOT DELETE'!G7)*C7,\"\")","v":""},"Hectares"]
[]
[null,{"$f":" \"Enter land value in $ per \" & CHOOSE(C4,'DO NOT DELETE'!F4,'DO NOT DELETE'!F5,'DO NOT DELETE'!F6,'DO NOT DELETE'!F7)","v":"Enter land value in $ per Square metre"},null,{"$f":"\"per \" & CHOOSE(C4,'DO NOT DELETE'!F4,'DO NOT DELETE'!F5,'DO NOT DELETE'!F6,'DO NOT DELETE'!F7)","v":"per Square metre"},null,{"$f":"IF(ISNUMBER(C9),C9*(1/CHOOSE(C4,'DO NOT DELETE'!G4,'DO NOT DELETE'!G5,'DO NOT DELETE'!G6,'DO NOT DELETE'!G7)),\"\")","v":""},"per Hectare"]

{"sheet":"DO NOT DELETE","index":6,"n_rows":16,"n_cols":32,"rows_kept":16,"cut":false,"hidden":false,"merged":[[2,1,2,3]]}
[]
["Benefit payment",null,null,null,null,"Conversion Chart"]
["Type","Payment based on",null,null,null,null,"Hectare"]
[null,"(1) Royalty payment","(2) Meeting target production","(3) Gas company provided an estimate of annual benefit payment",null,"Square metre",1E-4]
["Statutory annual royalty payment","Gas company's statutory annual royalty payment  in nominal terms (ie, including inflation)","Amount of money per well a gas company contributes to the incentive fund in the first year of production when meeting a target level of gas production in nominal terms (ie, including inflation)","An estimate of annual benefit payments in the first year of production in nominal terms (ie, including inflation)",null,"Square kilometre",100]
["Producing well meeting the target production","% of royalty gas company contributes to incentive fund","Total number of producing wells in licence area that exceed the production target","  ",null,"Acre",0.40468564223999998]
["Estimated annual benefit payment","Total licence area for production","Total number of eligible landholders in licence area","  ",null,"Square Yard",8.3612735999999998E-5]
[null,null,null,"   "]
[]
["Inputs for periodic update"]
{"$rows_left_out":6}